You are viewing a plain text version of this content. The canonical link for it is here.
Posted to dev@jmeter.apache.org by Apache Jenkins Server <je...@builds.apache.org> on 2023/05/05 11:05:47 UTC
Build failed in Jenkins: JMeter » JMeter s390x #41
See <https://ci-builds.apache.org/job/JMeter/job/JMeter%20s390x/41/display/redirect?page=changes>
Changes:
[Vladimir Sitnikov] chore: fix condition for enableErrorprone so the verification is activated
[Vladimir Sitnikov] chore: add explicit casts from long to double so data loss is visible in the source code
[Vladimir Sitnikov] chore: remove use of deprecated Object#finalize
[Vladimir Sitnikov] chore: execute ErrorProne verifications when running with Java 11+ compiler only
[Vladimir Sitnikov] style: remove redundant method overrides
[Vladimir Sitnikov] style: remove unnecessary default cases in enum switch
[Vladimir Sitnikov] style: replace iterator with enhanced for loop
[Vladimir Sitnikov] style: apply "private method can be static" inspection
[Vladimir Sitnikov] style: run "field may be final" inspection
[Vladimir Sitnikov] style: run "field can be static"
[Vladimir Sitnikov] style: prevent alignment of method parameters via .editorconfig
------------------------------------------
[...truncated 251.68 KB...]
WARN StatusConsoleListener The use of package scanning to locate plugins is deprecated and will be removed in a future release
WARN StatusConsoleListener The use of package scanning to locate plugins is deprecated and will be removed in a future release
Warning: Nashorn engine is planned to be removed from a future JDK release
Creating summariser <summary>
Created the tree successfully using <https://ci-builds.apache.org/job/JMeter/job/JMeter%20s390x/ws/bin/testfiles/Bug62239.jmx>
Starting standalone test @ 2023 May 5 10:58:41 UTC (1683284321931)
Waiting for possible Shutdown/StopTestNow/HeapDump/ThreadDump message on port 4445
Warning: Nashorn engine is planned to be removed from a future JDK release
WARN StatusConsoleListener The use of package scanning to locate plugins is deprecated and will be removed in a future release
WARN StatusConsoleListener The use of package scanning to locate plugins is deprecated and will be removed in a future release
WARN StatusConsoleListener The use of package scanning to locate plugins is deprecated and will be removed in a future release
WARN StatusConsoleListener The use of package scanning to locate plugins is deprecated and will be removed in a future release
summary = 108 in 00:00:00 = 529.4/s Avg: 0 Min: 0 Max: 1 Err: 0 (0.00%)
Tidying up ... @ 2023 May 5 10:58:42 UTC (1683284322262)
... end of run
No errors present in the logfile <https://ci-builds.apache.org/job/JMeter/job/JMeter%20s390x/ws/bin/Bug62239.log> (the file is empty)
> Task :src:dist-check:batchFTP_TESTS
WARN StatusConsoleListener The use of package scanning to locate plugins is deprecated and will be removed in a future release
WARN StatusConsoleListener The use of package scanning to locate plugins is deprecated and will be removed in a future release
WARN StatusConsoleListener The use of package scanning to locate plugins is deprecated and will be removed in a future release
WARN StatusConsoleListener The use of package scanning to locate plugins is deprecated and will be removed in a future release
Creating summariser <summary>
Created the tree successfully using <https://ci-builds.apache.org/job/JMeter/job/JMeter%20s390x/ws/bin/testfiles/FTP_TESTS.jmx>
Starting standalone test @ 2023 May 5 10:59:43 UTC (1683284383234)
Waiting for possible Shutdown/StopTestNow/HeapDump/ThreadDump message on port 4445
Warning: Nashorn engine is planned to be removed from a future JDK release
WARN StatusConsoleListener The use of package scanning to locate plugins is deprecated and will be removed in a future release
WARN StatusConsoleListener The use of package scanning to locate plugins is deprecated and will be removed in a future release
WARN StatusConsoleListener The use of package scanning to locate plugins is deprecated and will be removed in a future release
WARN StatusConsoleListener The use of package scanning to locate plugins is deprecated and will be removed in a future release
summary = 6 in 00:00:02 = 3.7/s Avg: 95 Min: 4 Max: 507 Err: 0 (0.00%)
Tidying up ... @ 2023 May 5 10:59:45 UTC (1683284385123)
... end of run
No errors present in the logfile <https://ci-builds.apache.org/job/JMeter/job/JMeter%20s390x/ws/bin/FTP_TESTS.log> (the file is empty)
> Task :src:dist-check:batchHTMLParserTestFile_2
WARN StatusConsoleListener The use of package scanning to locate plugins is deprecated and will be removed in a future release
WARN StatusConsoleListener The use of package scanning to locate plugins is deprecated and will be removed in a future release
WARN StatusConsoleListener The use of package scanning to locate plugins is deprecated and will be removed in a future release
WARN StatusConsoleListener The use of package scanning to locate plugins is deprecated and will be removed in a future release
Creating summariser <summary>
Created the tree successfully using <https://ci-builds.apache.org/job/JMeter/job/JMeter%20s390x/ws/bin/testfiles/HTMLParserTestFile_2.jmx>
Starting standalone test @ 2023 May 5 11:00:46 UTC (1683284446118)
Waiting for possible Shutdown/StopTestNow/HeapDump/ThreadDump message on port 4445
Warning: Nashorn engine is planned to be removed from a future JDK release
summary = 1 in 00:00:00 = 10.4/s Avg: 48 Min: 48 Max: 48 Err: 0 (0.00%)
Tidying up ... @ 2023 May 5 11:00:46 UTC (1683284446367)
... end of run
No errors present in the logfile <https://ci-builds.apache.org/job/JMeter/job/JMeter%20s390x/ws/bin/HTMLParserTestFile_2.log> (the file is empty)
> Task :src:dist-check:batchHttp4ImplDigestAuth SKIPPED
> Task :src:dist-check:batchHttp4ImplPreemptiveBasicAuth
WARN StatusConsoleListener The use of package scanning to locate plugins is deprecated and will be removed in a future release
WARN StatusConsoleListener The use of package scanning to locate plugins is deprecated and will be removed in a future release
WARN StatusConsoleListener The use of package scanning to locate plugins is deprecated and will be removed in a future release
WARN StatusConsoleListener The use of package scanning to locate plugins is deprecated and will be removed in a future release
Creating summariser <summary>
Created the tree successfully using <https://ci-builds.apache.org/job/JMeter/job/JMeter%20s390x/ws/bin/testfiles/Http4ImplPreemptiveBasicAuth.jmx>
Starting standalone test @ 2023 May 5 11:01:48 UTC (1683284508364)
Waiting for possible Shutdown/StopTestNow/HeapDump/ThreadDump message on port 4445
Warning: Nashorn engine is planned to be removed from a future JDK release
WARN StatusConsoleListener The use of package scanning to locate plugins is deprecated and will be removed in a future release
WARN StatusConsoleListener The use of package scanning to locate plugins is deprecated and will be removed in a future release
WARN StatusConsoleListener The use of package scanning to locate plugins is deprecated and will be removed in a future release
WARN StatusConsoleListener The use of package scanning to locate plugins is deprecated and will be removed in a future release
summary = 12 in 00:00:04 = 2.7/s Avg: 55 Min: 6 Max: 329 Err: 0 (0.00%)
Tidying up ... @ 2023 May 5 11:01:53 UTC (1683284513499)
... end of run
No errors present in the logfile <https://ci-builds.apache.org/job/JMeter/job/JMeter%20s390x/ws/bin/Http4ImplPreemptiveBasicAuth.log> (the file is empty)
> Task :src:dist-check:batchHttp4ImplPreemptiveBasicAuthJava SKIPPED
> Task :src:dist-check:batchJDBC_TESTS
WARN StatusConsoleListener The use of package scanning to locate plugins is deprecated and will be removed in a future release
WARN StatusConsoleListener The use of package scanning to locate plugins is deprecated and will be removed in a future release
WARN StatusConsoleListener The use of package scanning to locate plugins is deprecated and will be removed in a future release
WARN StatusConsoleListener The use of package scanning to locate plugins is deprecated and will be removed in a future release
Creating summariser <summary>
Created the tree successfully using <https://ci-builds.apache.org/job/JMeter/job/JMeter%20s390x/ws/bin/testfiles/JDBC_TESTS.jmx>
Starting standalone test @ 2023 May 5 11:02:54 UTC (1683284574702)
Waiting for possible Shutdown/StopTestNow/HeapDump/ThreadDump message on port 4445
Warning: Nashorn engine is planned to be removed from a future JDK release
WARN StatusConsoleListener The use of package scanning to locate plugins is deprecated and will be removed in a future release
WARN StatusConsoleListener The use of package scanning to locate plugins is deprecated and will be removed in a future release
WARN StatusConsoleListener The use of package scanning to locate plugins is deprecated and will be removed in a future release
WARN StatusConsoleListener The use of package scanning to locate plugins is deprecated and will be removed in a future release
summary = 27 in 00:00:01 = 35.2/s Avg: 12 Min: 0 Max: 327 Err: 0 (0.00%)
Tidying up ... @ 2023 May 5 11:02:55 UTC (1683284575931)
... end of run
WARNING: the task was configured to ignore errors in the output log
Logfile contents (errors during the test, see <https://ci-builds.apache.org/job/JMeter/job/JMeter%20s390x/ws/bin/JDBC_TESTS.log)>:
2023-05-05 11:02:55,916 ERROR o.a.j.t.JMeterThread: Error while processing sampler: 'JDBC_With_Failing_PreProcessor'.
java.lang.IllegalArgumentException: Name for DataSoure must not be empty in JDBC PreProcessor
at org.apache.jmeter.protocol.jdbc.processor.AbstractJDBCProcessor.process(AbstractJDBCProcessor.java:44) ~[ApacheJMeter_jdbc.jar:5.5.1-SNAPSHOT]
at org.apache.jmeter.protocol.jdbc.processor.JDBCPreProcessor.process(JDBCPreProcessor.java:34) ~[ApacheJMeter_jdbc.jar:5.5.1-SNAPSHOT]
at org.apache.jmeter.threads.JMeterThread.runPreProcessors(JMeterThread.java:978) ~[ApacheJMeter_core.jar:5.5.1-SNAPSHOT]
at org.apache.jmeter.threads.JMeterThread.executeSamplePackage(JMeterThread.java:561) ~[ApacheJMeter_core.jar:5.5.1-SNAPSHOT]
at org.apache.jmeter.threads.JMeterThread.processSampler(JMeterThread.java:501) [ApacheJMeter_core.jar:5.5.1-SNAPSHOT]
at org.apache.jmeter.threads.JMeterThread.run(JMeterThread.java:268) [ApacheJMeter_core.jar:5.5.1-SNAPSHOT]
at java.lang.Thread.run(Thread.java:829) [?:?]
2023-05-05 11:02:55,918 ERROR o.a.j.t.JMeterThread: Error while processing sampler: 'JDBC_With_Failing_PostProcessor'.
java.lang.IllegalArgumentException: Name for DataSoure must not be empty in JDBC PostProcessor
at org.apache.jmeter.protocol.jdbc.processor.AbstractJDBCProcessor.process(AbstractJDBCProcessor.java:44) ~[ApacheJMeter_jdbc.jar:5.5.1-SNAPSHOT]
at org.apache.jmeter.protocol.jdbc.processor.JDBCPostProcessor.process(JDBCPostProcessor.java:34) ~[ApacheJMeter_jdbc.jar:5.5.1-SNAPSHOT]
at org.apache.jmeter.threads.JMeterThread.runPostProcessors(JMeterThread.java:968) ~[ApacheJMeter_core.jar:5.5.1-SNAPSHOT]
at org.apache.jmeter.threads.JMeterThread.executeSamplePackage(JMeterThread.java:585) ~[ApacheJMeter_core.jar:5.5.1-SNAPSHOT]
at org.apache.jmeter.threads.JMeterThread.processSampler(JMeterThread.java:501) [ApacheJMeter_core.jar:5.5.1-SNAPSHOT]
at org.apache.jmeter.threads.JMeterThread.run(JMeterThread.java:268) [ApacheJMeter_core.jar:5.5.1-SNAPSHOT]
at java.lang.Thread.run(Thread.java:829) [?:?]
2023-05-05 11:02:55,919 WARN o.a.j.p.j.p.AbstractJDBCProcessor: SQL Problem in JDBC PreProcessor: java.sql.SQLSyntaxErrorException: unexpected token: USERS
2023-05-05 11:02:55,926 WARN o.a.j.p.j.p.AbstractJDBCProcessor: SQL Problem in JDBC PostProcessor: java.sql.SQLSyntaxErrorException: unexpected token: USERS
> Task :src:dist-check:batchJMS_TESTS
WARN StatusConsoleListener The use of package scanning to locate plugins is deprecated and will be removed in a future release
WARN StatusConsoleListener The use of package scanning to locate plugins is deprecated and will be removed in a future release
WARN StatusConsoleListener The use of package scanning to locate plugins is deprecated and will be removed in a future release
WARN StatusConsoleListener The use of package scanning to locate plugins is deprecated and will be removed in a future release
Creating summariser <summary>
Created the tree successfully using <https://ci-builds.apache.org/job/JMeter/job/JMeter%20s390x/ws/bin/testfiles/JMS_TESTS.jmx>
Starting standalone test @ 2023 May 5 11:03:58 UTC (1683284638694)
Waiting for possible Shutdown/StopTestNow/HeapDump/ThreadDump message on port 4445
Warning: Nashorn engine is planned to be removed from a future JDK release
WARN StatusConsoleListener The use of package scanning to locate plugins is deprecated and will be removed in a future release
WARN StatusConsoleListener The use of package scanning to locate plugins is deprecated and will be removed in a future release
WARN StatusConsoleListener The use of package scanning to locate plugins is deprecated and will be removed in a future release
WARN StatusConsoleListener The use of package scanning to locate plugins is deprecated and will be removed in a future release
summary + 1 in 00:00:02 = 0.4/s Avg: 2389 Min: 2389 Max: 2389 Err: 0 (0.00%) Active: 1 Started: 1 Finished: 0
summary + 23 in 00:00:30 = 0.8/s Avg: 539 Min: 0 Max: 3006 Err: 0 (0.00%) Active: 1 Started: 5 Finished: 4
summary = 24 in 00:00:33 = 0.7/s Avg: 616 Min: 0 Max: 3006 Err: 0 (0.00%)
summary + 3 in 00:00:04 = 0.8/s Avg: 1035 Min: 0 Max: 3000 Err: 0 (0.00%) Active: 0 Started: 1 Finished: 1
summary = 27 in 00:00:37 = 0.7/s Avg: 663 Min: 0 Max: 3006 Err: 0 (0.00%)
Tidying up ... @ 2023 May 5 11:04:36 UTC (1683284676514)
... end of run
Logfile contents (errors during the test, see <https://ci-builds.apache.org/job/JMeter/job/JMeter%20s390x/ws/bin/JMS_TESTS.log)>:
2023-05-05 11:04:06,247 WARN o.a.a.ActiveMQSessionExecutor: Received a message on a connection which is not yet started. Have you forgotten to call Connection.start()? Connection: ActiveMQConnection {id=ID:jenkins-s390x-1-46531-1683284642206-30:1,clientId=ID:jenkins-s390x-1-46531-1683284642206-29:1,started=false} Received: MessageDispatch {commandId = 0, responseRequired = false, consumerId = ID:jenkins-s390x-1-46531-1683284642206-30:1:1:1, destination = queue://requestQueue0-tmp, message = ActiveMQTextMessage {commandId = 7, responseRequired = true, messageId = ID:jenkins-s390x-1-46531-1683284642206-6:1:1:1:1, originalDestination = null, originalTransactionId = null, producerId = ID:jenkins-s390x-1-46531-1683284642206-6:1:1:1, destination = queue://requestQueue0-tmp, transactionId = null, expiration = 0, timestamp = 1683284645502, arrival = 0, brokerInTime = 1683284645503, brokerOutTime = 1683284645870, correlationId = null, replyTo = temp-queue://ID:jenkins-s390x-1-46531-1683284642206-6:1:1, persistent = true, type = null, priority = 4, groupID = null, groupSequence = 0, targetConsumerId = null, compressed = false, userID = null, content = org.apache.activemq.util.ByteSequence@5a07d256, marshalledProperties = null, dataStructure = null, redeliveryCounter = 0, size = 0, properties = null, readOnlyProperties = true, readOnlyBody = true, droppable = false, jmsXGroupFirstForConsumer = false, text = Test}, redeliveryCounter = 0}
> Task :src:dist-check:batchJMS_TESTS FAILED
checksum-dependency elapsed time: 4335ms, configurations processed: 64 (add -PchecksumTimingsPrint to print detailed timings)
checksum-dependency elapsed time: 14702ms, configurations processed: 363 (add -PchecksumTimingsPrint to print detailed timings)
Build [0;1mjmeter [0;1;31mFAILURE[0;1m[0m reason:
Execution [0;1;31mfailed[0m for task '[0;1m:src:dist-check:batchJMS_TESTS[0m':
Failures detected while testing <https://ci-builds.apache.org/job/JMeter/job/JMeter%20s390x/ws/bin/testfiles/JMS_TESTS.jmx>: [errors in JMS_TESTS.log]
at org.apache.jmeter.buildtools.batchtest.BatchTest.exec(BatchTest.kt:186)
[0;0;90mat org.gradle.internal.reflect.JavaMethod.invoke(JavaMethod.java:125)
[0m [0;0;90mat org.gradle.api.internal.project.taskfactory.StandardTaskAction.doExecute(StandardTaskAction.java:58)
[0m [0;0;90mat org.gradle.api.internal.project.taskfactory.StandardTaskAction.execute(StandardTaskAction.java:51)
[0m [0;0;90mat org.gradle.api.internal.project.taskfactory.StandardTaskAction.execute(StandardTaskAction.java:29)
[0m [0;0;90mat org.gradle.api.internal.tasks.execution.TaskExecution$3.run(TaskExecution.java:242)
[0m [0;0;90mat org.gradle.internal.operations.DefaultBuildOperationRunner$1.execute(DefaultBuildOperationRunner.java:29)
[0m [0;0;90mat org.gradle.internal.operations.DefaultBuildOperationRunner$1.execute(DefaultBuildOperationRunner.java:26)
[0m [0;0;90mat org.gradle.internal.operations.DefaultBuildOperationRunner$2.execute(DefaultBuildOperationRunner.java:66)
[0m [0;0;90mat org.gradle.internal.operations.DefaultBuildOperationRunner$2.execute(DefaultBuildOperationRunner.java:59)
[0m [0;0;90mat org.gradle.internal.operations.DefaultBuildOperationRunner.execute(DefaultBuildOperationRunner.java:157)
[0m [0;0;90mat org.gradle.internal.operations.DefaultBuildOperationRunner.execute(DefaultBuildOperationRunner.java:59)
[0m [0;0;90mat org.gradle.internal.operations.DefaultBuildOperationRunner.run(DefaultBuildOperationRunner.java:47)
[0m [0;0;90mat org.gradle.internal.operations.DefaultBuildOperationExecutor.run(DefaultBuildOperationExecutor.java:68)
[0m [0;0;90mat org.gradle.api.internal.tasks.execution.TaskExecution.executeAction(TaskExecution.java:227)
[0m [0;0;90mat org.gradle.api.internal.tasks.execution.TaskExecution.executeActions(TaskExecution.java:210)
[0m [0;0;90mat org.gradle.api.internal.tasks.execution.TaskExecution.executeWithPreviousOutputFiles(TaskExecution.java:193)
[0m [0;0;90mat org.gradle.api.internal.tasks.execution.TaskExecution.execute(TaskExecution.java:166)
[0m [0;0;90mat org.gradle.internal.execution.steps.ExecuteStep.executeInternal(ExecuteStep.java:105)
[0m [0;0;90mat org.gradle.internal.execution.steps.ExecuteStep.access$000(ExecuteStep.java:44)
[0m [0;0;90mat org.gradle.internal.execution.steps.ExecuteStep$1.call(ExecuteStep.java:59)
[0m [0;0;90mat org.gradle.internal.execution.steps.ExecuteStep$1.call(ExecuteStep.java:56)
[0m [0;0;90mat org.gradle.internal.operations.DefaultBuildOperationRunner$CallableBuildOperationWorker.execute(DefaultBuildOperationRunner.java:204)
[0m [0;0;90mat org.gradle.internal.operations.DefaultBuildOperationRunner$CallableBuildOperationWorker.execute(DefaultBuildOperationRunner.java:199)
[0m [0;0;90mat org.gradle.internal.operations.DefaultBuildOperationRunner$2.execute(DefaultBuildOperationRunner.java:66)
[0m [0;0;90mat org.gradle.internal.operations.DefaultBuildOperationRunner$2.execute(DefaultBuildOperationRunner.java:59)
[0m [0;0;90mat org.gradle.internal.operations.DefaultBuildOperationRunner.execute(DefaultBuildOperationRunner.java:157)
[0m [0;0;90mat org.gradle.internal.operations.DefaultBuildOperationRunner.execute(DefaultBuildOperationRunner.java:59)
[0m [0;0;90mat org.gradle.internal.operations.DefaultBuildOperationRunner.call(DefaultBuildOperationRunner.java:53)
[0m [0;0;90mat org.gradle.internal.operations.DefaultBuildOperationExecutor.call(DefaultBuildOperationExecutor.java:73)
[0m [0;0;90mat org.gradle.internal.execution.steps.ExecuteStep.execute(ExecuteStep.java:56)
[0m [0;0;90mat org.gradle.internal.execution.steps.ExecuteStep.execute(ExecuteStep.java:44)
[0m [0;0;90mat org.gradle.internal.execution.steps.RemovePreviousOutputsStep.execute(RemovePreviousOutputsStep.java:67)
[0m [0;0;90mat org.gradle.internal.execution.steps.RemovePreviousOutputsStep.execute(RemovePreviousOutputsStep.java:37)
[0m [0;0;90mat org.gradle.internal.execution.steps.CancelExecutionStep.execute(CancelExecutionStep.java:41)
[0m [0;0;90mat org.gradle.internal.execution.steps.TimeoutStep.executeWithoutTimeout(TimeoutStep.java:74)
[0m [0;0;90mat org.gradle.internal.execution.steps.TimeoutStep.execute(TimeoutStep.java:55)
[0m [0;0;90mat org.gradle.internal.execution.steps.CreateOutputsStep.execute(CreateOutputsStep.java:50)
[0m [0;0;90mat org.gradle.internal.execution.steps.CreateOutputsStep.execute(CreateOutputsStep.java:28)
[0m [0;0;90mat org.gradle.internal.execution.steps.CaptureStateAfterExecutionStep.executeDelegateBroadcastingChanges(CaptureStateAfterExecutionStep.java:100)
[0m [0;0;90mat org.gradle.internal.execution.steps.CaptureStateAfterExecutionStep.execute(CaptureStateAfterExecutionStep.java:72)
[0m [0;0;90mat org.gradle.internal.execution.steps.CaptureStateAfterExecutionStep.execute(CaptureStateAfterExecutionStep.java:50)
[0m [0;0;90mat org.gradle.internal.execution.steps.ResolveInputChangesStep.execute(ResolveInputChangesStep.java:40)
[0m [0;0;90mat org.gradle.internal.execution.steps.ResolveInputChangesStep.execute(ResolveInputChangesStep.java:29)
[0m [0;0;90mat org.gradle.internal.execution.steps.BuildCacheStep.executeWithoutCache(BuildCacheStep.java:166)
[0m [0;0;90mat org.gradle.internal.execution.steps.BuildCacheStep.lambda$execute$1(BuildCacheStep.java:70)
[0m [0;0;90mat org.gradle.internal.Either$Right.fold(Either.java:175)
[0m [0;0;90mat org.gradle.internal.execution.caching.CachingState.fold(CachingState.java:59)
[0m [0;0;90mat org.gradle.internal.execution.steps.BuildCacheStep.execute(BuildCacheStep.java:68)
[0m [0;0;90mat org.gradle.internal.execution.steps.BuildCacheStep.execute(BuildCacheStep.java:46)
[0m [0;0;90mat org.gradle.internal.execution.steps.StoreExecutionStateStep.execute(StoreExecutionStateStep.java:36)
[0m [0;0;90mat org.gradle.internal.execution.steps.StoreExecutionStateStep.execute(StoreExecutionStateStep.java:25)
[0m [0;0;90mat org.gradle.internal.execution.steps.RecordOutputsStep.execute(RecordOutputsStep.java:36)
[0m [0;0;90mat org.gradle.internal.execution.steps.RecordOutputsStep.execute(RecordOutputsStep.java:22)
[0m [0;0;90mat org.gradle.internal.execution.steps.SkipUpToDateStep.executeBecause(SkipUpToDateStep.java:91)
[0m [0;0;90mat org.gradle.internal.execution.steps.SkipUpToDateStep.lambda$execute$2(SkipUpToDateStep.java:55)
[0m [0;0;90mat org.gradle.internal.execution.steps.SkipUpToDateStep.execute(SkipUpToDateStep.java:55)
[0m [0;0;90mat org.gradle.internal.execution.steps.SkipUpToDateStep.execute(SkipUpToDateStep.java:37)
[0m [0;0;90mat org.gradle.internal.execution.steps.ResolveChangesStep.execute(ResolveChangesStep.java:65)
[0m [0;0;90mat org.gradle.internal.execution.steps.ResolveChangesStep.execute(ResolveChangesStep.java:36)
[0m [0;0;90mat org.gradle.internal.execution.steps.legacy.MarkSnapshottingInputsFinishedStep.execute(MarkSnapshottingInputsFinishedStep.java:37)
[0m [0;0;90mat org.gradle.internal.execution.steps.legacy.MarkSnapshottingInputsFinishedStep.execute(MarkSnapshottingInputsFinishedStep.java:27)
[0m [0;0;90mat org.gradle.internal.execution.steps.ResolveCachingStateStep.execute(ResolveCachingStateStep.java:76)
[0m [0;0;90mat org.gradle.internal.execution.steps.ResolveCachingStateStep.execute(ResolveCachingStateStep.java:37)
[0m [0;0;90mat org.gradle.internal.execution.steps.ValidateStep.execute(ValidateStep.java:94)
[0m [0;0;90mat org.gradle.internal.execution.steps.ValidateStep.execute(ValidateStep.java:49)
[0m [0;0;90mat org.gradle.internal.execution.steps.CaptureStateBeforeExecutionStep.execute(CaptureStateBeforeExecutionStep.java:71)
[0m [0;0;90mat org.gradle.internal.execution.steps.CaptureStateBeforeExecutionStep.execute(CaptureStateBeforeExecutionStep.java:45)
[0m [0;0;90mat org.gradle.internal.execution.steps.SkipEmptyWorkStep.executeWithNonEmptySources(SkipEmptyWorkStep.java:177)
[0m [0;0;90mat org.gradle.internal.execution.steps.SkipEmptyWorkStep.execute(SkipEmptyWorkStep.java:81)
[0m [0;0;90mat org.gradle.internal.execution.steps.SkipEmptyWorkStep.execute(SkipEmptyWorkStep.java:53)
[0m [0;0;90mat org.gradle.internal.execution.steps.RemoveUntrackedExecutionStateStep.execute(RemoveUntrackedExecutionStateStep.java:32)
[0m [0;0;90mat org.gradle.internal.execution.steps.RemoveUntrackedExecutionStateStep.execute(RemoveUntrackedExecutionStateStep.java:21)
[0m [0;0;90mat org.gradle.internal.execution.steps.legacy.MarkSnapshottingInputsStartedStep.execute(MarkSnapshottingInputsStartedStep.java:38)
[0m [0;0;90mat org.gradle.internal.execution.steps.LoadPreviousExecutionStateStep.execute(LoadPreviousExecutionStateStep.java:36)
[0m [0;0;90mat org.gradle.internal.execution.steps.LoadPreviousExecutionStateStep.execute(LoadPreviousExecutionStateStep.java:23)
[0m [0;0;90mat org.gradle.internal.execution.steps.CleanupStaleOutputsStep.execute(CleanupStaleOutputsStep.java:75)
[0m [0;0;90mat org.gradle.internal.execution.steps.CleanupStaleOutputsStep.execute(CleanupStaleOutputsStep.java:41)
[0m [0;0;90mat org.gradle.internal.execution.steps.AssignWorkspaceStep.lambda$execute$0(AssignWorkspaceStep.java:32)
[0m [0;0;90mat org.gradle.api.internal.tasks.execution.TaskExecution$4.withWorkspace(TaskExecution.java:287)
[0m [0;0;90mat org.gradle.internal.execution.steps.AssignWorkspaceStep.execute(AssignWorkspaceStep.java:30)
[0m [0;0;90mat org.gradle.internal.execution.steps.AssignWorkspaceStep.execute(AssignWorkspaceStep.java:21)
[0m [0;0;90mat org.gradle.internal.execution.steps.IdentityCacheStep.execute(IdentityCacheStep.java:37)
[0m [0;0;90mat org.gradle.internal.execution.steps.IdentityCacheStep.execute(IdentityCacheStep.java:27)
[0m [0;0;90mat org.gradle.internal.execution.steps.IdentifyStep.execute(IdentifyStep.java:47)
[0m [0;0;90mat org.gradle.internal.execution.steps.IdentifyStep.execute(IdentifyStep.java:34)
[0m
FAILURE: Build failed with an exception.
* What went wrong:
Execution failed for task ':src:dist-check:batchJMS_TESTS'.
> Failures detected while testing <https://ci-builds.apache.org/job/JMeter/job/JMeter%20s390x/ws/bin/testfiles/JMS_TESTS.jmx>: [errors in JMS_TESTS.log]
* Try:
> Run with --stacktrace option to get the stack trace.
> Run with --info or --debug option to get more log output.
* Get more help at https://help.gradle.org
BUILD FAILED in 17m 53s
329 actionable tasks: 243 executed, 2 from cache, 84 up-to-date
Build step 'Invoke Gradle script' changed build result to FAILURE
Build step 'Invoke Gradle script' marked build as failure
Jenkins build is back to normal : JMeter » JMeter s390x #43
Posted by Apache Jenkins Server <je...@builds.apache.org>.
See <https://ci-builds.apache.org/job/JMeter/job/JMeter%20s390x/43/display/redirect?page=changes>
Build failed in Jenkins: JMeter » JMeter s390x #42
Posted by Apache Jenkins Server <je...@builds.apache.org>.
See <https://ci-builds.apache.org/job/JMeter/job/JMeter%20s390x/42/display/redirect?page=changes>
Changes:
[Vladimir Sitnikov] chore: update xalan:xalan to 2.7.3
[Felix Schumacher] Use parameter to make junit tests shorter
------------------------------------------
[...truncated 304.94 KB...]
-<sample s="true" lb="If Test C1=1 C2=5 C3=15" rc="200" rm="OK" dt="text" by="0" sc="1" ec="0" ng="1" na="1">
+<sample s="true" lb="If Test C1=2 C2=5 C3=15" rc="200" rm="OK" dt="text" by="0" sc="1" ec="0" ng="2" na="2">
<responseHeader class="java.lang.String"></responseHeader>
<requestHeader class="java.lang.String"></requestHeader>
<responseData class="java.lang.String"></responseData>
<responseFile class="java.lang.String"></responseFile>
</sample>
-<sample s="true" lb="Loop3 C1=1 C2=5 C3=15" rc="200" rm="OK" dt="text" by="0" sc="1" ec="0" ng="1" na="1">
+<sample s="true" lb="Loop3 C1=2 C2=5 C3=15" rc="200" rm="OK" dt="text" by="0" sc="1" ec="0" ng="2" na="2">
<responseHeader class="java.lang.String"></responseHeader>
<requestHeader class="java.lang.String"></requestHeader>
<responseData class="java.lang.String"></responseData>
<responseFile class="java.lang.String"></responseFile>
</sample>
-<sample s="true" lb="Module" rc="200" rm="OK" dt="text" by="0" sc="1" ec="0" ng="1" na="1">
+<sample s="true" lb="Module" rc="200" rm="OK" dt="text" by="0" sc="1" ec="0" ng="2" na="2">
<responseHeader class="java.lang.String"></responseHeader>
<requestHeader class="java.lang.String"></requestHeader>
<responseData class="java.lang.String"></responseData>
<responseFile class="java.lang.String"></responseFile>
</sample>
-<sample s="true" lb="Loop3 C1=1 C2=5 C3=15" rc="200" rm="OK" dt="text" by="0" sc="1" ec="0" ng="1" na="1">
+<sample s="true" lb="Loop3 C1=2 C2=5 C3=15" rc="200" rm="OK" dt="text" by="0" sc="1" ec="0" ng="2" na="2">
<responseHeader class="java.lang.String"></responseHeader>
<requestHeader class="java.lang.String"></requestHeader>
<responseData class="java.lang.String"></responseData>
<responseFile class="java.lang.String"></responseFile>
</sample>
-<sample s="true" lb="Module" rc="200" rm="OK" dt="text" by="0" sc="1" ec="0" ng="1" na="1">
+<sample s="true" lb="Module" rc="200" rm="OK" dt="text" by="0" sc="1" ec="0" ng="2" na="2">
<responseHeader class="java.lang.String"></responseHeader>
<requestHeader class="java.lang.String"></requestHeader>
<responseData class="java.lang.String"></responseData>
<responseFile class="java.lang.String"></responseFile>
</sample>
-<sample s="true" lb="Loop3 C1=1 C2=5 C3=15" rc="200" rm="OK" dt="text" by="0" sc="1" ec="0" ng="1" na="1">
+<sample s="true" lb="Loop3 C1=2 C2=5 C3=15" rc="200" rm="OK" dt="text" by="0" sc="1" ec="0" ng="2" na="2">
<responseHeader class="java.lang.String"></responseHeader>
<requestHeader class="java.lang.String"></requestHeader>
<responseData class="java.lang.String"></responseData>
<responseFile class="java.lang.String"></responseFile>
</sample>
-<sample s="true" lb="Module" rc="200" rm="OK" dt="text" by="0" sc="1" ec="0" ng="1" na="1">
+<sample s="true" lb="Module" rc="200" rm="OK" dt="text" by="0" sc="1" ec="0" ng="2" na="2">
<responseHeader class="java.lang.String"></responseHeader>
<requestHeader class="java.lang.String"></requestHeader>
<responseData class="java.lang.String"></responseData>
<responseFile class="java.lang.String"></responseFile>
</sample>
-<sample s="false" lb="Java If once 1" rc="" rm="" dt="text" by="0" sc="1" ec="1" ng="1" na="1">
+<sample s="false" lb="Java If once 1" rc="" rm="" dt="text" by="0" sc="1" ec="1" ng="2" na="2">
<responseHeader class="java.lang.String"></responseHeader>
<requestHeader class="java.lang.String"></requestHeader>
<responseData class="java.lang.String"></responseData>
<responseFile class="java.lang.String"></responseFile>
</sample>
-<sample s="true" lb="Java If once 2" rc="200" rm="OK" dt="text" by="0" sc="1" ec="0" ng="1" na="1">
+<sample s="true" lb="Java If once 2" rc="200" rm="OK" dt="text" by="0" sc="1" ec="0" ng="2" na="2">
<responseHeader class="java.lang.String"></responseHeader>
<requestHeader class="java.lang.String"></requestHeader>
<responseData class="java.lang.String"></responseData>
<responseFile class="java.lang.String"></responseFile>
</sample>
-<sample s="false" lb="Java If all 1" rc="" rm="" dt="text" by="0" sc="1" ec="1" ng="1" na="1">
+<sample s="false" lb="Java If all 1" rc="" rm="" dt="text" by="0" sc="1" ec="1" ng="2" na="2">
<responseHeader class="java.lang.String"></responseHeader>
<requestHeader class="java.lang.String"></requestHeader>
<responseData class="java.lang.String"></responseData>
<responseFile class="java.lang.String"></responseFile>
</sample>
-<sample s="true" lb="Java OK" rc="200" rm="OK" dt="text" by="0" sc="1" ec="0" ng="1" na="1">
+<sample s="true" lb="Java OK" rc="200" rm="OK" dt="text" by="0" sc="1" ec="0" ng="2" na="2">
<responseHeader class="java.lang.String"></responseHeader>
<requestHeader class="java.lang.String"></requestHeader>
<responseData class="java.lang.String"></responseData>
<responseFile class="java.lang.String"></responseFile>
</sample>
-<sample s="false" lb="Java If once 1" rc="" rm="" dt="text" by="0" sc="1" ec="1" ng="1" na="1">
+<sample s="false" lb="Java If once 1" rc="" rm="" dt="text" by="0" sc="1" ec="1" ng="2" na="2">
<responseHeader class="java.lang.String"></responseHeader>
<requestHeader class="java.lang.String"></requestHeader>
<responseData class="java.lang.String"></responseData>
<responseFile class="java.lang.String"></responseFile>
</sample>
-<sample s="true" lb="Java If once 2" rc="200" rm="OK" dt="text" by="0" sc="1" ec="0" ng="1" na="1">
+<sample s="true" lb="Java If once 2" rc="200" rm="OK" dt="text" by="0" sc="1" ec="0" ng="2" na="2">
<responseHeader class="java.lang.String"></responseHeader>
<requestHeader class="java.lang.String"></requestHeader>
<responseData class="java.lang.String"></responseData>
<responseFile class="java.lang.String"></responseFile>
</sample>
-<sample s="false" lb="Java If all 1" rc="" rm="" dt="text" by="0" sc="1" ec="1" ng="1" na="1">
+<sample s="false" lb="Java If all 1" rc="" rm="" dt="text" by="0" sc="1" ec="1" ng="2" na="2">
<responseHeader class="java.lang.String"></responseHeader>
<requestHeader class="java.lang.String"></requestHeader>
<responseData class="java.lang.String"></responseData>
<responseFile class="java.lang.String"></responseFile>
</sample>
-<sample s="true" lb="Java OK" rc="200" rm="OK" dt="text" by="0" sc="1" ec="0" ng="1" na="1">
+<sample s="true" lb="Java OK" rc="200" rm="OK" dt="text" by="0" sc="1" ec="0" ng="2" na="2">
<responseHeader class="java.lang.String"></responseHeader>
<requestHeader class="java.lang.String"></requestHeader>
<responseData class="java.lang.String"></responseData>
<responseFile class="java.lang.String"></responseFile>
</sample>
-<sample s="true" lb="Java 1 C1=2" rc="200" rm="OK" dt="text" by="10" sc="1" ec="0" ng="1" na="1">
+<sample s="true" lb="Java 1 C1=2" rc="200" rm="OK" dt="text" by="10" sc="1" ec="0" ng="2" na="2">
<responseHeader class="java.lang.String"></responseHeader>
<requestHeader class="java.lang.String"></requestHeader>
<responseData class="java.lang.String">ResultData</responseData>
<responseFile class="java.lang.String"></responseFile>
<samplerData class="java.lang.String">SamplerData</samplerData>
</sample>
-<sample s="true" lb="Java 1 C1=2" rc="200" rm="OK" dt="text" by="10" sc="1" ec="0" ng="1" na="1">
+<sample s="true" lb="Java 1 C1=2" rc="200" rm="OK" dt="text" by="10" sc="1" ec="0" ng="2" na="2">
<responseHeader class="java.lang.String"></responseHeader>
<requestHeader class="java.lang.String"></requestHeader>
<responseData class="java.lang.String">ResultData</responseData>
<responseFile class="java.lang.String"></responseFile>
<samplerData class="java.lang.String">SamplerData</samplerData>
</sample>
-<sample s="true" lb="Java 1 C1=2" rc="200" rm="OK" dt="text" by="10" sc="1" ec="0" ng="1" na="1">
+<sample s="true" lb="Java 1 C1=2" rc="200" rm="OK" dt="text" by="10" sc="1" ec="0" ng="2" na="2">
<responseHeader class="java.lang.String"></responseHeader>
<requestHeader class="java.lang.String"></requestHeader>
<responseData class="java.lang.String">ResultData</responseData>
<responseFile class="java.lang.String"></responseFile>
<samplerData class="java.lang.String">SamplerData</samplerData>
</sample>
-<sample s="true" lb="Loop5 C1=2 C2=1 C3=16" rc="200" rm="OK" dt="text" by="0" sc="1" ec="0" ng="1" na="1">
+<sample s="true" lb="Loop5 C1=2 C2=1 C3=16" rc="200" rm="OK" dt="text" by="0" sc="1" ec="0" ng="2" na="2">
<responseHeader class="java.lang.String"></responseHeader>
<requestHeader class="java.lang.String"></requestHeader>
<responseData class="java.lang.String"></responseData>
No errors present in the logfile <https://ci-builds.apache.org/job/JMeter/job/JMeter%20s390x/ws/bin/BatchTestLocal.log> (the file is empty)
No errors present in the logfile <https://ci-builds.apache.org/job/JMeter/job/JMeter%20s390x/ws/bin/BatchTestLocalServer.log> (the file is empty)
> Task :src:dist-check:batchServerBatchTestLocal FAILED
checksum-dependency elapsed time: 6273ms, configurations processed: 64 (add -PchecksumTimingsPrint to print detailed timings)
checksum-dependency elapsed time: 10862ms, configurations processed: 360 (add -PchecksumTimingsPrint to print detailed timings)
Build [0;1mjmeter [0;1;31mFAILURE[0;1m[0m reason:
Execution [0;1;31mfailed[0m for task '[0;1m:src:dist-check:batchServerBatchTestLocal[0m':
Failures detected while testing <https://ci-builds.apache.org/job/JMeter/job/JMeter%20s390x/ws/bin/testfiles/BatchTestLocal.jmx>: [unexpected output BatchTestLocal.csv, unexpected output BatchTestLocal.xml]
at org.apache.jmeter.buildtools.batchtest.BatchTest.exec(BatchTest.kt:186)
at org.apache.jmeter.buildtools.batchtest.BatchTestServer.exec(BatchTestServer.kt:138)
[0;0;90mat org.gradle.internal.reflect.JavaMethod.invoke(JavaMethod.java:125)
[0m [0;0;90mat org.gradle.api.internal.project.taskfactory.StandardTaskAction.doExecute(StandardTaskAction.java:58)
[0m [0;0;90mat org.gradle.api.internal.project.taskfactory.StandardTaskAction.execute(StandardTaskAction.java:51)
[0m [0;0;90mat org.gradle.api.internal.project.taskfactory.StandardTaskAction.execute(StandardTaskAction.java:29)
[0m [0;0;90mat org.gradle.api.internal.tasks.execution.TaskExecution$3.run(TaskExecution.java:242)
[0m [0;0;90mat org.gradle.internal.operations.DefaultBuildOperationRunner$1.execute(DefaultBuildOperationRunner.java:29)
[0m [0;0;90mat org.gradle.internal.operations.DefaultBuildOperationRunner$1.execute(DefaultBuildOperationRunner.java:26)
[0m [0;0;90mat org.gradle.internal.operations.DefaultBuildOperationRunner$2.execute(DefaultBuildOperationRunner.java:66)
[0m [0;0;90mat org.gradle.internal.operations.DefaultBuildOperationRunner$2.execute(DefaultBuildOperationRunner.java:59)
[0m [0;0;90mat org.gradle.internal.operations.DefaultBuildOperationRunner.execute(DefaultBuildOperationRunner.java:157)
[0m [0;0;90mat org.gradle.internal.operations.DefaultBuildOperationRunner.execute(DefaultBuildOperationRunner.java:59)
[0m [0;0;90mat org.gradle.internal.operations.DefaultBuildOperationRunner.run(DefaultBuildOperationRunner.java:47)
[0m [0;0;90mat org.gradle.internal.operations.DefaultBuildOperationExecutor.run(DefaultBuildOperationExecutor.java:68)
[0m [0;0;90mat org.gradle.api.internal.tasks.execution.TaskExecution.executeAction(TaskExecution.java:227)
[0m [0;0;90mat org.gradle.api.internal.tasks.execution.TaskExecution.executeActions(TaskExecution.java:210)
[0m [0;0;90mat org.gradle.api.internal.tasks.execution.TaskExecution.executeWithPreviousOutputFiles(TaskExecution.java:193)
[0m [0;0;90mat org.gradle.api.internal.tasks.execution.TaskExecution.execute(TaskExecution.java:166)
[0m [0;0;90mat org.gradle.internal.execution.steps.ExecuteStep.executeInternal(ExecuteStep.java:105)
[0m [0;0;90mat org.gradle.internal.execution.steps.ExecuteStep.access$000(ExecuteStep.java:44)
[0m [0;0;90mat org.gradle.internal.execution.steps.ExecuteStep$1.call(ExecuteStep.java:59)
[0m [0;0;90mat org.gradle.internal.execution.steps.ExecuteStep$1.call(ExecuteStep.java:56)
[0m [0;0;90mat org.gradle.internal.operations.DefaultBuildOperationRunner$CallableBuildOperationWorker.execute(DefaultBuildOperationRunner.java:204)
[0m [0;0;90mat org.gradle.internal.operations.DefaultBuildOperationRunner$CallableBuildOperationWorker.execute(DefaultBuildOperationRunner.java:199)
[0m [0;0;90mat org.gradle.internal.operations.DefaultBuildOperationRunner$2.execute(DefaultBuildOperationRunner.java:66)
[0m [0;0;90mat org.gradle.internal.operations.DefaultBuildOperationRunner$2.execute(DefaultBuildOperationRunner.java:59)
[0m [0;0;90mat org.gradle.internal.operations.DefaultBuildOperationRunner.execute(DefaultBuildOperationRunner.java:157)
[0m [0;0;90mat org.gradle.internal.operations.DefaultBuildOperationRunner.execute(DefaultBuildOperationRunner.java:59)
[0m [0;0;90mat org.gradle.internal.operations.DefaultBuildOperationRunner.call(DefaultBuildOperationRunner.java:53)
[0m [0;0;90mat org.gradle.internal.operations.DefaultBuildOperationExecutor.call(DefaultBuildOperationExecutor.java:73)
[0m [0;0;90mat org.gradle.internal.execution.steps.ExecuteStep.execute(ExecuteStep.java:56)
[0m [0;0;90mat org.gradle.internal.execution.steps.ExecuteStep.execute(ExecuteStep.java:44)
[0m [0;0;90mat org.gradle.internal.execution.steps.RemovePreviousOutputsStep.execute(RemovePreviousOutputsStep.java:67)
[0m [0;0;90mat org.gradle.internal.execution.steps.RemovePreviousOutputsStep.execute(RemovePreviousOutputsStep.java:37)
[0m [0;0;90mat org.gradle.internal.execution.steps.CancelExecutionStep.execute(CancelExecutionStep.java:41)
[0m [0;0;90mat org.gradle.internal.execution.steps.TimeoutStep.executeWithoutTimeout(TimeoutStep.java:74)
[0m [0;0;90mat org.gradle.internal.execution.steps.TimeoutStep.execute(TimeoutStep.java:55)
[0m [0;0;90mat org.gradle.internal.execution.steps.CreateOutputsStep.execute(CreateOutputsStep.java:50)
[0m [0;0;90mat org.gradle.internal.execution.steps.CreateOutputsStep.execute(CreateOutputsStep.java:28)
[0m [0;0;90mat org.gradle.internal.execution.steps.CaptureStateAfterExecutionStep.executeDelegateBroadcastingChanges(CaptureStateAfterExecutionStep.java:100)
[0m [0;0;90mat org.gradle.internal.execution.steps.CaptureStateAfterExecutionStep.execute(CaptureStateAfterExecutionStep.java:72)
[0m [0;0;90mat org.gradle.internal.execution.steps.CaptureStateAfterExecutionStep.execute(CaptureStateAfterExecutionStep.java:50)
[0m [0;0;90mat org.gradle.internal.execution.steps.ResolveInputChangesStep.execute(ResolveInputChangesStep.java:40)
[0m [0;0;90mat org.gradle.internal.execution.steps.ResolveInputChangesStep.execute(ResolveInputChangesStep.java:29)
[0m [0;0;90mat org.gradle.internal.execution.steps.BuildCacheStep.executeWithoutCache(BuildCacheStep.java:166)
[0m [0;0;90mat org.gradle.internal.execution.steps.BuildCacheStep.lambda$execute$1(BuildCacheStep.java:70)
[0m [0;0;90mat org.gradle.internal.Either$Right.fold(Either.java:175)
[0m [0;0;90mat org.gradle.internal.execution.caching.CachingState.fold(CachingState.java:59)
[0m [0;0;90mat org.gradle.internal.execution.steps.BuildCacheStep.execute(BuildCacheStep.java:68)
[0m [0;0;90mat org.gradle.internal.execution.steps.BuildCacheStep.execute(BuildCacheStep.java:46)
[0m [0;0;90mat org.gradle.internal.execution.steps.StoreExecutionStateStep.execute(StoreExecutionStateStep.java:36)
[0m [0;0;90mat org.gradle.internal.execution.steps.StoreExecutionStateStep.execute(StoreExecutionStateStep.java:25)
[0m [0;0;90mat org.gradle.internal.execution.steps.RecordOutputsStep.execute(RecordOutputsStep.java:36)
[0m [0;0;90mat org.gradle.internal.execution.steps.RecordOutputsStep.execute(RecordOutputsStep.java:22)
[0m [0;0;90mat org.gradle.internal.execution.steps.SkipUpToDateStep.executeBecause(SkipUpToDateStep.java:91)
[0m [0;0;90mat org.gradle.internal.execution.steps.SkipUpToDateStep.lambda$execute$2(SkipUpToDateStep.java:55)
[0m [0;0;90mat org.gradle.internal.execution.steps.SkipUpToDateStep.execute(SkipUpToDateStep.java:55)
[0m [0;0;90mat org.gradle.internal.execution.steps.SkipUpToDateStep.execute(SkipUpToDateStep.java:37)
[0m [0;0;90mat org.gradle.internal.execution.steps.ResolveChangesStep.execute(ResolveChangesStep.java:65)
[0m [0;0;90mat org.gradle.internal.execution.steps.ResolveChangesStep.execute(ResolveChangesStep.java:36)
[0m [0;0;90mat org.gradle.internal.execution.steps.legacy.MarkSnapshottingInputsFinishedStep.execute(MarkSnapshottingInputsFinishedStep.java:37)
[0m [0;0;90mat org.gradle.internal.execution.steps.legacy.MarkSnapshottingInputsFinishedStep.execute(MarkSnapshottingInputsFinishedStep.java:27)
[0m [0;0;90mat org.gradle.internal.execution.steps.ResolveCachingStateStep.execute(ResolveCachingStateStep.java:76)
[0m [0;0;90mat org.gradle.internal.execution.steps.ResolveCachingStateStep.execute(ResolveCachingStateStep.java:37)
[0m [0;0;90mat org.gradle.internal.execution.steps.ValidateStep.execute(ValidateStep.java:94)
[0m [0;0;90mat org.gradle.internal.execution.steps.ValidateStep.execute(ValidateStep.java:49)
[0m [0;0;90mat org.gradle.internal.execution.steps.CaptureStateBeforeExecutionStep.execute(CaptureStateBeforeExecutionStep.java:71)
[0m [0;0;90mat org.gradle.internal.execution.steps.CaptureStateBeforeExecutionStep.execute(CaptureStateBeforeExecutionStep.java:45)
[0m [0;0;90mat org.gradle.internal.execution.steps.SkipEmptyWorkStep.executeWithNonEmptySources(SkipEmptyWorkStep.java:177)
[0m [0;0;90mat org.gradle.internal.execution.steps.SkipEmptyWorkStep.execute(SkipEmptyWorkStep.java:81)
[0m [0;0;90mat org.gradle.internal.execution.steps.SkipEmptyWorkStep.execute(SkipEmptyWorkStep.java:53)
[0m [0;0;90mat org.gradle.internal.execution.steps.RemoveUntrackedExecutionStateStep.execute(RemoveUntrackedExecutionStateStep.java:32)
[0m [0;0;90mat org.gradle.internal.execution.steps.RemoveUntrackedExecutionStateStep.execute(RemoveUntrackedExecutionStateStep.java:21)
[0m [0;0;90mat org.gradle.internal.execution.steps.legacy.MarkSnapshottingInputsStartedStep.execute(MarkSnapshottingInputsStartedStep.java:38)
[0m [0;0;90mat org.gradle.internal.execution.steps.LoadPreviousExecutionStateStep.execute(LoadPreviousExecutionStateStep.java:36)
[0m [0;0;90mat org.gradle.internal.execution.steps.LoadPreviousExecutionStateStep.execute(LoadPreviousExecutionStateStep.java:23)
[0m [0;0;90mat org.gradle.internal.execution.steps.CleanupStaleOutputsStep.execute(CleanupStaleOutputsStep.java:75)
[0m [0;0;90mat org.gradle.internal.execution.steps.CleanupStaleOutputsStep.execute(CleanupStaleOutputsStep.java:41)
[0m [0;0;90mat org.gradle.internal.execution.steps.AssignWorkspaceStep.lambda$execute$0(AssignWorkspaceStep.java:32)
[0m [0;0;90mat org.gradle.api.internal.tasks.execution.TaskExecution$4.withWorkspace(TaskExecution.java:287)
[0m [0;0;90mat org.gradle.internal.execution.steps.AssignWorkspaceStep.execute(AssignWorkspaceStep.java:30)
[0m [0;0;90mat org.gradle.internal.execution.steps.AssignWorkspaceStep.execute(AssignWorkspaceStep.java:21)
[0m [0;0;90mat org.gradle.internal.execution.steps.IdentityCacheStep.execute(IdentityCacheStep.java:37)
[0m [0;0;90mat org.gradle.internal.execution.steps.IdentityCacheStep.execute(IdentityCacheStep.java:27)
[0m [0;0;90mat org.gradle.internal.execution.steps.IdentifyStep.execute(IdentifyStep.java:47)
[0m [0;0;90mat org.gradle.internal.execution.steps.IdentifyStep.execute(IdentifyStep.java:34)
[0m
FAILURE: Build failed with an exception.
* What went wrong:
Execution failed for task ':src:dist-check:batchServerBatchTestLocal'.
> Failures detected while testing <https://ci-builds.apache.org/job/JMeter/job/JMeter%20s390x/ws/bin/testfiles/BatchTestLocal.jmx>: [unexpected output BatchTestLocal.csv, unexpected output BatchTestLocal.xml]
* Try:
> Run with --stacktrace option to get the stack trace.
> Run with --info or --debug option to get more log output.
* Get more help at https://help.gradle.org
BUILD FAILED in 23m 4s
332 actionable tasks: 54 executed, 278 up-to-date
Build step 'Invoke Gradle script' changed build result to FAILURE
Build step 'Invoke Gradle script' marked build as failure