You are viewing a plain text version of this content. The canonical link for it is here.
Posted to builds@beam.apache.org by Apache Jenkins Server <je...@builds.apache.org> on 2023/01/27 12:43:24 UTC

Build failed in Jenkins: beam_LoadTests_Java_ParDo_Dataflow_V2_Batch_Java11 #586

See <https://ci-beam.apache.org/job/beam_LoadTests_Java_ParDo_Dataflow_V2_Batch_Java11/586/display/redirect?page=changes>

Changes:

[nflavour] Initial commit of boilerplate setup of change stream pipeline for

[ahmedabualsaud] Fix SchemaTransform identifiers

[noreply] Update chromedriver-binary requirement in /sdks/python (#25178)

[noreply] Bump google.golang.org/grpc from 1.52.0 to 1.52.3 in /sdks (#25181)

[noreply] Fix a couple typos caught by an internal linter (#25188)

[noreply] Update Dataflow container versions (#25192)


------------------------------------------
[...truncated 47.19 KB...]
go: downloading google.golang.org/genproto v0.0.0-20221118155620-16455021b5e6
go: downloading golang.org/x/text v0.4.0
go: added github.com/apache/beam/sdks/v2 v2.44.0
go: added github.com/golang/protobuf v1.5.2
go: added golang.org/x/net v0.2.0
go: added golang.org/x/sys v0.2.0
go: added golang.org/x/text v0.4.0
go: added google.golang.org/genproto v0.0.0-20221118155620-16455021b5e6
go: added google.golang.org/grpc v1.51.0
go: added google.golang.org/protobuf v1.28.1
+ go-licenses save github.com/apache/beam/sdks/v2/java/container --save_path=/output/licenses
W0127 12:41:59.953517      39 library.go:101] "golang.org/x/sys/unix" contains non-Go code that can't be inspected for further dependencies:
/go/pkg/mod/golang.org/x/sys@v0.2.0/unix/asm_linux_amd64.s
+ go-licenses csv github.com/apache/beam/sdks/v2/java/container
+ tee /output/licenses/list.csv

> Task :sdks:java:container:java11:copyJavaThirdPartyLicenses

> Task :sdks:java:container:goBuild
/home/jenkins/go/bin/go1.19.3 build -o ./build/target/linux_amd64/boot boot.go boot_test.go

> Task :release:go-licenses:java:dockerRun
W0127 12:42:04.169448      83 library.go:101] "golang.org/x/sys/unix" contains non-Go code that can't be inspected for further dependencies:
/go/pkg/mod/golang.org/x/sys@v0.2.0/unix/asm_linux_amd64.s

> Task :sdks:java:container:java11:copySdkHarnessLauncher
Execution optimizations have been disabled for task ':sdks:java:container:java11:copySdkHarnessLauncher' to ensure correctness due to the following reasons:
  - Gradle detected a problem with the following location: '<https://ci-beam.apache.org/job/beam_LoadTests_Java_ParDo_Dataflow_V2_Batch_Java11/ws/src/sdks/java/container/build/target'.> Reason: Task ':sdks:java:container:java11:copySdkHarnessLauncher' uses this output of task ':sdks:java:container:downloadCloudProfilerAgent' without declaring an explicit or implicit dependency. This can lead to incorrect results being produced, depending on what order the tasks are executed. Please refer to https://docs.gradle.org/7.5.1/userguide/validation_problems.html#implicit_dependency for more details about this problem.
  - Gradle detected a problem with the following location: '<https://ci-beam.apache.org/job/beam_LoadTests_Java_ParDo_Dataflow_V2_Batch_Java11/ws/src/sdks/java/container/build/target'.> Reason: Task ':sdks:java:container:java11:copySdkHarnessLauncher' uses this output of task ':sdks:java:container:pullLicenses' without declaring an explicit or implicit dependency. This can lead to incorrect results being produced, depending on what order the tasks are executed. Please refer to https://docs.gradle.org/7.5.1/userguide/validation_problems.html#implicit_dependency for more details about this problem.

> Task :release:go-licenses:java:dockerRun
github.com/apache/beam/sdks/v2/go/pkg/beam,https://github.com/apache/beam/blob/sdks/v2.44.0/sdks/go/README.md,Apache-2.0
github.com/apache/beam/sdks/v2/java/container,https://github.com/apache/beam/blob/sdks/v2.44.0/sdks/LICENSE,Apache-2.0
github.com/golang/protobuf,https://github.com/golang/protobuf/blob/v1.5.2/LICENSE,BSD-3-Clause
golang.org/x/net,https://cs.opensource.google/go/x/net/+/v0.2.0:LICENSE,BSD-3-Clause
golang.org/x/sys/unix,https://cs.opensource.google/go/x/sys/+/v0.2.0:LICENSE,BSD-3-Clause
golang.org/x/text,https://cs.opensource.google/go/x/text/+/v0.4.0:LICENSE,BSD-3-Clause
google.golang.org/genproto/googleapis/rpc/status,https://github.com/googleapis/go-genproto/blob/16455021b5e6/LICENSE,Apache-2.0
google.golang.org/grpc,https://github.com/grpc/grpc-go/blob/v1.51.0/LICENSE,Apache-2.0
google.golang.org/protobuf,https://github.com/protocolbuffers/protobuf-go/blob/v1.28.1/LICENSE,BSD-3-Clause
+ chmod -R a+w /output/licenses

> Task :release:go-licenses:java:createLicenses
> Task :sdks:java:container:java11:copyGolangLicenses
> Task :sdks:java:container:java11:dockerPrepare
> Task :sdks:java:container:java11:docker

> Task :runners:google-cloud-dataflow-java:buildAndPushDockerJavaContainer
WARNING: `gcloud docker` will not be supported for Docker client versions above 18.03.

As an alternative, use `gcloud auth configure-docker` to configure `docker` to
use `gcloud` as a credential helper, then use `docker` as you would for non-GCR
registries, e.g. `docker pull gcr.io/project-id/my-image`. Add
`--verbosity=error` to silence this warning: `gcloud docker
--verbosity=error -- pull gcr.io/project-id/my-image`.

See: https://cloud.google.com/container-registry/docs/support/deprecation-notices#gcloud-docker

The push refers to repository [us.gcr.io/apache-beam-testing/java-postcommit-it/java]
6c347bc89a9a: Preparing
50dd0a92cbfe: Preparing
ca14cef747cc: Preparing
5d30994347c9: Preparing
3655e34a34e1: Preparing
560f46e8e622: Preparing
9ccedec02714: Preparing
d3abd1189932: Preparing
a3422074a923: Preparing
b6d416d2c4cd: Preparing
235b36e3a473: Preparing
9b46082561da: Preparing
78574c9dda9a: Preparing
2671d4f13033: Preparing
e39e8d8079a8: Preparing
3911fea43d41: Preparing
7b7f3078e1db: Preparing
826c3ddbb29c: Preparing
b626401ef603: Preparing
9b55156abf26: Preparing
293d5db30c9f: Preparing
03127cdb479b: Preparing
9c742cd6c7a5: Preparing
e39e8d8079a8: Waiting
a3422074a923: Waiting
3911fea43d41: Waiting
b6d416d2c4cd: Waiting
7b7f3078e1db: Waiting
235b36e3a473: Waiting
826c3ddbb29c: Waiting
b626401ef603: Waiting
9b46082561da: Waiting
2671d4f13033: Waiting
9b55156abf26: Waiting
78574c9dda9a: Waiting
293d5db30c9f: Waiting
d3abd1189932: Waiting
03127cdb479b: Waiting
9c742cd6c7a5: Waiting
560f46e8e622: Waiting
9ccedec02714: Waiting
5d30994347c9: Pushed
50dd0a92cbfe: Pushed
3655e34a34e1: Pushed
ca14cef747cc: Pushed
6c347bc89a9a: Pushed
d3abd1189932: Pushed
9ccedec02714: Pushed
b6d416d2c4cd: Pushed
560f46e8e622: Pushed
a3422074a923: Pushed
9b46082561da: Pushed
235b36e3a473: Pushed
7b7f3078e1db: Layer already exists
826c3ddbb29c: Layer already exists
b626401ef603: Layer already exists
9b55156abf26: Layer already exists
293d5db30c9f: Layer already exists
78574c9dda9a: Pushed
03127cdb479b: Layer already exists
9c742cd6c7a5: Layer already exists
2671d4f13033: Pushed
e39e8d8079a8: Pushed
3911fea43d41: Pushed
20230127124144: digest: sha256:49c05fa49954aa3f937480b7ffef244f6e0f32b0e9105ea30ebfc1702986ae9b size: 5140

> Task :sdks:java:testing:load-tests:run
Jan 27, 2023 12:42:34 PM org.apache.beam.runners.dataflow.options.DataflowPipelineOptions$StagingLocationFactory create
INFO: No stagingLocation provided, falling back to gcpTempLocation
Jan 27, 2023 12:42:34 PM org.apache.beam.runners.dataflow.DataflowRunner fromOptions
INFO: PipelineOptions.filesToStage was not specified. Defaulting to files from the classpath: will stage 232 files. Enable logging at DEBUG level to see which files will be staged.
Jan 27, 2023 12:42:35 PM org.apache.beam.sdk.Pipeline validate
WARNING: The following transforms do not have stable unique names: ParDo(TimeMonitor)
Jan 27, 2023 12:42:35 PM org.apache.beam.runners.dataflow.DataflowRunner run
INFO: Executing pipeline on the Dataflow Service, which will have billing implications related to Google Compute Engine usage and other Google Cloud Services.
Jan 27, 2023 12:42:37 PM org.apache.beam.runners.dataflow.util.PackageUtil stageClasspathElements
INFO: Uploading 232 files from PipelineOptions.filesToStage to staging location to prepare for execution.
Jan 27, 2023 12:42:38 PM org.apache.beam.runners.dataflow.util.PackageUtil stageClasspathElements
INFO: Staging files complete: 232 files cached, 0 files newly uploaded in 0 seconds
Jan 27, 2023 12:42:38 PM org.apache.beam.runners.dataflow.DataflowRunner run
INFO: Staging portable pipeline proto to gs://temp-storage-for-perf-tests/loadtests/staging/
Jan 27, 2023 12:42:38 PM org.apache.beam.runners.dataflow.util.PackageUtil tryStagePackage
INFO: Uploading <115888 bytes, hash 65f0ef3dfd0b7df94cbf2af29062be80ba4a8f0aca110335387112de4237e013> to gs://temp-storage-for-perf-tests/loadtests/staging/pipeline-ZfDvPf0LfflMvyrykGK-gLpKjwrKEQM1OHES3kI34BM.pb
Jan 27, 2023 12:42:40 PM org.apache.beam.runners.dataflow.DataflowPipelineTranslator$Translator addStep
INFO: Adding Read input as step s1
Jan 27, 2023 12:42:40 PM org.apache.beam.runners.dataflow.DataflowPipelineTranslator$Translator addStep
INFO: Adding ParDo(TimeMonitor) as step s2
Jan 27, 2023 12:42:40 PM org.apache.beam.runners.dataflow.DataflowPipelineTranslator$Translator addStep
INFO: Adding ParDo(ByteMonitor) as step s3
Jan 27, 2023 12:42:40 PM org.apache.beam.runners.dataflow.DataflowPipelineTranslator$Translator addStep
INFO: Adding Step: 0 as step s4
Jan 27, 2023 12:42:40 PM org.apache.beam.runners.dataflow.DataflowPipelineTranslator$Translator addStep
INFO: Adding Step: 1 as step s5
Jan 27, 2023 12:42:40 PM org.apache.beam.runners.dataflow.DataflowPipelineTranslator$Translator addStep
INFO: Adding Step: 2 as step s6
Jan 27, 2023 12:42:40 PM org.apache.beam.runners.dataflow.DataflowPipelineTranslator$Translator addStep
INFO: Adding Step: 3 as step s7
Jan 27, 2023 12:42:40 PM org.apache.beam.runners.dataflow.DataflowPipelineTranslator$Translator addStep
INFO: Adding Step: 4 as step s8
Jan 27, 2023 12:42:40 PM org.apache.beam.runners.dataflow.DataflowPipelineTranslator$Translator addStep
INFO: Adding Step: 5 as step s9
Jan 27, 2023 12:42:40 PM org.apache.beam.runners.dataflow.DataflowPipelineTranslator$Translator addStep
INFO: Adding Step: 6 as step s10
Jan 27, 2023 12:42:40 PM org.apache.beam.runners.dataflow.DataflowPipelineTranslator$Translator addStep
INFO: Adding Step: 7 as step s11
Jan 27, 2023 12:42:40 PM org.apache.beam.runners.dataflow.DataflowPipelineTranslator$Translator addStep
INFO: Adding Step: 8 as step s12
Jan 27, 2023 12:42:40 PM org.apache.beam.runners.dataflow.DataflowPipelineTranslator$Translator addStep
INFO: Adding Step: 9 as step s13
Jan 27, 2023 12:42:40 PM org.apache.beam.runners.dataflow.DataflowPipelineTranslator$Translator addStep
INFO: Adding ParDo(TimeMonitor)2 as step s14
Jan 27, 2023 12:42:40 PM org.apache.beam.runners.dataflow.DataflowRunner run
INFO: Dataflow SDK version: 2.46.0-SNAPSHOT
Jan 27, 2023 12:42:41 PM org.apache.beam.runners.dataflow.DataflowRunner run
INFO: To access the Dataflow monitoring console, please navigate to https://console.cloud.google.com/dataflow/jobs/us-central1/2023-01-27_04_42_40-14834104221741266689?project=apache-beam-testing
Jan 27, 2023 12:42:41 PM org.apache.beam.runners.dataflow.DataflowRunner run
INFO: Submitted job: 2023-01-27_04_42_40-14834104221741266689
Jan 27, 2023 12:42:41 PM org.apache.beam.runners.dataflow.DataflowRunner run
INFO: To cancel the job using the 'gcloud' tool, run:
> gcloud dataflow jobs --project=apache-beam-testing cancel --region=us-central1 2023-01-27_04_42_40-14834104221741266689
Jan 27, 2023 12:42:45 PM org.apache.beam.runners.dataflow.util.MonitoringUtil$LoggingHandler process
WARNING: 2023-01-27T12:42:44.325Z: The workflow name is not a valid Cloud Label. Labels applied to Cloud resources (such as GCE Instances) for monitoring will be labeled with this modified job name: load0tests0java110dataflow0v20batch0pardo01-jenkins-012712-sma6. For the best monitoring experience, please name your job with a valid Cloud Label. For details, see: https://cloud.google.com/compute/docs/labeling-resources#restrictions
Jan 27, 2023 12:42:53 PM org.apache.beam.runners.dataflow.util.MonitoringUtil$LoggingHandler process
INFO: 2023-01-27T12:42:52.196Z: Worker configuration: e2-standard-2 in us-central1-f.
Jan 27, 2023 12:42:53 PM org.apache.beam.runners.dataflow.util.MonitoringUtil$LoggingHandler process
SEVERE: 2023-01-27T12:42:53.039Z: Workflow failed. Causes: The quota check has failed., Requested quota metric SSD Total GB is currently unavailable.
Jan 27, 2023 12:42:53 PM org.apache.beam.runners.dataflow.util.MonitoringUtil$LoggingHandler process
INFO: 2023-01-27T12:42:53.061Z: Cleaning up.
Jan 27, 2023 12:42:53 PM org.apache.beam.runners.dataflow.util.MonitoringUtil$LoggingHandler process
INFO: 2023-01-27T12:42:53.099Z: Worker pool stopped.
Jan 27, 2023 12:42:54 PM org.apache.beam.runners.dataflow.util.MonitoringUtil$LoggingHandler process
INFO: 2023-01-27T12:42:54.256Z: Your project already contains 100 Dataflow-created metric descriptors, so new user metrics of the form custom.googleapis.com/* will not be created. However, all user metrics are also available in the metric dataflow.googleapis.com/job/user_counter. If you rely on the custom metrics, you can delete old / unused metric descriptors. See https://developers.google.com/apis-explorer/#p/monitoring/v3/monitoring.projects.metricDescriptors.list and https://developers.google.com/apis-explorer/#p/monitoring/v3/monitoring.projects.metricDescriptors.delete
Jan 27, 2023 12:43:16 PM org.apache.beam.runners.dataflow.DataflowPipelineJob logTerminalState
INFO: Job 2023-01-27_04_42_40-14834104221741266689 failed with status FAILED.
Jan 27, 2023 12:43:17 PM org.apache.beam.sdk.testutils.metrics.MetricsReader getCounterMetric
SEVERE: Failed to get metric totalBytes.count, from namespace pardo
Load test results for test (ID): c0a9adad-5ae2-480a-93d8-c250f5875e72 and timestamp: 2023-01-27T12:42:35.250000000Z:
                 Metric:                    Value:
dataflow_v2_java11_runtime_sec                       0.0
dataflow_v2_java11_total_bytes_count                      -1.0
Exception in thread "main" java.lang.RuntimeException: Invalid job state: FAILED.
	at org.apache.beam.sdk.loadtests.JobFailure.handleFailure(JobFailure.java:51)
	at org.apache.beam.sdk.loadtests.LoadTest.run(LoadTest.java:139)
	at org.apache.beam.sdk.loadtests.ParDoLoadTest.run(ParDoLoadTest.java:53)
	at org.apache.beam.sdk.loadtests.ParDoLoadTest.main(ParDoLoadTest.java:103)

> Task :sdks:java:testing:load-tests:run FAILED

> Task :runners:google-cloud-dataflow-java:cleanUpDockerJavaImages
Untagged: us.gcr.io/apache-beam-testing/java-postcommit-it/java:20230127124144
Untagged: us.gcr.io/apache-beam-testing/java-postcommit-it/java@sha256:49c05fa49954aa3f937480b7ffef244f6e0f32b0e9105ea30ebfc1702986ae9b
WARNING: Successfully resolved tag to sha256, but it is recommended to use sha256 directly.
Tag: [us.gcr.io/apache-beam-testing/java-postcommit-it/java:20230127124144]
- referencing digest: [us.gcr.io/apache-beam-testing/java-postcommit-it/java@sha256:49c05fa49954aa3f937480b7ffef244f6e0f32b0e9105ea30ebfc1702986ae9b]

Deleted [[us.gcr.io/apache-beam-testing/java-postcommit-it/java:20230127124144] (referencing [us.gcr.io/apache-beam-testing/java-postcommit-it/java@sha256:49c05fa49954aa3f937480b7ffef244f6e0f32b0e9105ea30ebfc1702986ae9b])].
Removing untagged image us.gcr.io/apache-beam-testing/java-postcommit-it/java@sha256:49c05fa49954aa3f937480b7ffef244f6e0f32b0e9105ea30ebfc1702986ae9b
Digests:
- us.gcr.io/apache-beam-testing/java-postcommit-it/java@sha256:49c05fa49954aa3f937480b7ffef244f6e0f32b0e9105ea30ebfc1702986ae9b
Deleted [us.gcr.io/apache-beam-testing/java-postcommit-it/java@sha256:49c05fa49954aa3f937480b7ffef244f6e0f32b0e9105ea30ebfc1702986ae9b].

FAILURE: Build failed with an exception.

* What went wrong:
Execution failed for task ':sdks:java:testing:load-tests:run'.
> Process 'command '/usr/lib/jvm/java-8-openjdk-amd64/bin/java'' finished with non-zero exit value 1

* Try:
> Run with --stacktrace option to get the stack trace.
> Run with --info or --debug option to get more log output.

* Get more help at https://help.gradle.org

Deprecated Gradle features were used in this build, making it incompatible with Gradle 8.0.

You can use '--warning-mode all' to show the individual deprecation warnings and determine if they come from your own scripts or plugins.

See https://docs.gradle.org/7.5.1/userguide/command_line_interface.html#sec:command_line_warnings

Execution optimizations have been disabled for 1 invalid unit(s) of work during this build to ensure correctness.
Please consult deprecation warnings for more details.

BUILD FAILED in 1m 54s
114 actionable tasks: 76 executed, 34 from cache, 4 up-to-date

Publishing build scan...
https://gradle.com/s/mpu7xefhcuode

Build step 'Invoke Gradle script' changed build result to FAILURE
Build step 'Invoke Gradle script' marked build as failure

---------------------------------------------------------------------
To unsubscribe, e-mail: builds-unsubscribe@beam.apache.org
For additional commands, e-mail: builds-help@beam.apache.org


Jenkins build is back to normal : beam_LoadTests_Java_ParDo_Dataflow_V2_Batch_Java11 #587

Posted by Apache Jenkins Server <je...@builds.apache.org>.
See <https://ci-beam.apache.org/job/beam_LoadTests_Java_ParDo_Dataflow_V2_Batch_Java11/587/display/redirect?page=changes>


---------------------------------------------------------------------
To unsubscribe, e-mail: builds-unsubscribe@beam.apache.org
For additional commands, e-mail: builds-help@beam.apache.org