You are viewing a plain text version of this content. The canonical link for it is here.
Posted to dev@falcon.apache.org by Apache Jenkins Server <je...@builds.apache.org> on 2015/01/13 10:51:43 UTC
Build failed in Jenkins: Apache-falcon #535
See <https://builds.apache.org/job/Apache-falcon/535/>
------------------------------------------
[...truncated 5048 lines...]
at org.testng.Assert.assertEquals(Assert.java:118)
at org.testng.Assert.assertEquals(Assert.java:365)
at org.testng.Assert.assertEquals(Assert.java:375)
at org.apache.falcon.cli.FalconCLIIT.submitTestFiles(FalconCLIIT.java:885)
at org.apache.falcon.cli.FalconCLIIT.testInstanceSuspendAndResume(FalconCLIIT.java:432)
testMetadataListCommands(org.apache.falcon.cli.FalconCLIIT) Time elapsed: 0.357 sec <<< FAILURE!
java.lang.AssertionError: expected:<0> but was:<-1>
at org.testng.Assert.fail(Assert.java:89)
at org.testng.Assert.failNotEquals(Assert.java:489)
at org.testng.Assert.assertEquals(Assert.java:118)
at org.testng.Assert.assertEquals(Assert.java:365)
at org.testng.Assert.assertEquals(Assert.java:375)
at org.apache.falcon.cli.FalconCLIIT.submitTestFiles(FalconCLIIT.java:885)
at org.apache.falcon.cli.FalconCLIIT.testMetadataListCommands(FalconCLIIT.java:590)
testMetadataRelationsCommands(org.apache.falcon.cli.FalconCLIIT) Time elapsed: 0.336 sec <<< FAILURE!
java.lang.AssertionError: expected:<0> but was:<-1>
at org.testng.Assert.fail(Assert.java:89)
at org.testng.Assert.failNotEquals(Assert.java:489)
at org.testng.Assert.assertEquals(Assert.java:118)
at org.testng.Assert.assertEquals(Assert.java:365)
at org.testng.Assert.assertEquals(Assert.java:375)
at org.apache.falcon.cli.FalconCLIIT.submitTestFiles(FalconCLIIT.java:885)
at org.apache.falcon.cli.FalconCLIIT.testMetadataRelationsCommands(FalconCLIIT.java:627)
testRecipeCommand(org.apache.falcon.cli.FalconCLIIT) Time elapsed: 0.356 sec <<< FAILURE!
java.lang.AssertionError: expected:<0> but was:<-1>
at org.testng.Assert.fail(Assert.java:89)
at org.testng.Assert.failNotEquals(Assert.java:489)
at org.testng.Assert.assertEquals(Assert.java:118)
at org.testng.Assert.assertEquals(Assert.java:365)
at org.testng.Assert.assertEquals(Assert.java:375)
at org.apache.falcon.cli.FalconCLIIT.recipeSetup(FalconCLIIT.java:826)
at org.apache.falcon.cli.FalconCLIIT.testRecipeCommand(FalconCLIIT.java:809)
testScheduleEntityValidCommands(org.apache.falcon.cli.FalconCLIIT) Time elapsed: 0.381 sec <<< FAILURE!
java.lang.AssertionError: expected:<0> but was:<-1>
at org.testng.Assert.fail(Assert.java:89)
at org.testng.Assert.failNotEquals(Assert.java:489)
at org.testng.Assert.assertEquals(Assert.java:118)
at org.testng.Assert.assertEquals(Assert.java:365)
at org.testng.Assert.assertEquals(Assert.java:375)
at org.apache.falcon.cli.FalconCLIIT.submitTestFiles(FalconCLIIT.java:885)
at org.apache.falcon.cli.FalconCLIIT.testScheduleEntityValidCommands(FalconCLIIT.java:169)
testSubmitAndScheduleEntityValidCommands(org.apache.falcon.cli.FalconCLIIT) Time elapsed: 0.455 sec <<< FAILURE!
java.lang.AssertionError: expected:<0> but was:<-1>
at org.testng.Assert.fail(Assert.java:89)
at org.testng.Assert.failNotEquals(Assert.java:489)
at org.testng.Assert.assertEquals(Assert.java:118)
at org.testng.Assert.assertEquals(Assert.java:365)
at org.testng.Assert.assertEquals(Assert.java:375)
at org.apache.falcon.cli.FalconCLIIT.testSubmitAndScheduleEntityValidCommands(FalconCLIIT.java:108)
testSubmitEntityValidCommands(org.apache.falcon.cli.FalconCLIIT) Time elapsed: 0.325 sec <<< FAILURE!
java.lang.AssertionError: expected:<0> but was:<-1>
at org.testng.Assert.fail(Assert.java:89)
at org.testng.Assert.failNotEquals(Assert.java:489)
at org.testng.Assert.assertEquals(Assert.java:118)
at org.testng.Assert.assertEquals(Assert.java:365)
at org.testng.Assert.assertEquals(Assert.java:375)
at org.apache.falcon.cli.FalconCLIIT.testSubmitEntityValidCommands(FalconCLIIT.java:66)
testSuspendResumeStatusEntityValidCommands(org.apache.falcon.cli.FalconCLIIT) Time elapsed: 0.35 sec <<< FAILURE!
java.lang.AssertionError: expected:<0> but was:<-1>
at org.testng.Assert.fail(Assert.java:89)
at org.testng.Assert.failNotEquals(Assert.java:489)
at org.testng.Assert.assertEquals(Assert.java:118)
at org.testng.Assert.assertEquals(Assert.java:365)
at org.testng.Assert.assertEquals(Assert.java:375)
at org.apache.falcon.cli.FalconCLIIT.submitTestFiles(FalconCLIIT.java:885)
at org.apache.falcon.cli.FalconCLIIT.testSuspendResumeStatusEntityValidCommands(FalconCLIIT.java:183)
testValidateValidCommands(org.apache.falcon.cli.FalconCLIIT) Time elapsed: 0.317 sec <<< FAILURE!
java.lang.AssertionError: expected:<0> but was:<-1>
at org.testng.Assert.fail(Assert.java:89)
at org.testng.Assert.failNotEquals(Assert.java:489)
at org.testng.Assert.assertEquals(Assert.java:118)
at org.testng.Assert.assertEquals(Assert.java:365)
at org.testng.Assert.assertEquals(Assert.java:375)
at org.apache.falcon.cli.FalconCLIIT.testValidateValidCommands(FalconCLIIT.java:131)
Running org.apache.falcon.catalog.HiveCatalogServiceIT
Tests run: 21, Failures: 0, Errors: 0, Skipped: 0, Time elapsed: 14.637 sec - in org.apache.falcon.catalog.HiveCatalogServiceIT
Results :
Failed tests:
FeedEntityValidationIT.testFeedEntityWithInvalidTableUri:138 expected:<200> but was:<400>
FeedEntityValidationIT.testFeedEntityWithInvalidTableUri:138 expected:<200> but was:<400>
FeedEntityValidationIT.testFeedEntityWithInvalidTableUri:138 expected:<200> but was:<400>
FeedEntityValidationIT.testFeedEntityWithInvalidTableUri:138 expected:<200> but was:<400>
FeedEntityValidationIT.testFeedEntityWithInvalidTableUri:138 expected:<200> but was:<400>
FeedEntityValidationIT.testFeedEntityWithInvalidTableUri:138 expected:<200> but was:<400>
FeedEntityValidationIT.testFeedEntityWithValidTable:81 expected:<200> but was:<400>
ClusterEntityValidationIT.testClusterEntityWithValidInterfaces:89 expected:<200> but was:<400>
ClusterEntityValidationIT.testValidateACL:150 expected:<200> but was:<400>
ClusterEntityValidationIT.testValidateClusterLocations:156 » Validation Invali...
EntityManagerPaginationJerseyIT.prepare:42->scheduleMultipleProcess:155 expected:<200> but was:<400>
EntityManagerJerseyIT.testClusterSubmitScheduleSuspendResumeDelete:463 expected:<200> but was:<400>
EntityManagerJerseyIT.cleanup:183 » OozieClient java.io.IOException: Error whi...
EntityManagerJerseySmokeIT.testFeedSchedule:110 expected:<200> but was:<400>
EntityManagerJerseySmokeIT.cleanup:60 » OozieClient java.io.IOException: Error...
MetadataResourceJerseyIT.prepare:51 expected:<200> but was:<400>
FalconCLISmokeIT.testSubmitAndScheduleEntityValidCommands:58 expected:<0> but was:<-1>
FalconCLIIT.testClientProperties:723->submitTestFiles:885 expected:<0> but was:<-1>
FalconCLIIT.testContinue:661->submitTestFiles:885 expected:<0> but was:<-1>
FalconCLIIT.testDefinitionEntityValidCommands:153->submitTestFiles:885 expected:<0> but was:<-1>
FalconCLIIT.testDeleteEntityValidCommands:246->submitTestFiles:885 expected:<0> but was:<-1>
FalconCLIIT.testEntityLineage:499 expected:<0> but was:<-1>
FalconCLIIT.testEntityPaginationFilterByCommands:526 expected:<0> but was:<-1>
FalconCLIIT.testInstanceGetLogs:749->submitTestFiles:885 expected:<0> but was:<-1>
FalconCLIIT.testInstanceKillAndRerun:462->submitTestFiles:885 expected:<0> but was:<-1>
FalconCLIIT.testInstanceRunningAndStatusCommands:275->submitTestFiles:885 expected:<0> but was:<-1>
FalconCLIIT.testInstanceRunningAndSummaryCommands:404->submitTestFiles:885 expected:<0> but was:<-1>
FalconCLIIT.testInstanceSuspendAndResume:432->submitTestFiles:885 expected:<0> but was:<-1>
FalconCLIIT.testMetadataListCommands:590->submitTestFiles:885 expected:<0> but was:<-1>
FalconCLIIT.testMetadataRelationsCommands:627->submitTestFiles:885 expected:<0> but was:<-1>
FalconCLIIT.testRecipeCommand:809->recipeSetup:826 expected:<0> but was:<-1>
FalconCLIIT.testScheduleEntityValidCommands:169->submitTestFiles:885 expected:<0> but was:<-1>
FalconCLIIT.testSubmitAndScheduleEntityValidCommands:108 expected:<0> but was:<-1>
FalconCLIIT.testSubmitEntityValidCommands:66 expected:<0> but was:<-1>
FalconCLIIT.testSuspendResumeStatusEntityValidCommands:183->submitTestFiles:885 expected:<0> but was:<-1>
FalconCLIIT.testValidateValidCommands:131 expected:<0> but was:<-1>
Tests run: 158, Failures: 36, Errors: 0, Skipped: 57
[INFO]
[INFO] --- maven-jetty-plugin:6.1.26:stop (stop-jetty) @ falcon-webapp ---
[INFO]
[INFO] --- maven-failsafe-plugin:2.16:verify (verify) @ falcon-webapp ---
[INFO] Stopping server 0
[INFO] Stopped SelectChannelConnector@0.0.0.0:41000
[INFO] Stopped SslSocketConnector@0.0.0.0:41443
[INFO] Failsafe report directory: <https://builds.apache.org/job/Apache-falcon/ws/webapp/target/failsafe-reports>
[INFO] ------------------------------------------------------------------------
[INFO] Reactor Summary:
[INFO]
[INFO] Checkstyle ........................................ SUCCESS [ 0.969 s]
[INFO] Apache Falcon ..................................... SUCCESS [ 5.028 s]
[INFO] Build Tools ....................................... SUCCESS [ 3.766 s]
[INFO] Apache Falcon CLI client .......................... SUCCESS [ 27.153 s]
[INFO] Apache Falcon Metrics ............................. SUCCESS [ 11.329 s]
[INFO] Apache Falcon Hadoop Dependencies ................. SUCCESS [ 14.835 s]
[INFO] Apache Falcon Test Utility ........................ SUCCESS [ 10.914 s]
[INFO] Apache Falcon Commons ............................. SUCCESS [01:33 min]
[INFO] Apache Falcon Oozie EL Extension .................. SUCCESS [ 14.635 s]
[INFO] Apache Falcon Embedded Hadoop - Test Cluster ...... SUCCESS [ 29.856 s]
[INFO] Apache Falcon Sharelib Hive - Test Cluster ........ SUCCESS [ 1.178 s]
[INFO] Apache Falcon Sharelib Pig - Test Cluster ......... SUCCESS [ 0.756 s]
[INFO] Apache Falcon Sharelib Hcatalog - Test Cluster .... SUCCESS [ 0.933 s]
[INFO] Apache Falcon Sharelib Oozie - Test Cluster ....... SUCCESS [ 0.529 s]
[INFO] Apache Falcon Test Tools - Test Cluster ........... SUCCESS [ 0.472 s]
[INFO] Apache Falcon Messaging ........................... SUCCESS [ 25.826 s]
[INFO] Apache Falcon Oozie Adaptor ....................... SUCCESS [ 50.138 s]
[INFO] Apache Falcon Acquisition ......................... SUCCESS [ 0.526 s]
[INFO] Apache Falcon Replication ......................... SUCCESS [ 16.498 s]
[INFO] Apache Falcon Retention ........................... SUCCESS [ 16.461 s]
[INFO] Apache Falcon Archival ............................ SUCCESS [ 0.478 s]
[INFO] Apache Falcon Rerun ............................... SUCCESS [ 24.002 s]
[INFO] Apache Falcon Prism ............................... SUCCESS [ 55.527 s]
[INFO] Apache Falcon Web Application ..................... FAILURE [02:26 min]
[INFO] Apache Falcon Documentation ....................... SKIPPED
[INFO] ------------------------------------------------------------------------
[INFO] BUILD FAILURE
[INFO] ------------------------------------------------------------------------
[INFO] Total time: 09:12 min
[INFO] Finished at: 2015-01-13T09:51:30+00:00
[INFO] Final Memory: 111M/761M
[INFO] ------------------------------------------------------------------------
[ERROR] Failed to execute goal org.apache.maven.plugins:maven-failsafe-plugin:2.16:verify (verify) on project falcon-webapp: There are test failures.
[ERROR]
[ERROR] Please refer to <https://builds.apache.org/job/Apache-falcon/ws/webapp/target/failsafe-reports> for the individual test results.
[ERROR] -> [Help 1]
[ERROR]
[ERROR] To see the full stack trace of the errors, re-run Maven with the -e switch.
[ERROR] Re-run Maven using the -X switch to enable full debug logging.
[ERROR]
[ERROR] For more information about the errors and possible solutions, please read the following articles:
[ERROR] [Help 1] http://cwiki.apache.org/confluence/display/MAVEN/MojoFailureException
[ERROR]
[ERROR] After correcting the problems, you can resume the build with the command
[ERROR] mvn <goals> -rf :falcon-webapp
Shutting down hive metastore.
[INFO] Shutdown hook executing
[INFO] Shutdown hook complete
Build step 'Execute shell' marked build as failure
[CHECKSTYLE] Collecting checkstyle analysis files...
[CHECKSTYLE] Finding all files that match the pattern **/target/checkstyle-result.xml
[CHECKSTYLE] Parsing 26 files in <https://builds.apache.org/job/Apache-falcon/ws/>
[CHECKSTYLE] Successfully parsed file <https://builds.apache.org/job/Apache-falcon/ws/acquisition/target/checkstyle-result.xml> of module with 0 warnings.
[CHECKSTYLE] Successfully parsed file <https://builds.apache.org/job/Apache-falcon/ws/archival/target/checkstyle-result.xml> of module with 0 warnings.
[CHECKSTYLE] Successfully parsed file <https://builds.apache.org/job/Apache-falcon/ws/build-tools/target/checkstyle-result.xml> of module with 0 warnings.
[CHECKSTYLE] Successfully parsed file <https://builds.apache.org/job/Apache-falcon/ws/client/target/checkstyle-result.xml> of module with 0 warnings.
[CHECKSTYLE] Successfully parsed file <https://builds.apache.org/job/Apache-falcon/ws/common/target/checkstyle-result.xml> of module with 0 warnings.
[CHECKSTYLE] Successfully parsed file <https://builds.apache.org/job/Apache-falcon/ws/docs/target/checkstyle-result.xml> of module with 0 warnings.
[CHECKSTYLE] Successfully parsed file <https://builds.apache.org/job/Apache-falcon/ws/feed/target/checkstyle-result.xml> of module with 0 warnings.
[CHECKSTYLE] Successfully parsed file <https://builds.apache.org/job/Apache-falcon/ws/hadoop-dependencies/target/checkstyle-result.xml> of module with 0 warnings.
[CHECKSTYLE] Successfully parsed file <https://builds.apache.org/job/Apache-falcon/ws/hadoop-webapp/target/checkstyle-result.xml> of module with 0 warnings.
[CHECKSTYLE] Successfully parsed file <https://builds.apache.org/job/Apache-falcon/ws/messaging/target/checkstyle-result.xml> of module with 0 warnings.
[CHECKSTYLE] Successfully parsed file <https://builds.apache.org/job/Apache-falcon/ws/metrics/target/checkstyle-result.xml> of module with 0 warnings.
[CHECKSTYLE] Successfully parsed file <https://builds.apache.org/job/Apache-falcon/ws/oozie-el-extensions/target/checkstyle-result.xml> of module with 0 warnings.
[CHECKSTYLE] Successfully parsed file <https://builds.apache.org/job/Apache-falcon/ws/oozie/target/checkstyle-result.xml> of module with 0 warnings.
[CHECKSTYLE] Successfully parsed file <https://builds.apache.org/job/Apache-falcon/ws/prism/target/checkstyle-result.xml> of module with 0 warnings.
[CHECKSTYLE] Successfully parsed file <https://builds.apache.org/job/Apache-falcon/ws/process/target/checkstyle-result.xml> of module with 0 warnings.
[CHECKSTYLE] Successfully parsed file <https://builds.apache.org/job/Apache-falcon/ws/replication/target/checkstyle-result.xml> of module with 0 warnings.
[CHECKSTYLE] Successfully parsed file <https://builds.apache.org/job/Apache-falcon/ws/rerun/target/checkstyle-result.xml> of module with 0 warnings.
[CHECKSTYLE] Successfully parsed file <https://builds.apache.org/job/Apache-falcon/ws/retention/target/checkstyle-result.xml> of module with 0 warnings.
[CHECKSTYLE] Successfully parsed file <https://builds.apache.org/job/Apache-falcon/ws/target/checkstyle-result.xml> of module with 0 warnings.
[CHECKSTYLE] Successfully parsed file <https://builds.apache.org/job/Apache-falcon/ws/test-tools/hadoop-webapp/target/checkstyle-result.xml> of module with 0 warnings.
[CHECKSTYLE] Successfully parsed file <https://builds.apache.org/job/Apache-falcon/ws/test-tools/hcatalog-sharelib/target/checkstyle-result.xml> of module with 0 warnings.
[CHECKSTYLE] Successfully parsed file <https://builds.apache.org/job/Apache-falcon/ws/test-tools/hive-sharelib/target/checkstyle-result.xml> of module with 0 warnings.
[CHECKSTYLE] Successfully parsed file <https://builds.apache.org/job/Apache-falcon/ws/test-tools/oozie-sharelib/target/checkstyle-result.xml> of module with 0 warnings.
[CHECKSTYLE] Successfully parsed file <https://builds.apache.org/job/Apache-falcon/ws/test-tools/pig-sharelib/target/checkstyle-result.xml> of module with 0 warnings.
[CHECKSTYLE] Successfully parsed file <https://builds.apache.org/job/Apache-falcon/ws/test-tools/target/checkstyle-result.xml> of module with 0 warnings.
[CHECKSTYLE] Successfully parsed file <https://builds.apache.org/job/Apache-falcon/ws/test-util/target/checkstyle-result.xml> of module with 0 warnings.
[CHECKSTYLE] Computing warning deltas based on reference build #529
[FINDBUGS] Collecting findbugs analysis files...
[FINDBUGS] Finding all files that match the pattern **/target/findbugs.xml
[FINDBUGS] Parsing 16 files in <https://builds.apache.org/job/Apache-falcon/ws/>
[FINDBUGS] Successfully parsed file <https://builds.apache.org/job/Apache-falcon/ws/client/target/findbugs.xml> of module with 0 warnings.
[FINDBUGS] Successfully parsed file <https://builds.apache.org/job/Apache-falcon/ws/common/target/findbugs.xml> of module with 0 warnings.
[FINDBUGS] Successfully parsed file <https://builds.apache.org/job/Apache-falcon/ws/feed/target/findbugs.xml> of module with 0 warnings.
[FINDBUGS] Successfully parsed file <https://builds.apache.org/job/Apache-falcon/ws/hadoop-dependencies/target/findbugs.xml> of module with 0 warnings.
[FINDBUGS] Successfully parsed file <https://builds.apache.org/job/Apache-falcon/ws/hadoop-webapp/target/findbugs.xml> of module with 0 warnings.
[FINDBUGS] Successfully parsed file <https://builds.apache.org/job/Apache-falcon/ws/messaging/target/findbugs.xml> of module with 0 warnings.
[FINDBUGS] Successfully parsed file <https://builds.apache.org/job/Apache-falcon/ws/metrics/target/findbugs.xml> of module with 0 warnings.
[FINDBUGS] Successfully parsed file <https://builds.apache.org/job/Apache-falcon/ws/oozie-el-extensions/target/findbugs.xml> of module with 0 warnings.
[FINDBUGS] Successfully parsed file <https://builds.apache.org/job/Apache-falcon/ws/oozie/target/findbugs.xml> of module with 0 warnings.
[FINDBUGS] Successfully parsed file <https://builds.apache.org/job/Apache-falcon/ws/prism/target/findbugs.xml> of module with 0 warnings.
[FINDBUGS] Successfully parsed file <https://builds.apache.org/job/Apache-falcon/ws/process/target/findbugs.xml> of module with 0 warnings.
[FINDBUGS] Successfully parsed file <https://builds.apache.org/job/Apache-falcon/ws/replication/target/findbugs.xml> of module with 0 warnings.
[FINDBUGS] Successfully parsed file <https://builds.apache.org/job/Apache-falcon/ws/rerun/target/findbugs.xml> of module with 0 warnings.
[FINDBUGS] Successfully parsed file <https://builds.apache.org/job/Apache-falcon/ws/retention/target/findbugs.xml> of module with 0 warnings.
[FINDBUGS] Successfully parsed file <https://builds.apache.org/job/Apache-falcon/ws/test-tools/hadoop-webapp/target/findbugs.xml> of module with 0 warnings.
[FINDBUGS] Successfully parsed file <https://builds.apache.org/job/Apache-falcon/ws/test-util/target/findbugs.xml> of module with 0 warnings.
[FINDBUGS] Computing warning deltas based on reference build #529
Archiving artifacts
Sending artifact delta relative to Apache-falcon #529
Archived 17 artifacts
Archive block size is 32768
Received 0 blocks and 8635371 bytes
Compression is 0.0%
Took 2.5 sec
Recording test results
TestNG Reports Processing: START
Looking for TestNG results report in workspace using pattern: **/target/testng-results.xml
Did not find any matching files.
Jenkins build is back to normal : Apache-falcon #544
Posted by Apache Jenkins Server <je...@builds.apache.org>.
See <https://builds.apache.org/job/Apache-falcon/544/changes>
Build failed in Jenkins: Apache-falcon #543
Posted by Apache Jenkins Server <je...@builds.apache.org>.
See <https://builds.apache.org/job/Apache-falcon/543/>
------------------------------------------
[...truncated 5048 lines...]
at org.testng.Assert.assertEquals(Assert.java:118)
at org.testng.Assert.assertEquals(Assert.java:365)
at org.testng.Assert.assertEquals(Assert.java:375)
at org.apache.falcon.cli.FalconCLIIT.submitTestFiles(FalconCLIIT.java:885)
at org.apache.falcon.cli.FalconCLIIT.testInstanceSuspendAndResume(FalconCLIIT.java:432)
testMetadataListCommands(org.apache.falcon.cli.FalconCLIIT) Time elapsed: 0.386 sec <<< FAILURE!
java.lang.AssertionError: expected:<0> but was:<-1>
at org.testng.Assert.fail(Assert.java:89)
at org.testng.Assert.failNotEquals(Assert.java:489)
at org.testng.Assert.assertEquals(Assert.java:118)
at org.testng.Assert.assertEquals(Assert.java:365)
at org.testng.Assert.assertEquals(Assert.java:375)
at org.apache.falcon.cli.FalconCLIIT.submitTestFiles(FalconCLIIT.java:885)
at org.apache.falcon.cli.FalconCLIIT.testMetadataListCommands(FalconCLIIT.java:590)
testMetadataRelationsCommands(org.apache.falcon.cli.FalconCLIIT) Time elapsed: 0.331 sec <<< FAILURE!
java.lang.AssertionError: expected:<0> but was:<-1>
at org.testng.Assert.fail(Assert.java:89)
at org.testng.Assert.failNotEquals(Assert.java:489)
at org.testng.Assert.assertEquals(Assert.java:118)
at org.testng.Assert.assertEquals(Assert.java:365)
at org.testng.Assert.assertEquals(Assert.java:375)
at org.apache.falcon.cli.FalconCLIIT.submitTestFiles(FalconCLIIT.java:885)
at org.apache.falcon.cli.FalconCLIIT.testMetadataRelationsCommands(FalconCLIIT.java:627)
testRecipeCommand(org.apache.falcon.cli.FalconCLIIT) Time elapsed: 0.347 sec <<< FAILURE!
java.lang.AssertionError: expected:<0> but was:<-1>
at org.testng.Assert.fail(Assert.java:89)
at org.testng.Assert.failNotEquals(Assert.java:489)
at org.testng.Assert.assertEquals(Assert.java:118)
at org.testng.Assert.assertEquals(Assert.java:365)
at org.testng.Assert.assertEquals(Assert.java:375)
at org.apache.falcon.cli.FalconCLIIT.recipeSetup(FalconCLIIT.java:826)
at org.apache.falcon.cli.FalconCLIIT.testRecipeCommand(FalconCLIIT.java:809)
testScheduleEntityValidCommands(org.apache.falcon.cli.FalconCLIIT) Time elapsed: 0.353 sec <<< FAILURE!
java.lang.AssertionError: expected:<0> but was:<-1>
at org.testng.Assert.fail(Assert.java:89)
at org.testng.Assert.failNotEquals(Assert.java:489)
at org.testng.Assert.assertEquals(Assert.java:118)
at org.testng.Assert.assertEquals(Assert.java:365)
at org.testng.Assert.assertEquals(Assert.java:375)
at org.apache.falcon.cli.FalconCLIIT.submitTestFiles(FalconCLIIT.java:885)
at org.apache.falcon.cli.FalconCLIIT.testScheduleEntityValidCommands(FalconCLIIT.java:169)
testSubmitAndScheduleEntityValidCommands(org.apache.falcon.cli.FalconCLIIT) Time elapsed: 0.462 sec <<< FAILURE!
java.lang.AssertionError: expected:<0> but was:<-1>
at org.testng.Assert.fail(Assert.java:89)
at org.testng.Assert.failNotEquals(Assert.java:489)
at org.testng.Assert.assertEquals(Assert.java:118)
at org.testng.Assert.assertEquals(Assert.java:365)
at org.testng.Assert.assertEquals(Assert.java:375)
at org.apache.falcon.cli.FalconCLIIT.testSubmitAndScheduleEntityValidCommands(FalconCLIIT.java:108)
testSubmitEntityValidCommands(org.apache.falcon.cli.FalconCLIIT) Time elapsed: 0.316 sec <<< FAILURE!
java.lang.AssertionError: expected:<0> but was:<-1>
at org.testng.Assert.fail(Assert.java:89)
at org.testng.Assert.failNotEquals(Assert.java:489)
at org.testng.Assert.assertEquals(Assert.java:118)
at org.testng.Assert.assertEquals(Assert.java:365)
at org.testng.Assert.assertEquals(Assert.java:375)
at org.apache.falcon.cli.FalconCLIIT.testSubmitEntityValidCommands(FalconCLIIT.java:66)
testSuspendResumeStatusEntityValidCommands(org.apache.falcon.cli.FalconCLIIT) Time elapsed: 0.334 sec <<< FAILURE!
java.lang.AssertionError: expected:<0> but was:<-1>
at org.testng.Assert.fail(Assert.java:89)
at org.testng.Assert.failNotEquals(Assert.java:489)
at org.testng.Assert.assertEquals(Assert.java:118)
at org.testng.Assert.assertEquals(Assert.java:365)
at org.testng.Assert.assertEquals(Assert.java:375)
at org.apache.falcon.cli.FalconCLIIT.submitTestFiles(FalconCLIIT.java:885)
at org.apache.falcon.cli.FalconCLIIT.testSuspendResumeStatusEntityValidCommands(FalconCLIIT.java:183)
testValidateValidCommands(org.apache.falcon.cli.FalconCLIIT) Time elapsed: 0.316 sec <<< FAILURE!
java.lang.AssertionError: expected:<0> but was:<-1>
at org.testng.Assert.fail(Assert.java:89)
at org.testng.Assert.failNotEquals(Assert.java:489)
at org.testng.Assert.assertEquals(Assert.java:118)
at org.testng.Assert.assertEquals(Assert.java:365)
at org.testng.Assert.assertEquals(Assert.java:375)
at org.apache.falcon.cli.FalconCLIIT.testValidateValidCommands(FalconCLIIT.java:131)
Running org.apache.falcon.catalog.HiveCatalogServiceIT
Tests run: 21, Failures: 0, Errors: 0, Skipped: 0, Time elapsed: 14.64 sec - in org.apache.falcon.catalog.HiveCatalogServiceIT
Results :
Failed tests:
FeedEntityValidationIT.testFeedEntityWithInvalidTableUri:138 expected:<200> but was:<400>
FeedEntityValidationIT.testFeedEntityWithInvalidTableUri:138 expected:<200> but was:<400>
FeedEntityValidationIT.testFeedEntityWithInvalidTableUri:138 expected:<200> but was:<400>
FeedEntityValidationIT.testFeedEntityWithInvalidTableUri:138 expected:<200> but was:<400>
FeedEntityValidationIT.testFeedEntityWithInvalidTableUri:138 expected:<200> but was:<400>
FeedEntityValidationIT.testFeedEntityWithInvalidTableUri:138 expected:<200> but was:<400>
FeedEntityValidationIT.testFeedEntityWithValidTable:81 expected:<200> but was:<400>
ClusterEntityValidationIT.testClusterEntityWithValidInterfaces:89 expected:<200> but was:<400>
ClusterEntityValidationIT.testValidateACL:150 expected:<200> but was:<400>
ClusterEntityValidationIT.testValidateClusterLocations:156 » Validation Invali...
EntityManagerPaginationJerseyIT.prepare:42->scheduleMultipleProcess:155 expected:<200> but was:<400>
EntityManagerJerseyIT.testClusterSubmitScheduleSuspendResumeDelete:463 expected:<200> but was:<400>
EntityManagerJerseyIT.cleanup:183 » OozieClient java.io.IOException: Error whi...
EntityManagerJerseySmokeIT.testFeedSchedule:110 expected:<200> but was:<400>
EntityManagerJerseySmokeIT.cleanup:60 » OozieClient java.io.IOException: Error...
MetadataResourceJerseyIT.prepare:51 expected:<200> but was:<400>
FalconCLISmokeIT.testSubmitAndScheduleEntityValidCommands:58 expected:<0> but was:<-1>
FalconCLIIT.testClientProperties:723->submitTestFiles:885 expected:<0> but was:<-1>
FalconCLIIT.testContinue:661->submitTestFiles:885 expected:<0> but was:<-1>
FalconCLIIT.testDefinitionEntityValidCommands:153->submitTestFiles:885 expected:<0> but was:<-1>
FalconCLIIT.testDeleteEntityValidCommands:246->submitTestFiles:885 expected:<0> but was:<-1>
FalconCLIIT.testEntityLineage:499 expected:<0> but was:<-1>
FalconCLIIT.testEntityPaginationFilterByCommands:526 expected:<0> but was:<-1>
FalconCLIIT.testInstanceGetLogs:749->submitTestFiles:885 expected:<0> but was:<-1>
FalconCLIIT.testInstanceKillAndRerun:462->submitTestFiles:885 expected:<0> but was:<-1>
FalconCLIIT.testInstanceRunningAndStatusCommands:275->submitTestFiles:885 expected:<0> but was:<-1>
FalconCLIIT.testInstanceRunningAndSummaryCommands:404->submitTestFiles:885 expected:<0> but was:<-1>
FalconCLIIT.testInstanceSuspendAndResume:432->submitTestFiles:885 expected:<0> but was:<-1>
FalconCLIIT.testMetadataListCommands:590->submitTestFiles:885 expected:<0> but was:<-1>
FalconCLIIT.testMetadataRelationsCommands:627->submitTestFiles:885 expected:<0> but was:<-1>
FalconCLIIT.testRecipeCommand:809->recipeSetup:826 expected:<0> but was:<-1>
FalconCLIIT.testScheduleEntityValidCommands:169->submitTestFiles:885 expected:<0> but was:<-1>
FalconCLIIT.testSubmitAndScheduleEntityValidCommands:108 expected:<0> but was:<-1>
FalconCLIIT.testSubmitEntityValidCommands:66 expected:<0> but was:<-1>
FalconCLIIT.testSuspendResumeStatusEntityValidCommands:183->submitTestFiles:885 expected:<0> but was:<-1>
FalconCLIIT.testValidateValidCommands:131 expected:<0> but was:<-1>
Tests run: 158, Failures: 36, Errors: 0, Skipped: 57
[INFO]
[INFO] --- maven-jetty-plugin:6.1.26:stop (stop-jetty) @ falcon-webapp ---
[INFO]
[INFO] --- maven-failsafe-plugin:2.16:verify (verify) @ falcon-webapp ---
[INFO] Stopping server 0
[INFO] Stopped SelectChannelConnector@0.0.0.0:41000
[INFO] Stopped SslSocketConnector@0.0.0.0:41443
[INFO] Failsafe report directory: <https://builds.apache.org/job/Apache-falcon/ws/webapp/target/failsafe-reports>
[INFO] ------------------------------------------------------------------------
[INFO] Reactor Summary:
[INFO]
[INFO] Checkstyle ........................................ SUCCESS [ 1.010 s]
[INFO] Apache Falcon ..................................... SUCCESS [ 5.174 s]
[INFO] Build Tools ....................................... SUCCESS [ 3.737 s]
[INFO] Apache Falcon CLI client .......................... SUCCESS [ 27.187 s]
[INFO] Apache Falcon Metrics ............................. SUCCESS [ 12.171 s]
[INFO] Apache Falcon Hadoop Dependencies ................. SUCCESS [ 14.215 s]
[INFO] Apache Falcon Test Utility ........................ SUCCESS [ 11.361 s]
[INFO] Apache Falcon Commons ............................. SUCCESS [01:36 min]
[INFO] Apache Falcon Oozie EL Extension .................. SUCCESS [ 14.293 s]
[INFO] Apache Falcon Embedded Hadoop - Test Cluster ...... SUCCESS [ 29.501 s]
[INFO] Apache Falcon Sharelib Hive - Test Cluster ........ SUCCESS [ 1.189 s]
[INFO] Apache Falcon Sharelib Pig - Test Cluster ......... SUCCESS [ 0.786 s]
[INFO] Apache Falcon Sharelib Hcatalog - Test Cluster .... SUCCESS [ 0.931 s]
[INFO] Apache Falcon Sharelib Oozie - Test Cluster ....... SUCCESS [ 0.546 s]
[INFO] Apache Falcon Test Tools - Test Cluster ........... SUCCESS [ 0.500 s]
[INFO] Apache Falcon Messaging ........................... SUCCESS [ 25.781 s]
[INFO] Apache Falcon Oozie Adaptor ....................... SUCCESS [ 49.921 s]
[INFO] Apache Falcon Acquisition ......................... SUCCESS [ 0.550 s]
[INFO] Apache Falcon Replication ......................... SUCCESS [ 18.103 s]
[INFO] Apache Falcon Retention ........................... SUCCESS [ 16.576 s]
[INFO] Apache Falcon Archival ............................ SUCCESS [ 0.534 s]
[INFO] Apache Falcon Rerun ............................... SUCCESS [ 25.823 s]
[INFO] Apache Falcon Prism ............................... SUCCESS [ 56.165 s]
[INFO] Apache Falcon Web Application ..................... FAILURE [02:19 min]
[INFO] Apache Falcon Documentation ....................... SKIPPED
[INFO] ------------------------------------------------------------------------
[INFO] BUILD FAILURE
[INFO] ------------------------------------------------------------------------
[INFO] Total time: 09:12 min
[INFO] Finished at: 2015-01-20T01:30:52+00:00
[INFO] Final Memory: 445M/1106M
[INFO] ------------------------------------------------------------------------
[ERROR] Failed to execute goal org.apache.maven.plugins:maven-failsafe-plugin:2.16:verify (verify) on project falcon-webapp: There are test failures.
[ERROR]
[ERROR] Please refer to <https://builds.apache.org/job/Apache-falcon/ws/webapp/target/failsafe-reports> for the individual test results.
[ERROR] -> [Help 1]
[ERROR]
[ERROR] To see the full stack trace of the errors, re-run Maven with the -e switch.
[ERROR] Re-run Maven using the -X switch to enable full debug logging.
[ERROR]
[ERROR] For more information about the errors and possible solutions, please read the following articles:
[ERROR] [Help 1] http://cwiki.apache.org/confluence/display/MAVEN/MojoFailureException
[ERROR]
[ERROR] After correcting the problems, you can resume the build with the command
[ERROR] mvn <goals> -rf :falcon-webapp
[INFO] Shutdown hook executing
Shutting down hive metastore.
[INFO] Shutdown hook complete
Build step 'Execute shell' marked build as failure
[CHECKSTYLE] Collecting checkstyle analysis files...
[CHECKSTYLE] Finding all files that match the pattern **/target/checkstyle-result.xml
[CHECKSTYLE] Parsing 26 files in <https://builds.apache.org/job/Apache-falcon/ws/>
[CHECKSTYLE] Successfully parsed file <https://builds.apache.org/job/Apache-falcon/ws/acquisition/target/checkstyle-result.xml> of module with 0 warnings.
[CHECKSTYLE] Successfully parsed file <https://builds.apache.org/job/Apache-falcon/ws/archival/target/checkstyle-result.xml> of module with 0 warnings.
[CHECKSTYLE] Successfully parsed file <https://builds.apache.org/job/Apache-falcon/ws/build-tools/target/checkstyle-result.xml> of module with 0 warnings.
[CHECKSTYLE] Successfully parsed file <https://builds.apache.org/job/Apache-falcon/ws/client/target/checkstyle-result.xml> of module with 0 warnings.
[CHECKSTYLE] Successfully parsed file <https://builds.apache.org/job/Apache-falcon/ws/common/target/checkstyle-result.xml> of module with 0 warnings.
[CHECKSTYLE] Successfully parsed file <https://builds.apache.org/job/Apache-falcon/ws/docs/target/checkstyle-result.xml> of module with 0 warnings.
[CHECKSTYLE] Successfully parsed file <https://builds.apache.org/job/Apache-falcon/ws/feed/target/checkstyle-result.xml> of module with 0 warnings.
[CHECKSTYLE] Successfully parsed file <https://builds.apache.org/job/Apache-falcon/ws/hadoop-dependencies/target/checkstyle-result.xml> of module with 0 warnings.
[CHECKSTYLE] Successfully parsed file <https://builds.apache.org/job/Apache-falcon/ws/hadoop-webapp/target/checkstyle-result.xml> of module with 0 warnings.
[CHECKSTYLE] Successfully parsed file <https://builds.apache.org/job/Apache-falcon/ws/messaging/target/checkstyle-result.xml> of module with 0 warnings.
[CHECKSTYLE] Successfully parsed file <https://builds.apache.org/job/Apache-falcon/ws/metrics/target/checkstyle-result.xml> of module with 0 warnings.
[CHECKSTYLE] Successfully parsed file <https://builds.apache.org/job/Apache-falcon/ws/oozie-el-extensions/target/checkstyle-result.xml> of module with 0 warnings.
[CHECKSTYLE] Successfully parsed file <https://builds.apache.org/job/Apache-falcon/ws/oozie/target/checkstyle-result.xml> of module with 0 warnings.
[CHECKSTYLE] Successfully parsed file <https://builds.apache.org/job/Apache-falcon/ws/prism/target/checkstyle-result.xml> of module with 0 warnings.
[CHECKSTYLE] Successfully parsed file <https://builds.apache.org/job/Apache-falcon/ws/process/target/checkstyle-result.xml> of module with 0 warnings.
[CHECKSTYLE] Successfully parsed file <https://builds.apache.org/job/Apache-falcon/ws/replication/target/checkstyle-result.xml> of module with 0 warnings.
[CHECKSTYLE] Successfully parsed file <https://builds.apache.org/job/Apache-falcon/ws/rerun/target/checkstyle-result.xml> of module with 0 warnings.
[CHECKSTYLE] Successfully parsed file <https://builds.apache.org/job/Apache-falcon/ws/retention/target/checkstyle-result.xml> of module with 0 warnings.
[CHECKSTYLE] Successfully parsed file <https://builds.apache.org/job/Apache-falcon/ws/target/checkstyle-result.xml> of module with 0 warnings.
[CHECKSTYLE] Successfully parsed file <https://builds.apache.org/job/Apache-falcon/ws/test-tools/hadoop-webapp/target/checkstyle-result.xml> of module with 0 warnings.
[CHECKSTYLE] Successfully parsed file <https://builds.apache.org/job/Apache-falcon/ws/test-tools/hcatalog-sharelib/target/checkstyle-result.xml> of module with 0 warnings.
[CHECKSTYLE] Successfully parsed file <https://builds.apache.org/job/Apache-falcon/ws/test-tools/hive-sharelib/target/checkstyle-result.xml> of module with 0 warnings.
[CHECKSTYLE] Successfully parsed file <https://builds.apache.org/job/Apache-falcon/ws/test-tools/oozie-sharelib/target/checkstyle-result.xml> of module with 0 warnings.
[CHECKSTYLE] Successfully parsed file <https://builds.apache.org/job/Apache-falcon/ws/test-tools/pig-sharelib/target/checkstyle-result.xml> of module with 0 warnings.
[CHECKSTYLE] Successfully parsed file <https://builds.apache.org/job/Apache-falcon/ws/test-tools/target/checkstyle-result.xml> of module with 0 warnings.
[CHECKSTYLE] Successfully parsed file <https://builds.apache.org/job/Apache-falcon/ws/test-util/target/checkstyle-result.xml> of module with 0 warnings.
[CHECKSTYLE] Computing warning deltas based on reference build #529
[FINDBUGS] Collecting findbugs analysis files...
[FINDBUGS] Finding all files that match the pattern **/target/findbugs.xml
[FINDBUGS] Parsing 16 files in <https://builds.apache.org/job/Apache-falcon/ws/>
[FINDBUGS] Successfully parsed file <https://builds.apache.org/job/Apache-falcon/ws/client/target/findbugs.xml> of module with 0 warnings.
[FINDBUGS] Successfully parsed file <https://builds.apache.org/job/Apache-falcon/ws/common/target/findbugs.xml> of module with 0 warnings.
[FINDBUGS] Successfully parsed file <https://builds.apache.org/job/Apache-falcon/ws/feed/target/findbugs.xml> of module with 0 warnings.
[FINDBUGS] Successfully parsed file <https://builds.apache.org/job/Apache-falcon/ws/hadoop-dependencies/target/findbugs.xml> of module with 0 warnings.
[FINDBUGS] Successfully parsed file <https://builds.apache.org/job/Apache-falcon/ws/hadoop-webapp/target/findbugs.xml> of module with 0 warnings.
[FINDBUGS] Successfully parsed file <https://builds.apache.org/job/Apache-falcon/ws/messaging/target/findbugs.xml> of module with 0 warnings.
[FINDBUGS] Successfully parsed file <https://builds.apache.org/job/Apache-falcon/ws/metrics/target/findbugs.xml> of module with 0 warnings.
[FINDBUGS] Successfully parsed file <https://builds.apache.org/job/Apache-falcon/ws/oozie-el-extensions/target/findbugs.xml> of module with 0 warnings.
[FINDBUGS] Successfully parsed file <https://builds.apache.org/job/Apache-falcon/ws/oozie/target/findbugs.xml> of module with 0 warnings.
[FINDBUGS] Successfully parsed file <https://builds.apache.org/job/Apache-falcon/ws/prism/target/findbugs.xml> of module with 0 warnings.
[FINDBUGS] Successfully parsed file <https://builds.apache.org/job/Apache-falcon/ws/process/target/findbugs.xml> of module with 0 warnings.
[FINDBUGS] Successfully parsed file <https://builds.apache.org/job/Apache-falcon/ws/replication/target/findbugs.xml> of module with 0 warnings.
[FINDBUGS] Successfully parsed file <https://builds.apache.org/job/Apache-falcon/ws/rerun/target/findbugs.xml> of module with 0 warnings.
[FINDBUGS] Successfully parsed file <https://builds.apache.org/job/Apache-falcon/ws/retention/target/findbugs.xml> of module with 0 warnings.
[FINDBUGS] Successfully parsed file <https://builds.apache.org/job/Apache-falcon/ws/test-tools/hadoop-webapp/target/findbugs.xml> of module with 0 warnings.
[FINDBUGS] Successfully parsed file <https://builds.apache.org/job/Apache-falcon/ws/test-util/target/findbugs.xml> of module with 0 warnings.
[FINDBUGS] Computing warning deltas based on reference build #529
Archiving artifacts
Sending artifact delta relative to Apache-falcon #529
Archived 17 artifacts
Archive block size is 32768
Received 0 blocks and 8635325 bytes
Compression is 0.0%
Took 2.2 sec
Recording test results
TestNG Reports Processing: START
Looking for TestNG results report in workspace using pattern: **/target/testng-results.xml
Did not find any matching files.
Build failed in Jenkins: Apache-falcon #542
Posted by Apache Jenkins Server <je...@builds.apache.org>.
See <https://builds.apache.org/job/Apache-falcon/542/>
------------------------------------------
[...truncated 5045 lines...]
at org.testng.Assert.assertEquals(Assert.java:118)
at org.testng.Assert.assertEquals(Assert.java:365)
at org.testng.Assert.assertEquals(Assert.java:375)
at org.apache.falcon.cli.FalconCLIIT.submitTestFiles(FalconCLIIT.java:885)
at org.apache.falcon.cli.FalconCLIIT.testInstanceSuspendAndResume(FalconCLIIT.java:432)
testMetadataListCommands(org.apache.falcon.cli.FalconCLIIT) Time elapsed: 0.344 sec <<< FAILURE!
java.lang.AssertionError: expected:<0> but was:<-1>
at org.testng.Assert.fail(Assert.java:89)
at org.testng.Assert.failNotEquals(Assert.java:489)
at org.testng.Assert.assertEquals(Assert.java:118)
at org.testng.Assert.assertEquals(Assert.java:365)
at org.testng.Assert.assertEquals(Assert.java:375)
at org.apache.falcon.cli.FalconCLIIT.submitTestFiles(FalconCLIIT.java:885)
at org.apache.falcon.cli.FalconCLIIT.testMetadataListCommands(FalconCLIIT.java:590)
testMetadataRelationsCommands(org.apache.falcon.cli.FalconCLIIT) Time elapsed: 0.331 sec <<< FAILURE!
java.lang.AssertionError: expected:<0> but was:<-1>
at org.testng.Assert.fail(Assert.java:89)
at org.testng.Assert.failNotEquals(Assert.java:489)
at org.testng.Assert.assertEquals(Assert.java:118)
at org.testng.Assert.assertEquals(Assert.java:365)
at org.testng.Assert.assertEquals(Assert.java:375)
at org.apache.falcon.cli.FalconCLIIT.submitTestFiles(FalconCLIIT.java:885)
at org.apache.falcon.cli.FalconCLIIT.testMetadataRelationsCommands(FalconCLIIT.java:627)
testRecipeCommand(org.apache.falcon.cli.FalconCLIIT) Time elapsed: 0.348 sec <<< FAILURE!
java.lang.AssertionError: expected:<0> but was:<-1>
at org.testng.Assert.fail(Assert.java:89)
at org.testng.Assert.failNotEquals(Assert.java:489)
at org.testng.Assert.assertEquals(Assert.java:118)
at org.testng.Assert.assertEquals(Assert.java:365)
at org.testng.Assert.assertEquals(Assert.java:375)
at org.apache.falcon.cli.FalconCLIIT.recipeSetup(FalconCLIIT.java:826)
at org.apache.falcon.cli.FalconCLIIT.testRecipeCommand(FalconCLIIT.java:809)
testScheduleEntityValidCommands(org.apache.falcon.cli.FalconCLIIT) Time elapsed: 0.352 sec <<< FAILURE!
java.lang.AssertionError: expected:<0> but was:<-1>
at org.testng.Assert.fail(Assert.java:89)
at org.testng.Assert.failNotEquals(Assert.java:489)
at org.testng.Assert.assertEquals(Assert.java:118)
at org.testng.Assert.assertEquals(Assert.java:365)
at org.testng.Assert.assertEquals(Assert.java:375)
at org.apache.falcon.cli.FalconCLIIT.submitTestFiles(FalconCLIIT.java:885)
at org.apache.falcon.cli.FalconCLIIT.testScheduleEntityValidCommands(FalconCLIIT.java:169)
testSubmitAndScheduleEntityValidCommands(org.apache.falcon.cli.FalconCLIIT) Time elapsed: 0.471 sec <<< FAILURE!
java.lang.AssertionError: expected:<0> but was:<-1>
at org.testng.Assert.fail(Assert.java:89)
at org.testng.Assert.failNotEquals(Assert.java:489)
at org.testng.Assert.assertEquals(Assert.java:118)
at org.testng.Assert.assertEquals(Assert.java:365)
at org.testng.Assert.assertEquals(Assert.java:375)
at org.apache.falcon.cli.FalconCLIIT.testSubmitAndScheduleEntityValidCommands(FalconCLIIT.java:108)
testSubmitEntityValidCommands(org.apache.falcon.cli.FalconCLIIT) Time elapsed: 0.345 sec <<< FAILURE!
java.lang.AssertionError: expected:<0> but was:<-1>
at org.testng.Assert.fail(Assert.java:89)
at org.testng.Assert.failNotEquals(Assert.java:489)
at org.testng.Assert.assertEquals(Assert.java:118)
at org.testng.Assert.assertEquals(Assert.java:365)
at org.testng.Assert.assertEquals(Assert.java:375)
at org.apache.falcon.cli.FalconCLIIT.testSubmitEntityValidCommands(FalconCLIIT.java:66)
testSuspendResumeStatusEntityValidCommands(org.apache.falcon.cli.FalconCLIIT) Time elapsed: 0.339 sec <<< FAILURE!
java.lang.AssertionError: expected:<0> but was:<-1>
at org.testng.Assert.fail(Assert.java:89)
at org.testng.Assert.failNotEquals(Assert.java:489)
at org.testng.Assert.assertEquals(Assert.java:118)
at org.testng.Assert.assertEquals(Assert.java:365)
at org.testng.Assert.assertEquals(Assert.java:375)
at org.apache.falcon.cli.FalconCLIIT.submitTestFiles(FalconCLIIT.java:885)
at org.apache.falcon.cli.FalconCLIIT.testSuspendResumeStatusEntityValidCommands(FalconCLIIT.java:183)
testValidateValidCommands(org.apache.falcon.cli.FalconCLIIT) Time elapsed: 0.309 sec <<< FAILURE!
java.lang.AssertionError: expected:<0> but was:<-1>
at org.testng.Assert.fail(Assert.java:89)
at org.testng.Assert.failNotEquals(Assert.java:489)
at org.testng.Assert.assertEquals(Assert.java:118)
at org.testng.Assert.assertEquals(Assert.java:365)
at org.testng.Assert.assertEquals(Assert.java:375)
at org.apache.falcon.cli.FalconCLIIT.testValidateValidCommands(FalconCLIIT.java:131)
Running org.apache.falcon.catalog.HiveCatalogServiceIT
Tests run: 21, Failures: 0, Errors: 0, Skipped: 0, Time elapsed: 14.532 sec - in org.apache.falcon.catalog.HiveCatalogServiceIT
Results :
Failed tests:
FeedEntityValidationIT.testFeedEntityWithInvalidTableUri:138 expected:<200> but was:<400>
FeedEntityValidationIT.testFeedEntityWithInvalidTableUri:138 expected:<200> but was:<400>
FeedEntityValidationIT.testFeedEntityWithInvalidTableUri:138 expected:<200> but was:<400>
FeedEntityValidationIT.testFeedEntityWithInvalidTableUri:138 expected:<200> but was:<400>
FeedEntityValidationIT.testFeedEntityWithInvalidTableUri:138 expected:<200> but was:<400>
FeedEntityValidationIT.testFeedEntityWithInvalidTableUri:138 expected:<200> but was:<400>
FeedEntityValidationIT.testFeedEntityWithValidTable:81 expected:<200> but was:<400>
ClusterEntityValidationIT.testClusterEntityWithValidInterfaces:89 expected:<200> but was:<400>
ClusterEntityValidationIT.testValidateACL:150 expected:<200> but was:<400>
ClusterEntityValidationIT.testValidateClusterLocations:156 » Validation Invali...
EntityManagerPaginationJerseyIT.prepare:42->scheduleMultipleProcess:155 expected:<200> but was:<400>
EntityManagerJerseyIT.testClusterSubmitScheduleSuspendResumeDelete:463 expected:<200> but was:<400>
EntityManagerJerseyIT.cleanup:183 » OozieClient java.io.IOException: Error whi...
EntityManagerJerseySmokeIT.testFeedSchedule:110 expected:<200> but was:<400>
EntityManagerJerseySmokeIT.cleanup:60 » OozieClient java.io.IOException: Error...
MetadataResourceJerseyIT.prepare:51 expected:<200> but was:<400>
FalconCLISmokeIT.testSubmitAndScheduleEntityValidCommands:58 expected:<0> but was:<-1>
FalconCLIIT.testClientProperties:723->submitTestFiles:885 expected:<0> but was:<-1>
FalconCLIIT.testContinue:661->submitTestFiles:885 expected:<0> but was:<-1>
FalconCLIIT.testDefinitionEntityValidCommands:153->submitTestFiles:885 expected:<0> but was:<-1>
FalconCLIIT.testDeleteEntityValidCommands:246->submitTestFiles:885 expected:<0> but was:<-1>
FalconCLIIT.testEntityLineage:499 expected:<0> but was:<-1>
FalconCLIIT.testEntityPaginationFilterByCommands:526 expected:<0> but was:<-1>
FalconCLIIT.testInstanceGetLogs:749->submitTestFiles:885 expected:<0> but was:<-1>
FalconCLIIT.testInstanceKillAndRerun:462->submitTestFiles:885 expected:<0> but was:<-1>
FalconCLIIT.testInstanceRunningAndStatusCommands:275->submitTestFiles:885 expected:<0> but was:<-1>
FalconCLIIT.testInstanceRunningAndSummaryCommands:404->submitTestFiles:885 expected:<0> but was:<-1>
FalconCLIIT.testInstanceSuspendAndResume:432->submitTestFiles:885 expected:<0> but was:<-1>
FalconCLIIT.testMetadataListCommands:590->submitTestFiles:885 expected:<0> but was:<-1>
FalconCLIIT.testMetadataRelationsCommands:627->submitTestFiles:885 expected:<0> but was:<-1>
FalconCLIIT.testRecipeCommand:809->recipeSetup:826 expected:<0> but was:<-1>
FalconCLIIT.testScheduleEntityValidCommands:169->submitTestFiles:885 expected:<0> but was:<-1>
FalconCLIIT.testSubmitAndScheduleEntityValidCommands:108 expected:<0> but was:<-1>
FalconCLIIT.testSubmitEntityValidCommands:66 expected:<0> but was:<-1>
FalconCLIIT.testSuspendResumeStatusEntityValidCommands:183->submitTestFiles:885 expected:<0> but was:<-1>
FalconCLIIT.testValidateValidCommands:131 expected:<0> but was:<-1>
Tests run: 158, Failures: 36, Errors: 0, Skipped: 57
[INFO]
[INFO] --- maven-jetty-plugin:6.1.26:stop (stop-jetty) @ falcon-webapp ---
[INFO]
[INFO] --- maven-failsafe-plugin:2.16:verify (verify) @ falcon-webapp ---
[INFO] Stopping server 0
[INFO] Stopped SelectChannelConnector@0.0.0.0:41000
[INFO] Stopped SslSocketConnector@0.0.0.0:41443
[INFO] Failsafe report directory: <https://builds.apache.org/job/Apache-falcon/ws/webapp/target/failsafe-reports>
[INFO] ------------------------------------------------------------------------
[INFO] Reactor Summary:
[INFO]
[INFO] Checkstyle ........................................ SUCCESS [ 1.010 s]
[INFO] Apache Falcon ..................................... SUCCESS [ 5.608 s]
[INFO] Build Tools ....................................... SUCCESS [ 3.763 s]
[INFO] Apache Falcon CLI client .......................... SUCCESS [ 26.177 s]
[INFO] Apache Falcon Metrics ............................. SUCCESS [ 11.237 s]
[INFO] Apache Falcon Hadoop Dependencies ................. SUCCESS [ 13.816 s]
[INFO] Apache Falcon Test Utility ........................ SUCCESS [ 11.541 s]
[INFO] Apache Falcon Commons ............................. SUCCESS [01:35 min]
[INFO] Apache Falcon Oozie EL Extension .................. SUCCESS [ 14.153 s]
[INFO] Apache Falcon Embedded Hadoop - Test Cluster ...... SUCCESS [ 29.533 s]
[INFO] Apache Falcon Sharelib Hive - Test Cluster ........ SUCCESS [ 1.202 s]
[INFO] Apache Falcon Sharelib Pig - Test Cluster ......... SUCCESS [ 0.726 s]
[INFO] Apache Falcon Sharelib Hcatalog - Test Cluster .... SUCCESS [ 0.990 s]
[INFO] Apache Falcon Sharelib Oozie - Test Cluster ....... SUCCESS [ 0.548 s]
[INFO] Apache Falcon Test Tools - Test Cluster ........... SUCCESS [ 0.477 s]
[INFO] Apache Falcon Messaging ........................... SUCCESS [ 26.189 s]
[INFO] Apache Falcon Oozie Adaptor ....................... SUCCESS [ 50.286 s]
[INFO] Apache Falcon Acquisition ......................... SUCCESS [ 0.566 s]
[INFO] Apache Falcon Replication ......................... SUCCESS [ 17.538 s]
[INFO] Apache Falcon Retention ........................... SUCCESS [ 16.539 s]
[INFO] Apache Falcon Archival ............................ SUCCESS [ 0.516 s]
[INFO] Apache Falcon Rerun ............................... SUCCESS [ 24.201 s]
[INFO] Apache Falcon Prism ............................... SUCCESS [ 55.809 s]
[INFO] Apache Falcon Web Application ..................... FAILURE [02:16 min]
[INFO] Apache Falcon Documentation ....................... SKIPPED
[INFO] ------------------------------------------------------------------------
[INFO] BUILD FAILURE
[INFO] ------------------------------------------------------------------------
[INFO] Total time: 09:04 min
[INFO] Finished at: 2015-01-19T00:31:12+00:00
[INFO] Final Memory: 445M/725M
[INFO] ------------------------------------------------------------------------
[ERROR] Failed to execute goal org.apache.maven.plugins:maven-failsafe-plugin:2.16:verify (verify) on project falcon-webapp: There are test failures.
[ERROR]
[ERROR] Please refer to <https://builds.apache.org/job/Apache-falcon/ws/webapp/target/failsafe-reports> for the individual test results.
[ERROR] -> [Help 1]
[ERROR]
[ERROR] To see the full stack trace of the errors, re-run Maven with the -e switch.
[ERROR] Re-run Maven using the -X switch to enable full debug logging.
[ERROR]
[ERROR] For more information about the errors and possible solutions, please read the following articles:
[ERROR] [Help 1] http://cwiki.apache.org/confluence/display/MAVEN/MojoFailureException
[ERROR]
[ERROR] After correcting the problems, you can resume the build with the command
[ERROR] mvn <goals> -rf :falcon-webapp
[INFO] Shutdown hook executing
Shutting down hive metastore.
[INFO] Shutdown hook complete
Build step 'Execute shell' marked build as failure
[CHECKSTYLE] Collecting checkstyle analysis files...
[CHECKSTYLE] Finding all files that match the pattern **/target/checkstyle-result.xml
[CHECKSTYLE] Parsing 26 files in <https://builds.apache.org/job/Apache-falcon/ws/>
[CHECKSTYLE] Successfully parsed file <https://builds.apache.org/job/Apache-falcon/ws/acquisition/target/checkstyle-result.xml> of module with 0 warnings.
[CHECKSTYLE] Successfully parsed file <https://builds.apache.org/job/Apache-falcon/ws/archival/target/checkstyle-result.xml> of module with 0 warnings.
[CHECKSTYLE] Successfully parsed file <https://builds.apache.org/job/Apache-falcon/ws/build-tools/target/checkstyle-result.xml> of module with 0 warnings.
[CHECKSTYLE] Successfully parsed file <https://builds.apache.org/job/Apache-falcon/ws/client/target/checkstyle-result.xml> of module with 0 warnings.
[CHECKSTYLE] Successfully parsed file <https://builds.apache.org/job/Apache-falcon/ws/common/target/checkstyle-result.xml> of module with 0 warnings.
[CHECKSTYLE] Successfully parsed file <https://builds.apache.org/job/Apache-falcon/ws/docs/target/checkstyle-result.xml> of module with 0 warnings.
[CHECKSTYLE] Successfully parsed file <https://builds.apache.org/job/Apache-falcon/ws/feed/target/checkstyle-result.xml> of module with 0 warnings.
[CHECKSTYLE] Successfully parsed file <https://builds.apache.org/job/Apache-falcon/ws/hadoop-dependencies/target/checkstyle-result.xml> of module with 0 warnings.
[CHECKSTYLE] Successfully parsed file <https://builds.apache.org/job/Apache-falcon/ws/hadoop-webapp/target/checkstyle-result.xml> of module with 0 warnings.
[CHECKSTYLE] Successfully parsed file <https://builds.apache.org/job/Apache-falcon/ws/messaging/target/checkstyle-result.xml> of module with 0 warnings.
[CHECKSTYLE] Successfully parsed file <https://builds.apache.org/job/Apache-falcon/ws/metrics/target/checkstyle-result.xml> of module with 0 warnings.
[CHECKSTYLE] Successfully parsed file <https://builds.apache.org/job/Apache-falcon/ws/oozie-el-extensions/target/checkstyle-result.xml> of module with 0 warnings.
[CHECKSTYLE] Successfully parsed file <https://builds.apache.org/job/Apache-falcon/ws/oozie/target/checkstyle-result.xml> of module with 0 warnings.
[CHECKSTYLE] Successfully parsed file <https://builds.apache.org/job/Apache-falcon/ws/prism/target/checkstyle-result.xml> of module with 0 warnings.
[CHECKSTYLE] Successfully parsed file <https://builds.apache.org/job/Apache-falcon/ws/process/target/checkstyle-result.xml> of module with 0 warnings.
[CHECKSTYLE] Successfully parsed file <https://builds.apache.org/job/Apache-falcon/ws/replication/target/checkstyle-result.xml> of module with 0 warnings.
[CHECKSTYLE] Successfully parsed file <https://builds.apache.org/job/Apache-falcon/ws/rerun/target/checkstyle-result.xml> of module with 0 warnings.
[CHECKSTYLE] Successfully parsed file <https://builds.apache.org/job/Apache-falcon/ws/retention/target/checkstyle-result.xml> of module with 0 warnings.
[CHECKSTYLE] Successfully parsed file <https://builds.apache.org/job/Apache-falcon/ws/target/checkstyle-result.xml> of module with 0 warnings.
[CHECKSTYLE] Successfully parsed file <https://builds.apache.org/job/Apache-falcon/ws/test-tools/hadoop-webapp/target/checkstyle-result.xml> of module with 0 warnings.
[CHECKSTYLE] Successfully parsed file <https://builds.apache.org/job/Apache-falcon/ws/test-tools/hcatalog-sharelib/target/checkstyle-result.xml> of module with 0 warnings.
[CHECKSTYLE] Successfully parsed file <https://builds.apache.org/job/Apache-falcon/ws/test-tools/hive-sharelib/target/checkstyle-result.xml> of module with 0 warnings.
[CHECKSTYLE] Successfully parsed file <https://builds.apache.org/job/Apache-falcon/ws/test-tools/oozie-sharelib/target/checkstyle-result.xml> of module with 0 warnings.
[CHECKSTYLE] Successfully parsed file <https://builds.apache.org/job/Apache-falcon/ws/test-tools/pig-sharelib/target/checkstyle-result.xml> of module with 0 warnings.
[CHECKSTYLE] Successfully parsed file <https://builds.apache.org/job/Apache-falcon/ws/test-tools/target/checkstyle-result.xml> of module with 0 warnings.
[CHECKSTYLE] Successfully parsed file <https://builds.apache.org/job/Apache-falcon/ws/test-util/target/checkstyle-result.xml> of module with 0 warnings.
[CHECKSTYLE] Computing warning deltas based on reference build #529
[FINDBUGS] Collecting findbugs analysis files...
[FINDBUGS] Finding all files that match the pattern **/target/findbugs.xml
[FINDBUGS] Parsing 16 files in <https://builds.apache.org/job/Apache-falcon/ws/>
[FINDBUGS] Successfully parsed file <https://builds.apache.org/job/Apache-falcon/ws/client/target/findbugs.xml> of module with 0 warnings.
[FINDBUGS] Successfully parsed file <https://builds.apache.org/job/Apache-falcon/ws/common/target/findbugs.xml> of module with 0 warnings.
[FINDBUGS] Successfully parsed file <https://builds.apache.org/job/Apache-falcon/ws/feed/target/findbugs.xml> of module with 0 warnings.
[FINDBUGS] Successfully parsed file <https://builds.apache.org/job/Apache-falcon/ws/hadoop-dependencies/target/findbugs.xml> of module with 0 warnings.
[FINDBUGS] Successfully parsed file <https://builds.apache.org/job/Apache-falcon/ws/hadoop-webapp/target/findbugs.xml> of module with 0 warnings.
[FINDBUGS] Successfully parsed file <https://builds.apache.org/job/Apache-falcon/ws/messaging/target/findbugs.xml> of module with 0 warnings.
[FINDBUGS] Successfully parsed file <https://builds.apache.org/job/Apache-falcon/ws/metrics/target/findbugs.xml> of module with 0 warnings.
[FINDBUGS] Successfully parsed file <https://builds.apache.org/job/Apache-falcon/ws/oozie-el-extensions/target/findbugs.xml> of module with 0 warnings.
[FINDBUGS] Successfully parsed file <https://builds.apache.org/job/Apache-falcon/ws/oozie/target/findbugs.xml> of module with 0 warnings.
[FINDBUGS] Successfully parsed file <https://builds.apache.org/job/Apache-falcon/ws/prism/target/findbugs.xml> of module with 0 warnings.
[FINDBUGS] Successfully parsed file <https://builds.apache.org/job/Apache-falcon/ws/process/target/findbugs.xml> of module with 0 warnings.
[FINDBUGS] Successfully parsed file <https://builds.apache.org/job/Apache-falcon/ws/replication/target/findbugs.xml> of module with 0 warnings.
[FINDBUGS] Successfully parsed file <https://builds.apache.org/job/Apache-falcon/ws/rerun/target/findbugs.xml> of module with 0 warnings.
[FINDBUGS] Successfully parsed file <https://builds.apache.org/job/Apache-falcon/ws/retention/target/findbugs.xml> of module with 0 warnings.
[FINDBUGS] Successfully parsed file <https://builds.apache.org/job/Apache-falcon/ws/test-tools/hadoop-webapp/target/findbugs.xml> of module with 0 warnings.
[FINDBUGS] Successfully parsed file <https://builds.apache.org/job/Apache-falcon/ws/test-util/target/findbugs.xml> of module with 0 warnings.
[FINDBUGS] Computing warning deltas based on reference build #529
Archiving artifacts
Sending artifact delta relative to Apache-falcon #529
Archived 17 artifacts
Archive block size is 32768
Received 0 blocks and 8635104 bytes
Compression is 0.0%
Took 2.3 sec
Recording test results
TestNG Reports Processing: START
Looking for TestNG results report in workspace using pattern: **/target/testng-results.xml
Did not find any matching files.
Build failed in Jenkins: Apache-falcon #541
Posted by Apache Jenkins Server <je...@builds.apache.org>.
See <https://builds.apache.org/job/Apache-falcon/541/>
------------------------------------------
[...truncated 5048 lines...]
at org.testng.Assert.assertEquals(Assert.java:118)
at org.testng.Assert.assertEquals(Assert.java:365)
at org.testng.Assert.assertEquals(Assert.java:375)
at org.apache.falcon.cli.FalconCLIIT.submitTestFiles(FalconCLIIT.java:885)
at org.apache.falcon.cli.FalconCLIIT.testInstanceSuspendAndResume(FalconCLIIT.java:432)
testMetadataListCommands(org.apache.falcon.cli.FalconCLIIT) Time elapsed: 0.345 sec <<< FAILURE!
java.lang.AssertionError: expected:<0> but was:<-1>
at org.testng.Assert.fail(Assert.java:89)
at org.testng.Assert.failNotEquals(Assert.java:489)
at org.testng.Assert.assertEquals(Assert.java:118)
at org.testng.Assert.assertEquals(Assert.java:365)
at org.testng.Assert.assertEquals(Assert.java:375)
at org.apache.falcon.cli.FalconCLIIT.submitTestFiles(FalconCLIIT.java:885)
at org.apache.falcon.cli.FalconCLIIT.testMetadataListCommands(FalconCLIIT.java:590)
testMetadataRelationsCommands(org.apache.falcon.cli.FalconCLIIT) Time elapsed: 0.337 sec <<< FAILURE!
java.lang.AssertionError: expected:<0> but was:<-1>
at org.testng.Assert.fail(Assert.java:89)
at org.testng.Assert.failNotEquals(Assert.java:489)
at org.testng.Assert.assertEquals(Assert.java:118)
at org.testng.Assert.assertEquals(Assert.java:365)
at org.testng.Assert.assertEquals(Assert.java:375)
at org.apache.falcon.cli.FalconCLIIT.submitTestFiles(FalconCLIIT.java:885)
at org.apache.falcon.cli.FalconCLIIT.testMetadataRelationsCommands(FalconCLIIT.java:627)
testRecipeCommand(org.apache.falcon.cli.FalconCLIIT) Time elapsed: 0.35 sec <<< FAILURE!
java.lang.AssertionError: expected:<0> but was:<-1>
at org.testng.Assert.fail(Assert.java:89)
at org.testng.Assert.failNotEquals(Assert.java:489)
at org.testng.Assert.assertEquals(Assert.java:118)
at org.testng.Assert.assertEquals(Assert.java:365)
at org.testng.Assert.assertEquals(Assert.java:375)
at org.apache.falcon.cli.FalconCLIIT.recipeSetup(FalconCLIIT.java:826)
at org.apache.falcon.cli.FalconCLIIT.testRecipeCommand(FalconCLIIT.java:809)
testScheduleEntityValidCommands(org.apache.falcon.cli.FalconCLIIT) Time elapsed: 0.385 sec <<< FAILURE!
java.lang.AssertionError: expected:<0> but was:<-1>
at org.testng.Assert.fail(Assert.java:89)
at org.testng.Assert.failNotEquals(Assert.java:489)
at org.testng.Assert.assertEquals(Assert.java:118)
at org.testng.Assert.assertEquals(Assert.java:365)
at org.testng.Assert.assertEquals(Assert.java:375)
at org.apache.falcon.cli.FalconCLIIT.submitTestFiles(FalconCLIIT.java:885)
at org.apache.falcon.cli.FalconCLIIT.testScheduleEntityValidCommands(FalconCLIIT.java:169)
testSubmitAndScheduleEntityValidCommands(org.apache.falcon.cli.FalconCLIIT) Time elapsed: 0.467 sec <<< FAILURE!
java.lang.AssertionError: expected:<0> but was:<-1>
at org.testng.Assert.fail(Assert.java:89)
at org.testng.Assert.failNotEquals(Assert.java:489)
at org.testng.Assert.assertEquals(Assert.java:118)
at org.testng.Assert.assertEquals(Assert.java:365)
at org.testng.Assert.assertEquals(Assert.java:375)
at org.apache.falcon.cli.FalconCLIIT.testSubmitAndScheduleEntityValidCommands(FalconCLIIT.java:108)
testSubmitEntityValidCommands(org.apache.falcon.cli.FalconCLIIT) Time elapsed: 0.32 sec <<< FAILURE!
java.lang.AssertionError: expected:<0> but was:<-1>
at org.testng.Assert.fail(Assert.java:89)
at org.testng.Assert.failNotEquals(Assert.java:489)
at org.testng.Assert.assertEquals(Assert.java:118)
at org.testng.Assert.assertEquals(Assert.java:365)
at org.testng.Assert.assertEquals(Assert.java:375)
at org.apache.falcon.cli.FalconCLIIT.testSubmitEntityValidCommands(FalconCLIIT.java:66)
testSuspendResumeStatusEntityValidCommands(org.apache.falcon.cli.FalconCLIIT) Time elapsed: 0.35 sec <<< FAILURE!
java.lang.AssertionError: expected:<0> but was:<-1>
at org.testng.Assert.fail(Assert.java:89)
at org.testng.Assert.failNotEquals(Assert.java:489)
at org.testng.Assert.assertEquals(Assert.java:118)
at org.testng.Assert.assertEquals(Assert.java:365)
at org.testng.Assert.assertEquals(Assert.java:375)
at org.apache.falcon.cli.FalconCLIIT.submitTestFiles(FalconCLIIT.java:885)
at org.apache.falcon.cli.FalconCLIIT.testSuspendResumeStatusEntityValidCommands(FalconCLIIT.java:183)
testValidateValidCommands(org.apache.falcon.cli.FalconCLIIT) Time elapsed: 0.319 sec <<< FAILURE!
java.lang.AssertionError: expected:<0> but was:<-1>
at org.testng.Assert.fail(Assert.java:89)
at org.testng.Assert.failNotEquals(Assert.java:489)
at org.testng.Assert.assertEquals(Assert.java:118)
at org.testng.Assert.assertEquals(Assert.java:365)
at org.testng.Assert.assertEquals(Assert.java:375)
at org.apache.falcon.cli.FalconCLIIT.testValidateValidCommands(FalconCLIIT.java:131)
Running org.apache.falcon.catalog.HiveCatalogServiceIT
Tests run: 21, Failures: 0, Errors: 0, Skipped: 0, Time elapsed: 14.54 sec - in org.apache.falcon.catalog.HiveCatalogServiceIT
Results :
Failed tests:
FeedEntityValidationIT.testFeedEntityWithInvalidTableUri:138 expected:<200> but was:<400>
FeedEntityValidationIT.testFeedEntityWithInvalidTableUri:138 expected:<200> but was:<400>
FeedEntityValidationIT.testFeedEntityWithInvalidTableUri:138 expected:<200> but was:<400>
FeedEntityValidationIT.testFeedEntityWithInvalidTableUri:138 expected:<200> but was:<400>
FeedEntityValidationIT.testFeedEntityWithInvalidTableUri:138 expected:<200> but was:<400>
FeedEntityValidationIT.testFeedEntityWithInvalidTableUri:138 expected:<200> but was:<400>
FeedEntityValidationIT.testFeedEntityWithValidTable:81 expected:<200> but was:<400>
ClusterEntityValidationIT.testClusterEntityWithValidInterfaces:89 expected:<200> but was:<400>
ClusterEntityValidationIT.testValidateACL:150 expected:<200> but was:<400>
ClusterEntityValidationIT.testValidateClusterLocations:156 » Validation Invali...
EntityManagerPaginationJerseyIT.prepare:42->scheduleMultipleProcess:155 expected:<200> but was:<400>
EntityManagerJerseyIT.testClusterSubmitScheduleSuspendResumeDelete:463 expected:<200> but was:<400>
EntityManagerJerseyIT.cleanup:183 » OozieClient java.io.IOException: Error whi...
EntityManagerJerseySmokeIT.testFeedSchedule:110 expected:<200> but was:<400>
EntityManagerJerseySmokeIT.cleanup:60 » OozieClient java.io.IOException: Error...
MetadataResourceJerseyIT.prepare:51 expected:<200> but was:<400>
FalconCLISmokeIT.testSubmitAndScheduleEntityValidCommands:58 expected:<0> but was:<-1>
FalconCLIIT.testClientProperties:723->submitTestFiles:885 expected:<0> but was:<-1>
FalconCLIIT.testContinue:661->submitTestFiles:885 expected:<0> but was:<-1>
FalconCLIIT.testDefinitionEntityValidCommands:153->submitTestFiles:885 expected:<0> but was:<-1>
FalconCLIIT.testDeleteEntityValidCommands:246->submitTestFiles:885 expected:<0> but was:<-1>
FalconCLIIT.testEntityLineage:499 expected:<0> but was:<-1>
FalconCLIIT.testEntityPaginationFilterByCommands:526 expected:<0> but was:<-1>
FalconCLIIT.testInstanceGetLogs:749->submitTestFiles:885 expected:<0> but was:<-1>
FalconCLIIT.testInstanceKillAndRerun:462->submitTestFiles:885 expected:<0> but was:<-1>
FalconCLIIT.testInstanceRunningAndStatusCommands:275->submitTestFiles:885 expected:<0> but was:<-1>
FalconCLIIT.testInstanceRunningAndSummaryCommands:404->submitTestFiles:885 expected:<0> but was:<-1>
FalconCLIIT.testInstanceSuspendAndResume:432->submitTestFiles:885 expected:<0> but was:<-1>
FalconCLIIT.testMetadataListCommands:590->submitTestFiles:885 expected:<0> but was:<-1>
FalconCLIIT.testMetadataRelationsCommands:627->submitTestFiles:885 expected:<0> but was:<-1>
FalconCLIIT.testRecipeCommand:809->recipeSetup:826 expected:<0> but was:<-1>
FalconCLIIT.testScheduleEntityValidCommands:169->submitTestFiles:885 expected:<0> but was:<-1>
FalconCLIIT.testSubmitAndScheduleEntityValidCommands:108 expected:<0> but was:<-1>
FalconCLIIT.testSubmitEntityValidCommands:66 expected:<0> but was:<-1>
FalconCLIIT.testSuspendResumeStatusEntityValidCommands:183->submitTestFiles:885 expected:<0> but was:<-1>
FalconCLIIT.testValidateValidCommands:131 expected:<0> but was:<-1>
Tests run: 158, Failures: 36, Errors: 0, Skipped: 57
[INFO]
[INFO] --- maven-jetty-plugin:6.1.26:stop (stop-jetty) @ falcon-webapp ---
[INFO]
[INFO] --- maven-failsafe-plugin:2.16:verify (verify) @ falcon-webapp ---
[INFO] Stopping server 0
[INFO] Stopped SelectChannelConnector@0.0.0.0:41000
[INFO] Stopped SslSocketConnector@0.0.0.0:41443
[INFO] Failsafe report directory: <https://builds.apache.org/job/Apache-falcon/ws/webapp/target/failsafe-reports>
[INFO] ------------------------------------------------------------------------
[INFO] Reactor Summary:
[INFO]
[INFO] Checkstyle ........................................ SUCCESS [ 1.005 s]
[INFO] Apache Falcon ..................................... SUCCESS [ 5.179 s]
[INFO] Build Tools ....................................... SUCCESS [ 3.837 s]
[INFO] Apache Falcon CLI client .......................... SUCCESS [ 27.156 s]
[INFO] Apache Falcon Metrics ............................. SUCCESS [ 11.764 s]
[INFO] Apache Falcon Hadoop Dependencies ................. SUCCESS [ 13.768 s]
[INFO] Apache Falcon Test Utility ........................ SUCCESS [ 11.393 s]
[INFO] Apache Falcon Commons ............................. SUCCESS [01:34 min]
[INFO] Apache Falcon Oozie EL Extension .................. SUCCESS [ 14.468 s]
[INFO] Apache Falcon Embedded Hadoop - Test Cluster ...... SUCCESS [ 29.240 s]
[INFO] Apache Falcon Sharelib Hive - Test Cluster ........ SUCCESS [ 1.165 s]
[INFO] Apache Falcon Sharelib Pig - Test Cluster ......... SUCCESS [ 0.731 s]
[INFO] Apache Falcon Sharelib Hcatalog - Test Cluster .... SUCCESS [ 0.987 s]
[INFO] Apache Falcon Sharelib Oozie - Test Cluster ....... SUCCESS [ 0.533 s]
[INFO] Apache Falcon Test Tools - Test Cluster ........... SUCCESS [ 0.477 s]
[INFO] Apache Falcon Messaging ........................... SUCCESS [ 25.751 s]
[INFO] Apache Falcon Oozie Adaptor ....................... SUCCESS [ 51.155 s]
[INFO] Apache Falcon Acquisition ......................... SUCCESS [ 0.530 s]
[INFO] Apache Falcon Replication ......................... SUCCESS [ 17.287 s]
[INFO] Apache Falcon Retention ........................... SUCCESS [ 17.078 s]
[INFO] Apache Falcon Archival ............................ SUCCESS [ 0.487 s]
[INFO] Apache Falcon Rerun ............................... SUCCESS [ 24.299 s]
[INFO] Apache Falcon Prism ............................... SUCCESS [ 54.882 s]
[INFO] Apache Falcon Web Application ..................... FAILURE [02:16 min]
[INFO] Apache Falcon Documentation ....................... SKIPPED
[INFO] ------------------------------------------------------------------------
[INFO] BUILD FAILURE
[INFO] ------------------------------------------------------------------------
[INFO] Total time: 09:05 min
[INFO] Finished at: 2015-01-18T00:31:12+00:00
[INFO] Final Memory: 448M/1129M
[INFO] ------------------------------------------------------------------------
[ERROR] Failed to execute goal org.apache.maven.plugins:maven-failsafe-plugin:2.16:verify (verify) on project falcon-webapp: There are test failures.
[ERROR]
[ERROR] Please refer to <https://builds.apache.org/job/Apache-falcon/ws/webapp/target/failsafe-reports> for the individual test results.
[ERROR] -> [Help 1]
[ERROR]
[ERROR] To see the full stack trace of the errors, re-run Maven with the -e switch.
[ERROR] Re-run Maven using the -X switch to enable full debug logging.
[ERROR]
[ERROR] For more information about the errors and possible solutions, please read the following articles:
[ERROR] [Help 1] http://cwiki.apache.org/confluence/display/MAVEN/MojoFailureException
[ERROR]
[ERROR] After correcting the problems, you can resume the build with the command
[ERROR] mvn <goals> -rf :falcon-webapp
Shutting down hive metastore.
[INFO] Shutdown hook executing
[INFO] Shutdown hook complete
Build step 'Execute shell' marked build as failure
[CHECKSTYLE] Collecting checkstyle analysis files...
[CHECKSTYLE] Finding all files that match the pattern **/target/checkstyle-result.xml
[CHECKSTYLE] Parsing 26 files in <https://builds.apache.org/job/Apache-falcon/ws/>
[CHECKSTYLE] Successfully parsed file <https://builds.apache.org/job/Apache-falcon/ws/acquisition/target/checkstyle-result.xml> of module with 0 warnings.
[CHECKSTYLE] Successfully parsed file <https://builds.apache.org/job/Apache-falcon/ws/archival/target/checkstyle-result.xml> of module with 0 warnings.
[CHECKSTYLE] Successfully parsed file <https://builds.apache.org/job/Apache-falcon/ws/build-tools/target/checkstyle-result.xml> of module with 0 warnings.
[CHECKSTYLE] Successfully parsed file <https://builds.apache.org/job/Apache-falcon/ws/client/target/checkstyle-result.xml> of module with 0 warnings.
[CHECKSTYLE] Successfully parsed file <https://builds.apache.org/job/Apache-falcon/ws/common/target/checkstyle-result.xml> of module with 0 warnings.
[CHECKSTYLE] Successfully parsed file <https://builds.apache.org/job/Apache-falcon/ws/docs/target/checkstyle-result.xml> of module with 0 warnings.
[CHECKSTYLE] Successfully parsed file <https://builds.apache.org/job/Apache-falcon/ws/feed/target/checkstyle-result.xml> of module with 0 warnings.
[CHECKSTYLE] Successfully parsed file <https://builds.apache.org/job/Apache-falcon/ws/hadoop-dependencies/target/checkstyle-result.xml> of module with 0 warnings.
[CHECKSTYLE] Successfully parsed file <https://builds.apache.org/job/Apache-falcon/ws/hadoop-webapp/target/checkstyle-result.xml> of module with 0 warnings.
[CHECKSTYLE] Successfully parsed file <https://builds.apache.org/job/Apache-falcon/ws/messaging/target/checkstyle-result.xml> of module with 0 warnings.
[CHECKSTYLE] Successfully parsed file <https://builds.apache.org/job/Apache-falcon/ws/metrics/target/checkstyle-result.xml> of module with 0 warnings.
[CHECKSTYLE] Successfully parsed file <https://builds.apache.org/job/Apache-falcon/ws/oozie-el-extensions/target/checkstyle-result.xml> of module with 0 warnings.
[CHECKSTYLE] Successfully parsed file <https://builds.apache.org/job/Apache-falcon/ws/oozie/target/checkstyle-result.xml> of module with 0 warnings.
[CHECKSTYLE] Successfully parsed file <https://builds.apache.org/job/Apache-falcon/ws/prism/target/checkstyle-result.xml> of module with 0 warnings.
[CHECKSTYLE] Successfully parsed file <https://builds.apache.org/job/Apache-falcon/ws/process/target/checkstyle-result.xml> of module with 0 warnings.
[CHECKSTYLE] Successfully parsed file <https://builds.apache.org/job/Apache-falcon/ws/replication/target/checkstyle-result.xml> of module with 0 warnings.
[CHECKSTYLE] Successfully parsed file <https://builds.apache.org/job/Apache-falcon/ws/rerun/target/checkstyle-result.xml> of module with 0 warnings.
[CHECKSTYLE] Successfully parsed file <https://builds.apache.org/job/Apache-falcon/ws/retention/target/checkstyle-result.xml> of module with 0 warnings.
[CHECKSTYLE] Successfully parsed file <https://builds.apache.org/job/Apache-falcon/ws/target/checkstyle-result.xml> of module with 0 warnings.
[CHECKSTYLE] Successfully parsed file <https://builds.apache.org/job/Apache-falcon/ws/test-tools/hadoop-webapp/target/checkstyle-result.xml> of module with 0 warnings.
[CHECKSTYLE] Successfully parsed file <https://builds.apache.org/job/Apache-falcon/ws/test-tools/hcatalog-sharelib/target/checkstyle-result.xml> of module with 0 warnings.
[CHECKSTYLE] Successfully parsed file <https://builds.apache.org/job/Apache-falcon/ws/test-tools/hive-sharelib/target/checkstyle-result.xml> of module with 0 warnings.
[CHECKSTYLE] Successfully parsed file <https://builds.apache.org/job/Apache-falcon/ws/test-tools/oozie-sharelib/target/checkstyle-result.xml> of module with 0 warnings.
[CHECKSTYLE] Successfully parsed file <https://builds.apache.org/job/Apache-falcon/ws/test-tools/pig-sharelib/target/checkstyle-result.xml> of module with 0 warnings.
[CHECKSTYLE] Successfully parsed file <https://builds.apache.org/job/Apache-falcon/ws/test-tools/target/checkstyle-result.xml> of module with 0 warnings.
[CHECKSTYLE] Successfully parsed file <https://builds.apache.org/job/Apache-falcon/ws/test-util/target/checkstyle-result.xml> of module with 0 warnings.
[CHECKSTYLE] Computing warning deltas based on reference build #529
[FINDBUGS] Collecting findbugs analysis files...
[FINDBUGS] Finding all files that match the pattern **/target/findbugs.xml
[FINDBUGS] Parsing 16 files in <https://builds.apache.org/job/Apache-falcon/ws/>
[FINDBUGS] Successfully parsed file <https://builds.apache.org/job/Apache-falcon/ws/client/target/findbugs.xml> of module with 0 warnings.
[FINDBUGS] Successfully parsed file <https://builds.apache.org/job/Apache-falcon/ws/common/target/findbugs.xml> of module with 0 warnings.
[FINDBUGS] Successfully parsed file <https://builds.apache.org/job/Apache-falcon/ws/feed/target/findbugs.xml> of module with 0 warnings.
[FINDBUGS] Successfully parsed file <https://builds.apache.org/job/Apache-falcon/ws/hadoop-dependencies/target/findbugs.xml> of module with 0 warnings.
[FINDBUGS] Successfully parsed file <https://builds.apache.org/job/Apache-falcon/ws/hadoop-webapp/target/findbugs.xml> of module with 0 warnings.
[FINDBUGS] Successfully parsed file <https://builds.apache.org/job/Apache-falcon/ws/messaging/target/findbugs.xml> of module with 0 warnings.
[FINDBUGS] Successfully parsed file <https://builds.apache.org/job/Apache-falcon/ws/metrics/target/findbugs.xml> of module with 0 warnings.
[FINDBUGS] Successfully parsed file <https://builds.apache.org/job/Apache-falcon/ws/oozie-el-extensions/target/findbugs.xml> of module with 0 warnings.
[FINDBUGS] Successfully parsed file <https://builds.apache.org/job/Apache-falcon/ws/oozie/target/findbugs.xml> of module with 0 warnings.
[FINDBUGS] Successfully parsed file <https://builds.apache.org/job/Apache-falcon/ws/prism/target/findbugs.xml> of module with 0 warnings.
[FINDBUGS] Successfully parsed file <https://builds.apache.org/job/Apache-falcon/ws/process/target/findbugs.xml> of module with 0 warnings.
[FINDBUGS] Successfully parsed file <https://builds.apache.org/job/Apache-falcon/ws/replication/target/findbugs.xml> of module with 0 warnings.
[FINDBUGS] Successfully parsed file <https://builds.apache.org/job/Apache-falcon/ws/rerun/target/findbugs.xml> of module with 0 warnings.
[FINDBUGS] Successfully parsed file <https://builds.apache.org/job/Apache-falcon/ws/retention/target/findbugs.xml> of module with 0 warnings.
[FINDBUGS] Successfully parsed file <https://builds.apache.org/job/Apache-falcon/ws/test-tools/hadoop-webapp/target/findbugs.xml> of module with 0 warnings.
[FINDBUGS] Successfully parsed file <https://builds.apache.org/job/Apache-falcon/ws/test-util/target/findbugs.xml> of module with 0 warnings.
[FINDBUGS] Computing warning deltas based on reference build #529
Archiving artifacts
Sending artifact delta relative to Apache-falcon #529
Archived 17 artifacts
Archive block size is 32768
Received 0 blocks and 8635147 bytes
Compression is 0.0%
Took 2.2 sec
Recording test results
TestNG Reports Processing: START
Looking for TestNG results report in workspace using pattern: **/target/testng-results.xml
Did not find any matching files.
Build failed in Jenkins: Apache-falcon #540
Posted by Apache Jenkins Server <je...@builds.apache.org>.
See <https://builds.apache.org/job/Apache-falcon/540/>
------------------------------------------
[...truncated 5048 lines...]
at org.testng.Assert.assertEquals(Assert.java:118)
at org.testng.Assert.assertEquals(Assert.java:365)
at org.testng.Assert.assertEquals(Assert.java:375)
at org.apache.falcon.cli.FalconCLIIT.submitTestFiles(FalconCLIIT.java:885)
at org.apache.falcon.cli.FalconCLIIT.testInstanceSuspendAndResume(FalconCLIIT.java:432)
testMetadataListCommands(org.apache.falcon.cli.FalconCLIIT) Time elapsed: 0.352 sec <<< FAILURE!
java.lang.AssertionError: expected:<0> but was:<-1>
at org.testng.Assert.fail(Assert.java:89)
at org.testng.Assert.failNotEquals(Assert.java:489)
at org.testng.Assert.assertEquals(Assert.java:118)
at org.testng.Assert.assertEquals(Assert.java:365)
at org.testng.Assert.assertEquals(Assert.java:375)
at org.apache.falcon.cli.FalconCLIIT.submitTestFiles(FalconCLIIT.java:885)
at org.apache.falcon.cli.FalconCLIIT.testMetadataListCommands(FalconCLIIT.java:590)
testMetadataRelationsCommands(org.apache.falcon.cli.FalconCLIIT) Time elapsed: 0.345 sec <<< FAILURE!
java.lang.AssertionError: expected:<0> but was:<-1>
at org.testng.Assert.fail(Assert.java:89)
at org.testng.Assert.failNotEquals(Assert.java:489)
at org.testng.Assert.assertEquals(Assert.java:118)
at org.testng.Assert.assertEquals(Assert.java:365)
at org.testng.Assert.assertEquals(Assert.java:375)
at org.apache.falcon.cli.FalconCLIIT.submitTestFiles(FalconCLIIT.java:885)
at org.apache.falcon.cli.FalconCLIIT.testMetadataRelationsCommands(FalconCLIIT.java:627)
testRecipeCommand(org.apache.falcon.cli.FalconCLIIT) Time elapsed: 0.354 sec <<< FAILURE!
java.lang.AssertionError: expected:<0> but was:<-1>
at org.testng.Assert.fail(Assert.java:89)
at org.testng.Assert.failNotEquals(Assert.java:489)
at org.testng.Assert.assertEquals(Assert.java:118)
at org.testng.Assert.assertEquals(Assert.java:365)
at org.testng.Assert.assertEquals(Assert.java:375)
at org.apache.falcon.cli.FalconCLIIT.recipeSetup(FalconCLIIT.java:826)
at org.apache.falcon.cli.FalconCLIIT.testRecipeCommand(FalconCLIIT.java:809)
testScheduleEntityValidCommands(org.apache.falcon.cli.FalconCLIIT) Time elapsed: 0.352 sec <<< FAILURE!
java.lang.AssertionError: expected:<0> but was:<-1>
at org.testng.Assert.fail(Assert.java:89)
at org.testng.Assert.failNotEquals(Assert.java:489)
at org.testng.Assert.assertEquals(Assert.java:118)
at org.testng.Assert.assertEquals(Assert.java:365)
at org.testng.Assert.assertEquals(Assert.java:375)
at org.apache.falcon.cli.FalconCLIIT.submitTestFiles(FalconCLIIT.java:885)
at org.apache.falcon.cli.FalconCLIIT.testScheduleEntityValidCommands(FalconCLIIT.java:169)
testSubmitAndScheduleEntityValidCommands(org.apache.falcon.cli.FalconCLIIT) Time elapsed: 0.472 sec <<< FAILURE!
java.lang.AssertionError: expected:<0> but was:<-1>
at org.testng.Assert.fail(Assert.java:89)
at org.testng.Assert.failNotEquals(Assert.java:489)
at org.testng.Assert.assertEquals(Assert.java:118)
at org.testng.Assert.assertEquals(Assert.java:365)
at org.testng.Assert.assertEquals(Assert.java:375)
at org.apache.falcon.cli.FalconCLIIT.testSubmitAndScheduleEntityValidCommands(FalconCLIIT.java:108)
testSubmitEntityValidCommands(org.apache.falcon.cli.FalconCLIIT) Time elapsed: 0.328 sec <<< FAILURE!
java.lang.AssertionError: expected:<0> but was:<-1>
at org.testng.Assert.fail(Assert.java:89)
at org.testng.Assert.failNotEquals(Assert.java:489)
at org.testng.Assert.assertEquals(Assert.java:118)
at org.testng.Assert.assertEquals(Assert.java:365)
at org.testng.Assert.assertEquals(Assert.java:375)
at org.apache.falcon.cli.FalconCLIIT.testSubmitEntityValidCommands(FalconCLIIT.java:66)
testSuspendResumeStatusEntityValidCommands(org.apache.falcon.cli.FalconCLIIT) Time elapsed: 0.341 sec <<< FAILURE!
java.lang.AssertionError: expected:<0> but was:<-1>
at org.testng.Assert.fail(Assert.java:89)
at org.testng.Assert.failNotEquals(Assert.java:489)
at org.testng.Assert.assertEquals(Assert.java:118)
at org.testng.Assert.assertEquals(Assert.java:365)
at org.testng.Assert.assertEquals(Assert.java:375)
at org.apache.falcon.cli.FalconCLIIT.submitTestFiles(FalconCLIIT.java:885)
at org.apache.falcon.cli.FalconCLIIT.testSuspendResumeStatusEntityValidCommands(FalconCLIIT.java:183)
testValidateValidCommands(org.apache.falcon.cli.FalconCLIIT) Time elapsed: 0.311 sec <<< FAILURE!
java.lang.AssertionError: expected:<0> but was:<-1>
at org.testng.Assert.fail(Assert.java:89)
at org.testng.Assert.failNotEquals(Assert.java:489)
at org.testng.Assert.assertEquals(Assert.java:118)
at org.testng.Assert.assertEquals(Assert.java:365)
at org.testng.Assert.assertEquals(Assert.java:375)
at org.apache.falcon.cli.FalconCLIIT.testValidateValidCommands(FalconCLIIT.java:131)
Running org.apache.falcon.catalog.HiveCatalogServiceIT
Tests run: 21, Failures: 0, Errors: 0, Skipped: 0, Time elapsed: 14.638 sec - in org.apache.falcon.catalog.HiveCatalogServiceIT
Results :
Failed tests:
FeedEntityValidationIT.testFeedEntityWithInvalidTableUri:138 expected:<200> but was:<400>
FeedEntityValidationIT.testFeedEntityWithInvalidTableUri:138 expected:<200> but was:<400>
FeedEntityValidationIT.testFeedEntityWithInvalidTableUri:138 expected:<200> but was:<400>
FeedEntityValidationIT.testFeedEntityWithInvalidTableUri:138 expected:<200> but was:<400>
FeedEntityValidationIT.testFeedEntityWithInvalidTableUri:138 expected:<200> but was:<400>
FeedEntityValidationIT.testFeedEntityWithInvalidTableUri:138 expected:<200> but was:<400>
FeedEntityValidationIT.testFeedEntityWithValidTable:81 expected:<200> but was:<400>
ClusterEntityValidationIT.testClusterEntityWithValidInterfaces:89 expected:<200> but was:<400>
ClusterEntityValidationIT.testValidateACL:150 expected:<200> but was:<400>
ClusterEntityValidationIT.testValidateClusterLocations:156 » Validation Invali...
EntityManagerPaginationJerseyIT.prepare:42->scheduleMultipleProcess:155 expected:<200> but was:<400>
EntityManagerJerseyIT.testClusterSubmitScheduleSuspendResumeDelete:463 expected:<200> but was:<400>
EntityManagerJerseyIT.cleanup:183 » OozieClient java.io.IOException: Error whi...
EntityManagerJerseySmokeIT.testFeedSchedule:110 expected:<200> but was:<400>
EntityManagerJerseySmokeIT.cleanup:60 » OozieClient java.io.IOException: Error...
MetadataResourceJerseyIT.prepare:51 expected:<200> but was:<400>
FalconCLISmokeIT.testSubmitAndScheduleEntityValidCommands:58 expected:<0> but was:<-1>
FalconCLIIT.testClientProperties:723->submitTestFiles:885 expected:<0> but was:<-1>
FalconCLIIT.testContinue:661->submitTestFiles:885 expected:<0> but was:<-1>
FalconCLIIT.testDefinitionEntityValidCommands:153->submitTestFiles:885 expected:<0> but was:<-1>
FalconCLIIT.testDeleteEntityValidCommands:246->submitTestFiles:885 expected:<0> but was:<-1>
FalconCLIIT.testEntityLineage:499 expected:<0> but was:<-1>
FalconCLIIT.testEntityPaginationFilterByCommands:526 expected:<0> but was:<-1>
FalconCLIIT.testInstanceGetLogs:749->submitTestFiles:885 expected:<0> but was:<-1>
FalconCLIIT.testInstanceKillAndRerun:462->submitTestFiles:885 expected:<0> but was:<-1>
FalconCLIIT.testInstanceRunningAndStatusCommands:275->submitTestFiles:885 expected:<0> but was:<-1>
FalconCLIIT.testInstanceRunningAndSummaryCommands:404->submitTestFiles:885 expected:<0> but was:<-1>
FalconCLIIT.testInstanceSuspendAndResume:432->submitTestFiles:885 expected:<0> but was:<-1>
FalconCLIIT.testMetadataListCommands:590->submitTestFiles:885 expected:<0> but was:<-1>
FalconCLIIT.testMetadataRelationsCommands:627->submitTestFiles:885 expected:<0> but was:<-1>
FalconCLIIT.testRecipeCommand:809->recipeSetup:826 expected:<0> but was:<-1>
FalconCLIIT.testScheduleEntityValidCommands:169->submitTestFiles:885 expected:<0> but was:<-1>
FalconCLIIT.testSubmitAndScheduleEntityValidCommands:108 expected:<0> but was:<-1>
FalconCLIIT.testSubmitEntityValidCommands:66 expected:<0> but was:<-1>
FalconCLIIT.testSuspendResumeStatusEntityValidCommands:183->submitTestFiles:885 expected:<0> but was:<-1>
FalconCLIIT.testValidateValidCommands:131 expected:<0> but was:<-1>
Tests run: 158, Failures: 36, Errors: 0, Skipped: 57
[INFO]
[INFO] --- maven-jetty-plugin:6.1.26:stop (stop-jetty) @ falcon-webapp ---
[INFO]
[INFO] --- maven-failsafe-plugin:2.16:verify (verify) @ falcon-webapp ---
[INFO] Stopping server 0
[INFO] Stopped SelectChannelConnector@0.0.0.0:41000
[INFO] Stopped SslSocketConnector@0.0.0.0:41443
[INFO] Failsafe report directory: <https://builds.apache.org/job/Apache-falcon/ws/webapp/target/failsafe-reports>
[INFO] ------------------------------------------------------------------------
[INFO] Reactor Summary:
[INFO]
[INFO] Checkstyle ........................................ SUCCESS [ 1.019 s]
[INFO] Apache Falcon ..................................... SUCCESS [ 5.228 s]
[INFO] Build Tools ....................................... SUCCESS [ 3.851 s]
[INFO] Apache Falcon CLI client .......................... SUCCESS [ 27.795 s]
[INFO] Apache Falcon Metrics ............................. SUCCESS [ 10.921 s]
[INFO] Apache Falcon Hadoop Dependencies ................. SUCCESS [ 13.588 s]
[INFO] Apache Falcon Test Utility ........................ SUCCESS [ 11.314 s]
[INFO] Apache Falcon Commons ............................. SUCCESS [01:32 min]
[INFO] Apache Falcon Oozie EL Extension .................. SUCCESS [ 14.168 s]
[INFO] Apache Falcon Embedded Hadoop - Test Cluster ...... SUCCESS [ 29.082 s]
[INFO] Apache Falcon Sharelib Hive - Test Cluster ........ SUCCESS [ 1.165 s]
[INFO] Apache Falcon Sharelib Pig - Test Cluster ......... SUCCESS [ 0.737 s]
[INFO] Apache Falcon Sharelib Hcatalog - Test Cluster .... SUCCESS [ 1.002 s]
[INFO] Apache Falcon Sharelib Oozie - Test Cluster ....... SUCCESS [ 0.533 s]
[INFO] Apache Falcon Test Tools - Test Cluster ........... SUCCESS [ 0.495 s]
[INFO] Apache Falcon Messaging ........................... SUCCESS [ 25.262 s]
[INFO] Apache Falcon Oozie Adaptor ....................... SUCCESS [ 51.536 s]
[INFO] Apache Falcon Acquisition ......................... SUCCESS [ 0.508 s]
[INFO] Apache Falcon Replication ......................... SUCCESS [ 16.361 s]
[INFO] Apache Falcon Retention ........................... SUCCESS [ 16.589 s]
[INFO] Apache Falcon Archival ............................ SUCCESS [ 0.499 s]
[INFO] Apache Falcon Rerun ............................... SUCCESS [ 24.263 s]
[INFO] Apache Falcon Prism ............................... SUCCESS [ 55.420 s]
[INFO] Apache Falcon Web Application ..................... FAILURE [02:15 min]
[INFO] Apache Falcon Documentation ....................... SKIPPED
[INFO] ------------------------------------------------------------------------
[INFO] BUILD FAILURE
[INFO] ------------------------------------------------------------------------
[INFO] Total time: 09:00 min
[INFO] Finished at: 2015-01-17T02:01:17+00:00
[INFO] Final Memory: 442M/1126M
[INFO] ------------------------------------------------------------------------
[ERROR] Failed to execute goal org.apache.maven.plugins:maven-failsafe-plugin:2.16:verify (verify) on project falcon-webapp: There are test failures.
[ERROR]
[ERROR] Please refer to <https://builds.apache.org/job/Apache-falcon/ws/webapp/target/failsafe-reports> for the individual test results.
[ERROR] -> [Help 1]
[ERROR]
[ERROR] To see the full stack trace of the errors, re-run Maven with the -e switch.
[ERROR] Re-run Maven using the -X switch to enable full debug logging.
[ERROR]
[ERROR] For more information about the errors and possible solutions, please read the following articles:
[ERROR] [Help 1] http://cwiki.apache.org/confluence/display/MAVEN/MojoFailureException
[ERROR]
[ERROR] After correcting the problems, you can resume the build with the command
[ERROR] mvn <goals> -rf :falcon-webapp
[INFO] Shutdown hook executing
Shutting down hive metastore.
[INFO] Shutdown hook complete
Build step 'Execute shell' marked build as failure
[CHECKSTYLE] Collecting checkstyle analysis files...
[CHECKSTYLE] Finding all files that match the pattern **/target/checkstyle-result.xml
[CHECKSTYLE] Parsing 26 files in <https://builds.apache.org/job/Apache-falcon/ws/>
[CHECKSTYLE] Successfully parsed file <https://builds.apache.org/job/Apache-falcon/ws/acquisition/target/checkstyle-result.xml> of module with 0 warnings.
[CHECKSTYLE] Successfully parsed file <https://builds.apache.org/job/Apache-falcon/ws/archival/target/checkstyle-result.xml> of module with 0 warnings.
[CHECKSTYLE] Successfully parsed file <https://builds.apache.org/job/Apache-falcon/ws/build-tools/target/checkstyle-result.xml> of module with 0 warnings.
[CHECKSTYLE] Successfully parsed file <https://builds.apache.org/job/Apache-falcon/ws/client/target/checkstyle-result.xml> of module with 0 warnings.
[CHECKSTYLE] Successfully parsed file <https://builds.apache.org/job/Apache-falcon/ws/common/target/checkstyle-result.xml> of module with 0 warnings.
[CHECKSTYLE] Successfully parsed file <https://builds.apache.org/job/Apache-falcon/ws/docs/target/checkstyle-result.xml> of module with 0 warnings.
[CHECKSTYLE] Successfully parsed file <https://builds.apache.org/job/Apache-falcon/ws/feed/target/checkstyle-result.xml> of module with 0 warnings.
[CHECKSTYLE] Successfully parsed file <https://builds.apache.org/job/Apache-falcon/ws/hadoop-dependencies/target/checkstyle-result.xml> of module with 0 warnings.
[CHECKSTYLE] Successfully parsed file <https://builds.apache.org/job/Apache-falcon/ws/hadoop-webapp/target/checkstyle-result.xml> of module with 0 warnings.
[CHECKSTYLE] Successfully parsed file <https://builds.apache.org/job/Apache-falcon/ws/messaging/target/checkstyle-result.xml> of module with 0 warnings.
[CHECKSTYLE] Successfully parsed file <https://builds.apache.org/job/Apache-falcon/ws/metrics/target/checkstyle-result.xml> of module with 0 warnings.
[CHECKSTYLE] Successfully parsed file <https://builds.apache.org/job/Apache-falcon/ws/oozie-el-extensions/target/checkstyle-result.xml> of module with 0 warnings.
[CHECKSTYLE] Successfully parsed file <https://builds.apache.org/job/Apache-falcon/ws/oozie/target/checkstyle-result.xml> of module with 0 warnings.
[CHECKSTYLE] Successfully parsed file <https://builds.apache.org/job/Apache-falcon/ws/prism/target/checkstyle-result.xml> of module with 0 warnings.
[CHECKSTYLE] Successfully parsed file <https://builds.apache.org/job/Apache-falcon/ws/process/target/checkstyle-result.xml> of module with 0 warnings.
[CHECKSTYLE] Successfully parsed file <https://builds.apache.org/job/Apache-falcon/ws/replication/target/checkstyle-result.xml> of module with 0 warnings.
[CHECKSTYLE] Successfully parsed file <https://builds.apache.org/job/Apache-falcon/ws/rerun/target/checkstyle-result.xml> of module with 0 warnings.
[CHECKSTYLE] Successfully parsed file <https://builds.apache.org/job/Apache-falcon/ws/retention/target/checkstyle-result.xml> of module with 0 warnings.
[CHECKSTYLE] Successfully parsed file <https://builds.apache.org/job/Apache-falcon/ws/target/checkstyle-result.xml> of module with 0 warnings.
[CHECKSTYLE] Successfully parsed file <https://builds.apache.org/job/Apache-falcon/ws/test-tools/hadoop-webapp/target/checkstyle-result.xml> of module with 0 warnings.
[CHECKSTYLE] Successfully parsed file <https://builds.apache.org/job/Apache-falcon/ws/test-tools/hcatalog-sharelib/target/checkstyle-result.xml> of module with 0 warnings.
[CHECKSTYLE] Successfully parsed file <https://builds.apache.org/job/Apache-falcon/ws/test-tools/hive-sharelib/target/checkstyle-result.xml> of module with 0 warnings.
[CHECKSTYLE] Successfully parsed file <https://builds.apache.org/job/Apache-falcon/ws/test-tools/oozie-sharelib/target/checkstyle-result.xml> of module with 0 warnings.
[CHECKSTYLE] Successfully parsed file <https://builds.apache.org/job/Apache-falcon/ws/test-tools/pig-sharelib/target/checkstyle-result.xml> of module with 0 warnings.
[CHECKSTYLE] Successfully parsed file <https://builds.apache.org/job/Apache-falcon/ws/test-tools/target/checkstyle-result.xml> of module with 0 warnings.
[CHECKSTYLE] Successfully parsed file <https://builds.apache.org/job/Apache-falcon/ws/test-util/target/checkstyle-result.xml> of module with 0 warnings.
[CHECKSTYLE] Computing warning deltas based on reference build #529
[FINDBUGS] Collecting findbugs analysis files...
[FINDBUGS] Finding all files that match the pattern **/target/findbugs.xml
[FINDBUGS] Parsing 16 files in <https://builds.apache.org/job/Apache-falcon/ws/>
[FINDBUGS] Successfully parsed file <https://builds.apache.org/job/Apache-falcon/ws/client/target/findbugs.xml> of module with 0 warnings.
[FINDBUGS] Successfully parsed file <https://builds.apache.org/job/Apache-falcon/ws/common/target/findbugs.xml> of module with 0 warnings.
[FINDBUGS] Successfully parsed file <https://builds.apache.org/job/Apache-falcon/ws/feed/target/findbugs.xml> of module with 0 warnings.
[FINDBUGS] Successfully parsed file <https://builds.apache.org/job/Apache-falcon/ws/hadoop-dependencies/target/findbugs.xml> of module with 0 warnings.
[FINDBUGS] Successfully parsed file <https://builds.apache.org/job/Apache-falcon/ws/hadoop-webapp/target/findbugs.xml> of module with 0 warnings.
[FINDBUGS] Successfully parsed file <https://builds.apache.org/job/Apache-falcon/ws/messaging/target/findbugs.xml> of module with 0 warnings.
[FINDBUGS] Successfully parsed file <https://builds.apache.org/job/Apache-falcon/ws/metrics/target/findbugs.xml> of module with 0 warnings.
[FINDBUGS] Successfully parsed file <https://builds.apache.org/job/Apache-falcon/ws/oozie-el-extensions/target/findbugs.xml> of module with 0 warnings.
[FINDBUGS] Successfully parsed file <https://builds.apache.org/job/Apache-falcon/ws/oozie/target/findbugs.xml> of module with 0 warnings.
[FINDBUGS] Successfully parsed file <https://builds.apache.org/job/Apache-falcon/ws/prism/target/findbugs.xml> of module with 0 warnings.
[FINDBUGS] Successfully parsed file <https://builds.apache.org/job/Apache-falcon/ws/process/target/findbugs.xml> of module with 0 warnings.
[FINDBUGS] Successfully parsed file <https://builds.apache.org/job/Apache-falcon/ws/replication/target/findbugs.xml> of module with 0 warnings.
[FINDBUGS] Successfully parsed file <https://builds.apache.org/job/Apache-falcon/ws/rerun/target/findbugs.xml> of module with 0 warnings.
[FINDBUGS] Successfully parsed file <https://builds.apache.org/job/Apache-falcon/ws/retention/target/findbugs.xml> of module with 0 warnings.
[FINDBUGS] Successfully parsed file <https://builds.apache.org/job/Apache-falcon/ws/test-tools/hadoop-webapp/target/findbugs.xml> of module with 0 warnings.
[FINDBUGS] Successfully parsed file <https://builds.apache.org/job/Apache-falcon/ws/test-util/target/findbugs.xml> of module with 0 warnings.
[FINDBUGS] Computing warning deltas based on reference build #529
Archiving artifacts
Sending artifact delta relative to Apache-falcon #529
Archived 17 artifacts
Archive block size is 32768
Received 0 blocks and 8605869 bytes
Compression is 0.0%
Took 2.1 sec
Recording test results
TestNG Reports Processing: START
Looking for TestNG results report in workspace using pattern: **/target/testng-results.xml
Did not find any matching files.
Build failed in Jenkins: Apache-falcon #539
Posted by Apache Jenkins Server <je...@builds.apache.org>.
See <https://builds.apache.org/job/Apache-falcon/539/>
------------------------------------------
[...truncated 5048 lines...]
at org.testng.Assert.assertEquals(Assert.java:118)
at org.testng.Assert.assertEquals(Assert.java:365)
at org.testng.Assert.assertEquals(Assert.java:375)
at org.apache.falcon.cli.FalconCLIIT.submitTestFiles(FalconCLIIT.java:885)
at org.apache.falcon.cli.FalconCLIIT.testInstanceSuspendAndResume(FalconCLIIT.java:432)
testMetadataListCommands(org.apache.falcon.cli.FalconCLIIT) Time elapsed: 0.346 sec <<< FAILURE!
java.lang.AssertionError: expected:<0> but was:<-1>
at org.testng.Assert.fail(Assert.java:89)
at org.testng.Assert.failNotEquals(Assert.java:489)
at org.testng.Assert.assertEquals(Assert.java:118)
at org.testng.Assert.assertEquals(Assert.java:365)
at org.testng.Assert.assertEquals(Assert.java:375)
at org.apache.falcon.cli.FalconCLIIT.submitTestFiles(FalconCLIIT.java:885)
at org.apache.falcon.cli.FalconCLIIT.testMetadataListCommands(FalconCLIIT.java:590)
testMetadataRelationsCommands(org.apache.falcon.cli.FalconCLIIT) Time elapsed: 0.336 sec <<< FAILURE!
java.lang.AssertionError: expected:<0> but was:<-1>
at org.testng.Assert.fail(Assert.java:89)
at org.testng.Assert.failNotEquals(Assert.java:489)
at org.testng.Assert.assertEquals(Assert.java:118)
at org.testng.Assert.assertEquals(Assert.java:365)
at org.testng.Assert.assertEquals(Assert.java:375)
at org.apache.falcon.cli.FalconCLIIT.submitTestFiles(FalconCLIIT.java:885)
at org.apache.falcon.cli.FalconCLIIT.testMetadataRelationsCommands(FalconCLIIT.java:627)
testRecipeCommand(org.apache.falcon.cli.FalconCLIIT) Time elapsed: 0.354 sec <<< FAILURE!
java.lang.AssertionError: expected:<0> but was:<-1>
at org.testng.Assert.fail(Assert.java:89)
at org.testng.Assert.failNotEquals(Assert.java:489)
at org.testng.Assert.assertEquals(Assert.java:118)
at org.testng.Assert.assertEquals(Assert.java:365)
at org.testng.Assert.assertEquals(Assert.java:375)
at org.apache.falcon.cli.FalconCLIIT.recipeSetup(FalconCLIIT.java:826)
at org.apache.falcon.cli.FalconCLIIT.testRecipeCommand(FalconCLIIT.java:809)
testScheduleEntityValidCommands(org.apache.falcon.cli.FalconCLIIT) Time elapsed: 0.362 sec <<< FAILURE!
java.lang.AssertionError: expected:<0> but was:<-1>
at org.testng.Assert.fail(Assert.java:89)
at org.testng.Assert.failNotEquals(Assert.java:489)
at org.testng.Assert.assertEquals(Assert.java:118)
at org.testng.Assert.assertEquals(Assert.java:365)
at org.testng.Assert.assertEquals(Assert.java:375)
at org.apache.falcon.cli.FalconCLIIT.submitTestFiles(FalconCLIIT.java:885)
at org.apache.falcon.cli.FalconCLIIT.testScheduleEntityValidCommands(FalconCLIIT.java:169)
testSubmitAndScheduleEntityValidCommands(org.apache.falcon.cli.FalconCLIIT) Time elapsed: 0.475 sec <<< FAILURE!
java.lang.AssertionError: expected:<0> but was:<-1>
at org.testng.Assert.fail(Assert.java:89)
at org.testng.Assert.failNotEquals(Assert.java:489)
at org.testng.Assert.assertEquals(Assert.java:118)
at org.testng.Assert.assertEquals(Assert.java:365)
at org.testng.Assert.assertEquals(Assert.java:375)
at org.apache.falcon.cli.FalconCLIIT.testSubmitAndScheduleEntityValidCommands(FalconCLIIT.java:108)
testSubmitEntityValidCommands(org.apache.falcon.cli.FalconCLIIT) Time elapsed: 0.328 sec <<< FAILURE!
java.lang.AssertionError: expected:<0> but was:<-1>
at org.testng.Assert.fail(Assert.java:89)
at org.testng.Assert.failNotEquals(Assert.java:489)
at org.testng.Assert.assertEquals(Assert.java:118)
at org.testng.Assert.assertEquals(Assert.java:365)
at org.testng.Assert.assertEquals(Assert.java:375)
at org.apache.falcon.cli.FalconCLIIT.testSubmitEntityValidCommands(FalconCLIIT.java:66)
testSuspendResumeStatusEntityValidCommands(org.apache.falcon.cli.FalconCLIIT) Time elapsed: 0.325 sec <<< FAILURE!
java.lang.AssertionError: expected:<0> but was:<-1>
at org.testng.Assert.fail(Assert.java:89)
at org.testng.Assert.failNotEquals(Assert.java:489)
at org.testng.Assert.assertEquals(Assert.java:118)
at org.testng.Assert.assertEquals(Assert.java:365)
at org.testng.Assert.assertEquals(Assert.java:375)
at org.apache.falcon.cli.FalconCLIIT.submitTestFiles(FalconCLIIT.java:885)
at org.apache.falcon.cli.FalconCLIIT.testSuspendResumeStatusEntityValidCommands(FalconCLIIT.java:183)
testValidateValidCommands(org.apache.falcon.cli.FalconCLIIT) Time elapsed: 0.37 sec <<< FAILURE!
java.lang.AssertionError: expected:<0> but was:<-1>
at org.testng.Assert.fail(Assert.java:89)
at org.testng.Assert.failNotEquals(Assert.java:489)
at org.testng.Assert.assertEquals(Assert.java:118)
at org.testng.Assert.assertEquals(Assert.java:365)
at org.testng.Assert.assertEquals(Assert.java:375)
at org.apache.falcon.cli.FalconCLIIT.testValidateValidCommands(FalconCLIIT.java:131)
Running org.apache.falcon.catalog.HiveCatalogServiceIT
Tests run: 21, Failures: 0, Errors: 0, Skipped: 0, Time elapsed: 14.593 sec - in org.apache.falcon.catalog.HiveCatalogServiceIT
Results :
Failed tests:
FeedEntityValidationIT.testFeedEntityWithInvalidTableUri:138 expected:<200> but was:<400>
FeedEntityValidationIT.testFeedEntityWithInvalidTableUri:138 expected:<200> but was:<400>
FeedEntityValidationIT.testFeedEntityWithInvalidTableUri:138 expected:<200> but was:<400>
FeedEntityValidationIT.testFeedEntityWithInvalidTableUri:138 expected:<200> but was:<400>
FeedEntityValidationIT.testFeedEntityWithInvalidTableUri:138 expected:<200> but was:<400>
FeedEntityValidationIT.testFeedEntityWithInvalidTableUri:138 expected:<200> but was:<400>
FeedEntityValidationIT.testFeedEntityWithValidTable:81 expected:<200> but was:<400>
ClusterEntityValidationIT.testClusterEntityWithValidInterfaces:89 expected:<200> but was:<400>
ClusterEntityValidationIT.testValidateACL:150 expected:<200> but was:<400>
ClusterEntityValidationIT.testValidateClusterLocations:156 » Validation Invali...
EntityManagerPaginationJerseyIT.prepare:42->scheduleMultipleProcess:155 expected:<200> but was:<400>
EntityManagerJerseyIT.testClusterSubmitScheduleSuspendResumeDelete:463 expected:<200> but was:<400>
EntityManagerJerseyIT.cleanup:183 » OozieClient java.io.IOException: Error whi...
EntityManagerJerseySmokeIT.testFeedSchedule:110 expected:<200> but was:<400>
EntityManagerJerseySmokeIT.cleanup:60 » OozieClient java.io.IOException: Error...
MetadataResourceJerseyIT.prepare:51 expected:<200> but was:<400>
FalconCLISmokeIT.testSubmitAndScheduleEntityValidCommands:58 expected:<0> but was:<-1>
FalconCLIIT.testClientProperties:723->submitTestFiles:885 expected:<0> but was:<-1>
FalconCLIIT.testContinue:661->submitTestFiles:885 expected:<0> but was:<-1>
FalconCLIIT.testDefinitionEntityValidCommands:153->submitTestFiles:885 expected:<0> but was:<-1>
FalconCLIIT.testDeleteEntityValidCommands:246->submitTestFiles:885 expected:<0> but was:<-1>
FalconCLIIT.testEntityLineage:499 expected:<0> but was:<-1>
FalconCLIIT.testEntityPaginationFilterByCommands:526 expected:<0> but was:<-1>
FalconCLIIT.testInstanceGetLogs:749->submitTestFiles:885 expected:<0> but was:<-1>
FalconCLIIT.testInstanceKillAndRerun:462->submitTestFiles:885 expected:<0> but was:<-1>
FalconCLIIT.testInstanceRunningAndStatusCommands:275->submitTestFiles:885 expected:<0> but was:<-1>
FalconCLIIT.testInstanceRunningAndSummaryCommands:404->submitTestFiles:885 expected:<0> but was:<-1>
FalconCLIIT.testInstanceSuspendAndResume:432->submitTestFiles:885 expected:<0> but was:<-1>
FalconCLIIT.testMetadataListCommands:590->submitTestFiles:885 expected:<0> but was:<-1>
FalconCLIIT.testMetadataRelationsCommands:627->submitTestFiles:885 expected:<0> but was:<-1>
FalconCLIIT.testRecipeCommand:809->recipeSetup:826 expected:<0> but was:<-1>
FalconCLIIT.testScheduleEntityValidCommands:169->submitTestFiles:885 expected:<0> but was:<-1>
FalconCLIIT.testSubmitAndScheduleEntityValidCommands:108 expected:<0> but was:<-1>
FalconCLIIT.testSubmitEntityValidCommands:66 expected:<0> but was:<-1>
FalconCLIIT.testSuspendResumeStatusEntityValidCommands:183->submitTestFiles:885 expected:<0> but was:<-1>
FalconCLIIT.testValidateValidCommands:131 expected:<0> but was:<-1>
Tests run: 158, Failures: 36, Errors: 0, Skipped: 57
[INFO]
[INFO] --- maven-jetty-plugin:6.1.26:stop (stop-jetty) @ falcon-webapp ---
[INFO]
[INFO] --- maven-failsafe-plugin:2.16:verify (verify) @ falcon-webapp ---
[INFO] Stopping server 0
[INFO] Stopped SelectChannelConnector@0.0.0.0:41000
[INFO] Failsafe report directory: <https://builds.apache.org/job/Apache-falcon/ws/webapp/target/failsafe-reports>
[INFO] Stopped SslSocketConnector@0.0.0.0:41443
[INFO] ------------------------------------------------------------------------
[INFO] Reactor Summary:
[INFO]
[INFO] Checkstyle ........................................ SUCCESS [ 1.048 s]
[INFO] Apache Falcon ..................................... SUCCESS [ 6.452 s]
[INFO] Build Tools ....................................... SUCCESS [ 3.728 s]
[INFO] Apache Falcon CLI client .......................... SUCCESS [ 29.033 s]
[INFO] Apache Falcon Metrics ............................. SUCCESS [ 11.328 s]
[INFO] Apache Falcon Hadoop Dependencies ................. SUCCESS [ 14.347 s]
[INFO] Apache Falcon Test Utility ........................ SUCCESS [ 11.646 s]
[INFO] Apache Falcon Commons ............................. SUCCESS [01:35 min]
[INFO] Apache Falcon Oozie EL Extension .................. SUCCESS [ 14.395 s]
[INFO] Apache Falcon Embedded Hadoop - Test Cluster ...... SUCCESS [ 29.794 s]
[INFO] Apache Falcon Sharelib Hive - Test Cluster ........ SUCCESS [ 1.262 s]
[INFO] Apache Falcon Sharelib Pig - Test Cluster ......... SUCCESS [ 0.755 s]
[INFO] Apache Falcon Sharelib Hcatalog - Test Cluster .... SUCCESS [ 0.981 s]
[INFO] Apache Falcon Sharelib Oozie - Test Cluster ....... SUCCESS [ 0.546 s]
[INFO] Apache Falcon Test Tools - Test Cluster ........... SUCCESS [ 0.487 s]
[INFO] Apache Falcon Messaging ........................... SUCCESS [ 25.438 s]
[INFO] Apache Falcon Oozie Adaptor ....................... SUCCESS [ 50.279 s]
[INFO] Apache Falcon Acquisition ......................... SUCCESS [ 0.575 s]
[INFO] Apache Falcon Replication ......................... SUCCESS [ 17.821 s]
[INFO] Apache Falcon Retention ........................... SUCCESS [ 16.833 s]
[INFO] Apache Falcon Archival ............................ SUCCESS [ 0.516 s]
[INFO] Apache Falcon Rerun ............................... SUCCESS [ 24.512 s]
[INFO] Apache Falcon Prism ............................... SUCCESS [ 55.807 s]
[INFO] Apache Falcon Web Application ..................... FAILURE [02:16 min]
[INFO] Apache Falcon Documentation ....................... SKIPPED
[INFO] ------------------------------------------------------------------------
[INFO] BUILD FAILURE
[INFO] ------------------------------------------------------------------------
[INFO] Total time: 09:09 min
[INFO] Finished at: 2015-01-16T03:04:30+00:00
[INFO] Final Memory: 445M/725M
[INFO] ------------------------------------------------------------------------
[ERROR] Failed to execute goal org.apache.maven.plugins:maven-failsafe-plugin:2.16:verify (verify) on project falcon-webapp: There are test failures.
[ERROR]
[ERROR] Please refer to <https://builds.apache.org/job/Apache-falcon/ws/webapp/target/failsafe-reports> for the individual test results.
[ERROR] -> [Help 1]
[ERROR]
[ERROR] To see the full stack trace of the errors, re-run Maven with the -e switch.
[ERROR] Re-run Maven using the -X switch to enable full debug logging.
[ERROR]
[ERROR] For more information about the errors and possible solutions, please read the following articles:
[ERROR] [Help 1] http://cwiki.apache.org/confluence/display/MAVEN/MojoFailureException
[ERROR]
[ERROR] After correcting the problems, you can resume the build with the command
[ERROR] mvn <goals> -rf :falcon-webapp
Shutting down hive metastore.
[INFO] Shutdown hook executing
[INFO] Shutdown hook complete
Build step 'Execute shell' marked build as failure
[CHECKSTYLE] Collecting checkstyle analysis files...
[CHECKSTYLE] Finding all files that match the pattern **/target/checkstyle-result.xml
[CHECKSTYLE] Parsing 26 files in <https://builds.apache.org/job/Apache-falcon/ws/>
[CHECKSTYLE] Successfully parsed file <https://builds.apache.org/job/Apache-falcon/ws/acquisition/target/checkstyle-result.xml> of module with 0 warnings.
[CHECKSTYLE] Successfully parsed file <https://builds.apache.org/job/Apache-falcon/ws/archival/target/checkstyle-result.xml> of module with 0 warnings.
[CHECKSTYLE] Successfully parsed file <https://builds.apache.org/job/Apache-falcon/ws/build-tools/target/checkstyle-result.xml> of module with 0 warnings.
[CHECKSTYLE] Successfully parsed file <https://builds.apache.org/job/Apache-falcon/ws/client/target/checkstyle-result.xml> of module with 0 warnings.
[CHECKSTYLE] Successfully parsed file <https://builds.apache.org/job/Apache-falcon/ws/common/target/checkstyle-result.xml> of module with 0 warnings.
[CHECKSTYLE] Successfully parsed file <https://builds.apache.org/job/Apache-falcon/ws/docs/target/checkstyle-result.xml> of module with 0 warnings.
[CHECKSTYLE] Successfully parsed file <https://builds.apache.org/job/Apache-falcon/ws/feed/target/checkstyle-result.xml> of module with 0 warnings.
[CHECKSTYLE] Successfully parsed file <https://builds.apache.org/job/Apache-falcon/ws/hadoop-dependencies/target/checkstyle-result.xml> of module with 0 warnings.
[CHECKSTYLE] Successfully parsed file <https://builds.apache.org/job/Apache-falcon/ws/hadoop-webapp/target/checkstyle-result.xml> of module with 0 warnings.
[CHECKSTYLE] Successfully parsed file <https://builds.apache.org/job/Apache-falcon/ws/messaging/target/checkstyle-result.xml> of module with 0 warnings.
[CHECKSTYLE] Successfully parsed file <https://builds.apache.org/job/Apache-falcon/ws/metrics/target/checkstyle-result.xml> of module with 0 warnings.
[CHECKSTYLE] Successfully parsed file <https://builds.apache.org/job/Apache-falcon/ws/oozie-el-extensions/target/checkstyle-result.xml> of module with 0 warnings.
[CHECKSTYLE] Successfully parsed file <https://builds.apache.org/job/Apache-falcon/ws/oozie/target/checkstyle-result.xml> of module with 0 warnings.
[CHECKSTYLE] Successfully parsed file <https://builds.apache.org/job/Apache-falcon/ws/prism/target/checkstyle-result.xml> of module with 0 warnings.
[CHECKSTYLE] Successfully parsed file <https://builds.apache.org/job/Apache-falcon/ws/process/target/checkstyle-result.xml> of module with 0 warnings.
[CHECKSTYLE] Successfully parsed file <https://builds.apache.org/job/Apache-falcon/ws/replication/target/checkstyle-result.xml> of module with 0 warnings.
[CHECKSTYLE] Successfully parsed file <https://builds.apache.org/job/Apache-falcon/ws/rerun/target/checkstyle-result.xml> of module with 0 warnings.
[CHECKSTYLE] Successfully parsed file <https://builds.apache.org/job/Apache-falcon/ws/retention/target/checkstyle-result.xml> of module with 0 warnings.
[CHECKSTYLE] Successfully parsed file <https://builds.apache.org/job/Apache-falcon/ws/target/checkstyle-result.xml> of module with 0 warnings.
[CHECKSTYLE] Successfully parsed file <https://builds.apache.org/job/Apache-falcon/ws/test-tools/hadoop-webapp/target/checkstyle-result.xml> of module with 0 warnings.
[CHECKSTYLE] Successfully parsed file <https://builds.apache.org/job/Apache-falcon/ws/test-tools/hcatalog-sharelib/target/checkstyle-result.xml> of module with 0 warnings.
[CHECKSTYLE] Successfully parsed file <https://builds.apache.org/job/Apache-falcon/ws/test-tools/hive-sharelib/target/checkstyle-result.xml> of module with 0 warnings.
[CHECKSTYLE] Successfully parsed file <https://builds.apache.org/job/Apache-falcon/ws/test-tools/oozie-sharelib/target/checkstyle-result.xml> of module with 0 warnings.
[CHECKSTYLE] Successfully parsed file <https://builds.apache.org/job/Apache-falcon/ws/test-tools/pig-sharelib/target/checkstyle-result.xml> of module with 0 warnings.
[CHECKSTYLE] Successfully parsed file <https://builds.apache.org/job/Apache-falcon/ws/test-tools/target/checkstyle-result.xml> of module with 0 warnings.
[CHECKSTYLE] Successfully parsed file <https://builds.apache.org/job/Apache-falcon/ws/test-util/target/checkstyle-result.xml> of module with 0 warnings.
[CHECKSTYLE] Computing warning deltas based on reference build #529
[FINDBUGS] Collecting findbugs analysis files...
[FINDBUGS] Finding all files that match the pattern **/target/findbugs.xml
[FINDBUGS] Parsing 16 files in <https://builds.apache.org/job/Apache-falcon/ws/>
[FINDBUGS] Successfully parsed file <https://builds.apache.org/job/Apache-falcon/ws/client/target/findbugs.xml> of module with 0 warnings.
[FINDBUGS] Successfully parsed file <https://builds.apache.org/job/Apache-falcon/ws/common/target/findbugs.xml> of module with 0 warnings.
[FINDBUGS] Successfully parsed file <https://builds.apache.org/job/Apache-falcon/ws/feed/target/findbugs.xml> of module with 0 warnings.
[FINDBUGS] Successfully parsed file <https://builds.apache.org/job/Apache-falcon/ws/hadoop-dependencies/target/findbugs.xml> of module with 0 warnings.
[FINDBUGS] Successfully parsed file <https://builds.apache.org/job/Apache-falcon/ws/hadoop-webapp/target/findbugs.xml> of module with 0 warnings.
[FINDBUGS] Successfully parsed file <https://builds.apache.org/job/Apache-falcon/ws/messaging/target/findbugs.xml> of module with 0 warnings.
[FINDBUGS] Successfully parsed file <https://builds.apache.org/job/Apache-falcon/ws/metrics/target/findbugs.xml> of module with 0 warnings.
[FINDBUGS] Successfully parsed file <https://builds.apache.org/job/Apache-falcon/ws/oozie-el-extensions/target/findbugs.xml> of module with 0 warnings.
[FINDBUGS] Successfully parsed file <https://builds.apache.org/job/Apache-falcon/ws/oozie/target/findbugs.xml> of module with 0 warnings.
[FINDBUGS] Successfully parsed file <https://builds.apache.org/job/Apache-falcon/ws/prism/target/findbugs.xml> of module with 0 warnings.
[FINDBUGS] Successfully parsed file <https://builds.apache.org/job/Apache-falcon/ws/process/target/findbugs.xml> of module with 0 warnings.
[FINDBUGS] Successfully parsed file <https://builds.apache.org/job/Apache-falcon/ws/replication/target/findbugs.xml> of module with 0 warnings.
[FINDBUGS] Successfully parsed file <https://builds.apache.org/job/Apache-falcon/ws/rerun/target/findbugs.xml> of module with 0 warnings.
[FINDBUGS] Successfully parsed file <https://builds.apache.org/job/Apache-falcon/ws/retention/target/findbugs.xml> of module with 0 warnings.
[FINDBUGS] Successfully parsed file <https://builds.apache.org/job/Apache-falcon/ws/test-tools/hadoop-webapp/target/findbugs.xml> of module with 0 warnings.
[FINDBUGS] Successfully parsed file <https://builds.apache.org/job/Apache-falcon/ws/test-util/target/findbugs.xml> of module with 0 warnings.
[FINDBUGS] Computing warning deltas based on reference build #529
Archiving artifacts
Sending artifact delta relative to Apache-falcon #529
Archived 17 artifacts
Archive block size is 32768
Received 0 blocks and 8635959 bytes
Compression is 0.0%
Took 2.1 sec
Recording test results
TestNG Reports Processing: START
Looking for TestNG results report in workspace using pattern: **/target/testng-results.xml
Did not find any matching files.
Build failed in Jenkins: Apache-falcon #538
Posted by Apache Jenkins Server <je...@builds.apache.org>.
See <https://builds.apache.org/job/Apache-falcon/538/changes>
Changes:
[samarthg] FALCON-989 add timeout to EmbeddedPigScriptTest in falcon regression contributed by Samarth Gupta
[rostafiychuk] FALCON-990 Fix and enable 3/4 tests of RescheduleProcessInFinalStatesTest. Contributed by Ruslan Ostafiychuk
------------------------------------------
[...truncated 5045 lines...]
at org.testng.Assert.assertEquals(Assert.java:118)
at org.testng.Assert.assertEquals(Assert.java:365)
at org.testng.Assert.assertEquals(Assert.java:375)
at org.apache.falcon.cli.FalconCLIIT.submitTestFiles(FalconCLIIT.java:885)
at org.apache.falcon.cli.FalconCLIIT.testInstanceSuspendAndResume(FalconCLIIT.java:432)
testMetadataListCommands(org.apache.falcon.cli.FalconCLIIT) Time elapsed: 0.345 sec <<< FAILURE!
java.lang.AssertionError: expected:<0> but was:<-1>
at org.testng.Assert.fail(Assert.java:89)
at org.testng.Assert.failNotEquals(Assert.java:489)
at org.testng.Assert.assertEquals(Assert.java:118)
at org.testng.Assert.assertEquals(Assert.java:365)
at org.testng.Assert.assertEquals(Assert.java:375)
at org.apache.falcon.cli.FalconCLIIT.submitTestFiles(FalconCLIIT.java:885)
at org.apache.falcon.cli.FalconCLIIT.testMetadataListCommands(FalconCLIIT.java:590)
testMetadataRelationsCommands(org.apache.falcon.cli.FalconCLIIT) Time elapsed: 0.335 sec <<< FAILURE!
java.lang.AssertionError: expected:<0> but was:<-1>
at org.testng.Assert.fail(Assert.java:89)
at org.testng.Assert.failNotEquals(Assert.java:489)
at org.testng.Assert.assertEquals(Assert.java:118)
at org.testng.Assert.assertEquals(Assert.java:365)
at org.testng.Assert.assertEquals(Assert.java:375)
at org.apache.falcon.cli.FalconCLIIT.submitTestFiles(FalconCLIIT.java:885)
at org.apache.falcon.cli.FalconCLIIT.testMetadataRelationsCommands(FalconCLIIT.java:627)
testRecipeCommand(org.apache.falcon.cli.FalconCLIIT) Time elapsed: 0.35 sec <<< FAILURE!
java.lang.AssertionError: expected:<0> but was:<-1>
at org.testng.Assert.fail(Assert.java:89)
at org.testng.Assert.failNotEquals(Assert.java:489)
at org.testng.Assert.assertEquals(Assert.java:118)
at org.testng.Assert.assertEquals(Assert.java:365)
at org.testng.Assert.assertEquals(Assert.java:375)
at org.apache.falcon.cli.FalconCLIIT.recipeSetup(FalconCLIIT.java:826)
at org.apache.falcon.cli.FalconCLIIT.testRecipeCommand(FalconCLIIT.java:809)
testScheduleEntityValidCommands(org.apache.falcon.cli.FalconCLIIT) Time elapsed: 0.359 sec <<< FAILURE!
java.lang.AssertionError: expected:<0> but was:<-1>
at org.testng.Assert.fail(Assert.java:89)
at org.testng.Assert.failNotEquals(Assert.java:489)
at org.testng.Assert.assertEquals(Assert.java:118)
at org.testng.Assert.assertEquals(Assert.java:365)
at org.testng.Assert.assertEquals(Assert.java:375)
at org.apache.falcon.cli.FalconCLIIT.submitTestFiles(FalconCLIIT.java:885)
at org.apache.falcon.cli.FalconCLIIT.testScheduleEntityValidCommands(FalconCLIIT.java:169)
testSubmitAndScheduleEntityValidCommands(org.apache.falcon.cli.FalconCLIIT) Time elapsed: 0.461 sec <<< FAILURE!
java.lang.AssertionError: expected:<0> but was:<-1>
at org.testng.Assert.fail(Assert.java:89)
at org.testng.Assert.failNotEquals(Assert.java:489)
at org.testng.Assert.assertEquals(Assert.java:118)
at org.testng.Assert.assertEquals(Assert.java:365)
at org.testng.Assert.assertEquals(Assert.java:375)
at org.apache.falcon.cli.FalconCLIIT.testSubmitAndScheduleEntityValidCommands(FalconCLIIT.java:108)
testSubmitEntityValidCommands(org.apache.falcon.cli.FalconCLIIT) Time elapsed: 0.323 sec <<< FAILURE!
java.lang.AssertionError: expected:<0> but was:<-1>
at org.testng.Assert.fail(Assert.java:89)
at org.testng.Assert.failNotEquals(Assert.java:489)
at org.testng.Assert.assertEquals(Assert.java:118)
at org.testng.Assert.assertEquals(Assert.java:365)
at org.testng.Assert.assertEquals(Assert.java:375)
at org.apache.falcon.cli.FalconCLIIT.testSubmitEntityValidCommands(FalconCLIIT.java:66)
testSuspendResumeStatusEntityValidCommands(org.apache.falcon.cli.FalconCLIIT) Time elapsed: 0.354 sec <<< FAILURE!
java.lang.AssertionError: expected:<0> but was:<-1>
at org.testng.Assert.fail(Assert.java:89)
at org.testng.Assert.failNotEquals(Assert.java:489)
at org.testng.Assert.assertEquals(Assert.java:118)
at org.testng.Assert.assertEquals(Assert.java:365)
at org.testng.Assert.assertEquals(Assert.java:375)
at org.apache.falcon.cli.FalconCLIIT.submitTestFiles(FalconCLIIT.java:885)
at org.apache.falcon.cli.FalconCLIIT.testSuspendResumeStatusEntityValidCommands(FalconCLIIT.java:183)
testValidateValidCommands(org.apache.falcon.cli.FalconCLIIT) Time elapsed: 0.322 sec <<< FAILURE!
java.lang.AssertionError: expected:<0> but was:<-1>
at org.testng.Assert.fail(Assert.java:89)
at org.testng.Assert.failNotEquals(Assert.java:489)
at org.testng.Assert.assertEquals(Assert.java:118)
at org.testng.Assert.assertEquals(Assert.java:365)
at org.testng.Assert.assertEquals(Assert.java:375)
at org.apache.falcon.cli.FalconCLIIT.testValidateValidCommands(FalconCLIIT.java:131)
Running org.apache.falcon.catalog.HiveCatalogServiceIT
Tests run: 21, Failures: 0, Errors: 0, Skipped: 0, Time elapsed: 14.491 sec - in org.apache.falcon.catalog.HiveCatalogServiceIT
Results :
Failed tests:
FeedEntityValidationIT.testFeedEntityWithInvalidTableUri:138 expected:<200> but was:<400>
FeedEntityValidationIT.testFeedEntityWithInvalidTableUri:138 expected:<200> but was:<400>
FeedEntityValidationIT.testFeedEntityWithInvalidTableUri:138 expected:<200> but was:<400>
FeedEntityValidationIT.testFeedEntityWithInvalidTableUri:138 expected:<200> but was:<400>
FeedEntityValidationIT.testFeedEntityWithInvalidTableUri:138 expected:<200> but was:<400>
FeedEntityValidationIT.testFeedEntityWithInvalidTableUri:138 expected:<200> but was:<400>
FeedEntityValidationIT.testFeedEntityWithValidTable:81 expected:<200> but was:<400>
ClusterEntityValidationIT.testClusterEntityWithValidInterfaces:89 expected:<200> but was:<400>
ClusterEntityValidationIT.testValidateACL:150 expected:<200> but was:<400>
ClusterEntityValidationIT.testValidateClusterLocations:156 » Validation Invali...
EntityManagerPaginationJerseyIT.prepare:42->scheduleMultipleProcess:155 expected:<200> but was:<400>
EntityManagerJerseyIT.testClusterSubmitScheduleSuspendResumeDelete:463 expected:<200> but was:<400>
EntityManagerJerseyIT.cleanup:183 » OozieClient java.io.IOException: Error whi...
EntityManagerJerseySmokeIT.testFeedSchedule:110 expected:<200> but was:<400>
EntityManagerJerseySmokeIT.cleanup:60 » OozieClient java.io.IOException: Error...
MetadataResourceJerseyIT.prepare:51 expected:<200> but was:<400>
FalconCLISmokeIT.testSubmitAndScheduleEntityValidCommands:58 expected:<0> but was:<-1>
FalconCLIIT.testClientProperties:723->submitTestFiles:885 expected:<0> but was:<-1>
FalconCLIIT.testContinue:661->submitTestFiles:885 expected:<0> but was:<-1>
FalconCLIIT.testDefinitionEntityValidCommands:153->submitTestFiles:885 expected:<0> but was:<-1>
FalconCLIIT.testDeleteEntityValidCommands:246->submitTestFiles:885 expected:<0> but was:<-1>
FalconCLIIT.testEntityLineage:499 expected:<0> but was:<-1>
FalconCLIIT.testEntityPaginationFilterByCommands:526 expected:<0> but was:<-1>
FalconCLIIT.testInstanceGetLogs:749->submitTestFiles:885 expected:<0> but was:<-1>
FalconCLIIT.testInstanceKillAndRerun:462->submitTestFiles:885 expected:<0> but was:<-1>
FalconCLIIT.testInstanceRunningAndStatusCommands:275->submitTestFiles:885 expected:<0> but was:<-1>
FalconCLIIT.testInstanceRunningAndSummaryCommands:404->submitTestFiles:885 expected:<0> but was:<-1>
FalconCLIIT.testInstanceSuspendAndResume:432->submitTestFiles:885 expected:<0> but was:<-1>
FalconCLIIT.testMetadataListCommands:590->submitTestFiles:885 expected:<0> but was:<-1>
FalconCLIIT.testMetadataRelationsCommands:627->submitTestFiles:885 expected:<0> but was:<-1>
FalconCLIIT.testRecipeCommand:809->recipeSetup:826 expected:<0> but was:<-1>
FalconCLIIT.testScheduleEntityValidCommands:169->submitTestFiles:885 expected:<0> but was:<-1>
FalconCLIIT.testSubmitAndScheduleEntityValidCommands:108 expected:<0> but was:<-1>
FalconCLIIT.testSubmitEntityValidCommands:66 expected:<0> but was:<-1>
FalconCLIIT.testSuspendResumeStatusEntityValidCommands:183->submitTestFiles:885 expected:<0> but was:<-1>
FalconCLIIT.testValidateValidCommands:131 expected:<0> but was:<-1>
Tests run: 158, Failures: 36, Errors: 0, Skipped: 57
[INFO]
[INFO] --- maven-jetty-plugin:6.1.26:stop (stop-jetty) @ falcon-webapp ---
[INFO]
[INFO] --- maven-failsafe-plugin:2.16:verify (verify) @ falcon-webapp ---
[INFO] Stopping server 0
[INFO] Stopped SelectChannelConnector@0.0.0.0:41000
[INFO] Failsafe report directory: <https://builds.apache.org/job/Apache-falcon/ws/webapp/target/failsafe-reports>
[INFO] Stopped SslSocketConnector@0.0.0.0:41443
[INFO] ------------------------------------------------------------------------
[INFO] Reactor Summary:
[INFO]
[INFO] Checkstyle ........................................ SUCCESS [ 1.018 s]
[INFO] Apache Falcon ..................................... SUCCESS [ 5.659 s]
[INFO] Build Tools ....................................... SUCCESS [ 3.738 s]
[INFO] Apache Falcon CLI client .......................... SUCCESS [ 26.269 s]
[INFO] Apache Falcon Metrics ............................. SUCCESS [ 11.851 s]
[INFO] Apache Falcon Hadoop Dependencies ................. SUCCESS [ 13.556 s]
[INFO] Apache Falcon Test Utility ........................ SUCCESS [ 11.397 s]
[INFO] Apache Falcon Commons ............................. SUCCESS [01:36 min]
[INFO] Apache Falcon Oozie EL Extension .................. SUCCESS [ 14.367 s]
[INFO] Apache Falcon Embedded Hadoop - Test Cluster ...... SUCCESS [ 29.322 s]
[INFO] Apache Falcon Sharelib Hive - Test Cluster ........ SUCCESS [ 1.153 s]
[INFO] Apache Falcon Sharelib Pig - Test Cluster ......... SUCCESS [ 0.808 s]
[INFO] Apache Falcon Sharelib Hcatalog - Test Cluster .... SUCCESS [ 0.927 s]
[INFO] Apache Falcon Sharelib Oozie - Test Cluster ....... SUCCESS [ 0.537 s]
[INFO] Apache Falcon Test Tools - Test Cluster ........... SUCCESS [ 0.482 s]
[INFO] Apache Falcon Messaging ........................... SUCCESS [ 25.620 s]
[INFO] Apache Falcon Oozie Adaptor ....................... SUCCESS [ 50.062 s]
[INFO] Apache Falcon Acquisition ......................... SUCCESS [ 0.500 s]
[INFO] Apache Falcon Replication ......................... SUCCESS [ 17.198 s]
[INFO] Apache Falcon Retention ........................... SUCCESS [ 16.521 s]
[INFO] Apache Falcon Archival ............................ SUCCESS [ 0.503 s]
[INFO] Apache Falcon Rerun ............................... SUCCESS [ 23.785 s]
[INFO] Apache Falcon Prism ............................... SUCCESS [ 55.844 s]
[INFO] Apache Falcon Web Application ..................... FAILURE [02:15 min]
[INFO] Apache Falcon Documentation ....................... SKIPPED
[INFO] ------------------------------------------------------------------------
[INFO] BUILD FAILURE
[INFO] ------------------------------------------------------------------------
[INFO] Total time: 09:03 min
[INFO] Finished at: 2015-01-15T03:07:41+00:00
[INFO] Final Memory: 443M/1127M
[INFO] ------------------------------------------------------------------------
[ERROR] Failed to execute goal org.apache.maven.plugins:maven-failsafe-plugin:2.16:verify (verify) on project falcon-webapp: There are test failures.
[ERROR]
[ERROR] Please refer to <https://builds.apache.org/job/Apache-falcon/ws/webapp/target/failsafe-reports> for the individual test results.
[ERROR] -> [Help 1]
[ERROR]
[ERROR] To see the full stack trace of the errors, re-run Maven with the -e switch.
[ERROR] Re-run Maven using the -X switch to enable full debug logging.
[ERROR]
[ERROR] For more information about the errors and possible solutions, please read the following articles:
[ERROR] [Help 1] http://cwiki.apache.org/confluence/display/MAVEN/MojoFailureException
[ERROR]
[ERROR] After correcting the problems, you can resume the build with the command
[ERROR] mvn <goals> -rf :falcon-webapp
[INFO] Shutdown hook executing
Shutting down hive metastore.
[INFO] Shutdown hook complete
Build step 'Execute shell' marked build as failure
[CHECKSTYLE] Collecting checkstyle analysis files...
[CHECKSTYLE] Finding all files that match the pattern **/target/checkstyle-result.xml
[CHECKSTYLE] Parsing 26 files in <https://builds.apache.org/job/Apache-falcon/ws/>
[CHECKSTYLE] Successfully parsed file <https://builds.apache.org/job/Apache-falcon/ws/acquisition/target/checkstyle-result.xml> of module with 0 warnings.
[CHECKSTYLE] Successfully parsed file <https://builds.apache.org/job/Apache-falcon/ws/archival/target/checkstyle-result.xml> of module with 0 warnings.
[CHECKSTYLE] Successfully parsed file <https://builds.apache.org/job/Apache-falcon/ws/build-tools/target/checkstyle-result.xml> of module with 0 warnings.
[CHECKSTYLE] Successfully parsed file <https://builds.apache.org/job/Apache-falcon/ws/client/target/checkstyle-result.xml> of module with 0 warnings.
[CHECKSTYLE] Successfully parsed file <https://builds.apache.org/job/Apache-falcon/ws/common/target/checkstyle-result.xml> of module with 0 warnings.
[CHECKSTYLE] Successfully parsed file <https://builds.apache.org/job/Apache-falcon/ws/docs/target/checkstyle-result.xml> of module with 0 warnings.
[CHECKSTYLE] Successfully parsed file <https://builds.apache.org/job/Apache-falcon/ws/feed/target/checkstyle-result.xml> of module with 0 warnings.
[CHECKSTYLE] Successfully parsed file <https://builds.apache.org/job/Apache-falcon/ws/hadoop-dependencies/target/checkstyle-result.xml> of module with 0 warnings.
[CHECKSTYLE] Successfully parsed file <https://builds.apache.org/job/Apache-falcon/ws/hadoop-webapp/target/checkstyle-result.xml> of module with 0 warnings.
[CHECKSTYLE] Successfully parsed file <https://builds.apache.org/job/Apache-falcon/ws/messaging/target/checkstyle-result.xml> of module with 0 warnings.
[CHECKSTYLE] Successfully parsed file <https://builds.apache.org/job/Apache-falcon/ws/metrics/target/checkstyle-result.xml> of module with 0 warnings.
[CHECKSTYLE] Successfully parsed file <https://builds.apache.org/job/Apache-falcon/ws/oozie-el-extensions/target/checkstyle-result.xml> of module with 0 warnings.
[CHECKSTYLE] Successfully parsed file <https://builds.apache.org/job/Apache-falcon/ws/oozie/target/checkstyle-result.xml> of module with 0 warnings.
[CHECKSTYLE] Successfully parsed file <https://builds.apache.org/job/Apache-falcon/ws/prism/target/checkstyle-result.xml> of module with 0 warnings.
[CHECKSTYLE] Successfully parsed file <https://builds.apache.org/job/Apache-falcon/ws/process/target/checkstyle-result.xml> of module with 0 warnings.
[CHECKSTYLE] Successfully parsed file <https://builds.apache.org/job/Apache-falcon/ws/replication/target/checkstyle-result.xml> of module with 0 warnings.
[CHECKSTYLE] Successfully parsed file <https://builds.apache.org/job/Apache-falcon/ws/rerun/target/checkstyle-result.xml> of module with 0 warnings.
[CHECKSTYLE] Successfully parsed file <https://builds.apache.org/job/Apache-falcon/ws/retention/target/checkstyle-result.xml> of module with 0 warnings.
[CHECKSTYLE] Successfully parsed file <https://builds.apache.org/job/Apache-falcon/ws/target/checkstyle-result.xml> of module with 0 warnings.
[CHECKSTYLE] Successfully parsed file <https://builds.apache.org/job/Apache-falcon/ws/test-tools/hadoop-webapp/target/checkstyle-result.xml> of module with 0 warnings.
[CHECKSTYLE] Successfully parsed file <https://builds.apache.org/job/Apache-falcon/ws/test-tools/hcatalog-sharelib/target/checkstyle-result.xml> of module with 0 warnings.
[CHECKSTYLE] Successfully parsed file <https://builds.apache.org/job/Apache-falcon/ws/test-tools/hive-sharelib/target/checkstyle-result.xml> of module with 0 warnings.
[CHECKSTYLE] Successfully parsed file <https://builds.apache.org/job/Apache-falcon/ws/test-tools/oozie-sharelib/target/checkstyle-result.xml> of module with 0 warnings.
[CHECKSTYLE] Successfully parsed file <https://builds.apache.org/job/Apache-falcon/ws/test-tools/pig-sharelib/target/checkstyle-result.xml> of module with 0 warnings.
[CHECKSTYLE] Successfully parsed file <https://builds.apache.org/job/Apache-falcon/ws/test-tools/target/checkstyle-result.xml> of module with 0 warnings.
[CHECKSTYLE] Successfully parsed file <https://builds.apache.org/job/Apache-falcon/ws/test-util/target/checkstyle-result.xml> of module with 0 warnings.
[CHECKSTYLE] Computing warning deltas based on reference build #529
[FINDBUGS] Collecting findbugs analysis files...
[FINDBUGS] Finding all files that match the pattern **/target/findbugs.xml
[FINDBUGS] Parsing 16 files in <https://builds.apache.org/job/Apache-falcon/ws/>
[FINDBUGS] Successfully parsed file <https://builds.apache.org/job/Apache-falcon/ws/client/target/findbugs.xml> of module with 0 warnings.
[FINDBUGS] Successfully parsed file <https://builds.apache.org/job/Apache-falcon/ws/common/target/findbugs.xml> of module with 0 warnings.
[FINDBUGS] Successfully parsed file <https://builds.apache.org/job/Apache-falcon/ws/feed/target/findbugs.xml> of module with 0 warnings.
[FINDBUGS] Successfully parsed file <https://builds.apache.org/job/Apache-falcon/ws/hadoop-dependencies/target/findbugs.xml> of module with 0 warnings.
[FINDBUGS] Successfully parsed file <https://builds.apache.org/job/Apache-falcon/ws/hadoop-webapp/target/findbugs.xml> of module with 0 warnings.
[FINDBUGS] Successfully parsed file <https://builds.apache.org/job/Apache-falcon/ws/messaging/target/findbugs.xml> of module with 0 warnings.
[FINDBUGS] Successfully parsed file <https://builds.apache.org/job/Apache-falcon/ws/metrics/target/findbugs.xml> of module with 0 warnings.
[FINDBUGS] Successfully parsed file <https://builds.apache.org/job/Apache-falcon/ws/oozie-el-extensions/target/findbugs.xml> of module with 0 warnings.
[FINDBUGS] Successfully parsed file <https://builds.apache.org/job/Apache-falcon/ws/oozie/target/findbugs.xml> of module with 0 warnings.
[FINDBUGS] Successfully parsed file <https://builds.apache.org/job/Apache-falcon/ws/prism/target/findbugs.xml> of module with 0 warnings.
[FINDBUGS] Successfully parsed file <https://builds.apache.org/job/Apache-falcon/ws/process/target/findbugs.xml> of module with 0 warnings.
[FINDBUGS] Successfully parsed file <https://builds.apache.org/job/Apache-falcon/ws/replication/target/findbugs.xml> of module with 0 warnings.
[FINDBUGS] Successfully parsed file <https://builds.apache.org/job/Apache-falcon/ws/rerun/target/findbugs.xml> of module with 0 warnings.
[FINDBUGS] Successfully parsed file <https://builds.apache.org/job/Apache-falcon/ws/retention/target/findbugs.xml> of module with 0 warnings.
[FINDBUGS] Successfully parsed file <https://builds.apache.org/job/Apache-falcon/ws/test-tools/hadoop-webapp/target/findbugs.xml> of module with 0 warnings.
[FINDBUGS] Successfully parsed file <https://builds.apache.org/job/Apache-falcon/ws/test-util/target/findbugs.xml> of module with 0 warnings.
[FINDBUGS] Computing warning deltas based on reference build #529
Archiving artifacts
Sending artifact delta relative to Apache-falcon #529
Archived 17 artifacts
Archive block size is 32768
Received 0 blocks and 8635882 bytes
Compression is 0.0%
Took 2.4 sec
Recording test results
TestNG Reports Processing: START
Looking for TestNG results report in workspace using pattern: **/target/testng-results.xml
Did not find any matching files.
Build failed in Jenkins: Apache-falcon #537
Posted by Apache Jenkins Server <je...@builds.apache.org>.
See <https://builds.apache.org/job/Apache-falcon/537/>
------------------------------------------
[...truncated 5048 lines...]
at org.testng.Assert.assertEquals(Assert.java:118)
at org.testng.Assert.assertEquals(Assert.java:365)
at org.testng.Assert.assertEquals(Assert.java:375)
at org.apache.falcon.cli.FalconCLIIT.submitTestFiles(FalconCLIIT.java:885)
at org.apache.falcon.cli.FalconCLIIT.testInstanceSuspendAndResume(FalconCLIIT.java:432)
testMetadataListCommands(org.apache.falcon.cli.FalconCLIIT) Time elapsed: 0.351 sec <<< FAILURE!
java.lang.AssertionError: expected:<0> but was:<-1>
at org.testng.Assert.fail(Assert.java:89)
at org.testng.Assert.failNotEquals(Assert.java:489)
at org.testng.Assert.assertEquals(Assert.java:118)
at org.testng.Assert.assertEquals(Assert.java:365)
at org.testng.Assert.assertEquals(Assert.java:375)
at org.apache.falcon.cli.FalconCLIIT.submitTestFiles(FalconCLIIT.java:885)
at org.apache.falcon.cli.FalconCLIIT.testMetadataListCommands(FalconCLIIT.java:590)
testMetadataRelationsCommands(org.apache.falcon.cli.FalconCLIIT) Time elapsed: 0.338 sec <<< FAILURE!
java.lang.AssertionError: expected:<0> but was:<-1>
at org.testng.Assert.fail(Assert.java:89)
at org.testng.Assert.failNotEquals(Assert.java:489)
at org.testng.Assert.assertEquals(Assert.java:118)
at org.testng.Assert.assertEquals(Assert.java:365)
at org.testng.Assert.assertEquals(Assert.java:375)
at org.apache.falcon.cli.FalconCLIIT.submitTestFiles(FalconCLIIT.java:885)
at org.apache.falcon.cli.FalconCLIIT.testMetadataRelationsCommands(FalconCLIIT.java:627)
testRecipeCommand(org.apache.falcon.cli.FalconCLIIT) Time elapsed: 0.349 sec <<< FAILURE!
java.lang.AssertionError: expected:<0> but was:<-1>
at org.testng.Assert.fail(Assert.java:89)
at org.testng.Assert.failNotEquals(Assert.java:489)
at org.testng.Assert.assertEquals(Assert.java:118)
at org.testng.Assert.assertEquals(Assert.java:365)
at org.testng.Assert.assertEquals(Assert.java:375)
at org.apache.falcon.cli.FalconCLIIT.recipeSetup(FalconCLIIT.java:826)
at org.apache.falcon.cli.FalconCLIIT.testRecipeCommand(FalconCLIIT.java:809)
testScheduleEntityValidCommands(org.apache.falcon.cli.FalconCLIIT) Time elapsed: 0.343 sec <<< FAILURE!
java.lang.AssertionError: expected:<0> but was:<-1>
at org.testng.Assert.fail(Assert.java:89)
at org.testng.Assert.failNotEquals(Assert.java:489)
at org.testng.Assert.assertEquals(Assert.java:118)
at org.testng.Assert.assertEquals(Assert.java:365)
at org.testng.Assert.assertEquals(Assert.java:375)
at org.apache.falcon.cli.FalconCLIIT.submitTestFiles(FalconCLIIT.java:885)
at org.apache.falcon.cli.FalconCLIIT.testScheduleEntityValidCommands(FalconCLIIT.java:169)
testSubmitAndScheduleEntityValidCommands(org.apache.falcon.cli.FalconCLIIT) Time elapsed: 0.468 sec <<< FAILURE!
java.lang.AssertionError: expected:<0> but was:<-1>
at org.testng.Assert.fail(Assert.java:89)
at org.testng.Assert.failNotEquals(Assert.java:489)
at org.testng.Assert.assertEquals(Assert.java:118)
at org.testng.Assert.assertEquals(Assert.java:365)
at org.testng.Assert.assertEquals(Assert.java:375)
at org.apache.falcon.cli.FalconCLIIT.testSubmitAndScheduleEntityValidCommands(FalconCLIIT.java:108)
testSubmitEntityValidCommands(org.apache.falcon.cli.FalconCLIIT) Time elapsed: 0.32 sec <<< FAILURE!
java.lang.AssertionError: expected:<0> but was:<-1>
at org.testng.Assert.fail(Assert.java:89)
at org.testng.Assert.failNotEquals(Assert.java:489)
at org.testng.Assert.assertEquals(Assert.java:118)
at org.testng.Assert.assertEquals(Assert.java:365)
at org.testng.Assert.assertEquals(Assert.java:375)
at org.apache.falcon.cli.FalconCLIIT.testSubmitEntityValidCommands(FalconCLIIT.java:66)
testSuspendResumeStatusEntityValidCommands(org.apache.falcon.cli.FalconCLIIT) Time elapsed: 0.341 sec <<< FAILURE!
java.lang.AssertionError: expected:<0> but was:<-1>
at org.testng.Assert.fail(Assert.java:89)
at org.testng.Assert.failNotEquals(Assert.java:489)
at org.testng.Assert.assertEquals(Assert.java:118)
at org.testng.Assert.assertEquals(Assert.java:365)
at org.testng.Assert.assertEquals(Assert.java:375)
at org.apache.falcon.cli.FalconCLIIT.submitTestFiles(FalconCLIIT.java:885)
at org.apache.falcon.cli.FalconCLIIT.testSuspendResumeStatusEntityValidCommands(FalconCLIIT.java:183)
testValidateValidCommands(org.apache.falcon.cli.FalconCLIIT) Time elapsed: 0.314 sec <<< FAILURE!
java.lang.AssertionError: expected:<0> but was:<-1>
at org.testng.Assert.fail(Assert.java:89)
at org.testng.Assert.failNotEquals(Assert.java:489)
at org.testng.Assert.assertEquals(Assert.java:118)
at org.testng.Assert.assertEquals(Assert.java:365)
at org.testng.Assert.assertEquals(Assert.java:375)
at org.apache.falcon.cli.FalconCLIIT.testValidateValidCommands(FalconCLIIT.java:131)
Running org.apache.falcon.catalog.HiveCatalogServiceIT
Tests run: 21, Failures: 0, Errors: 0, Skipped: 0, Time elapsed: 14.506 sec - in org.apache.falcon.catalog.HiveCatalogServiceIT
Results :
Failed tests:
FeedEntityValidationIT.testFeedEntityWithInvalidTableUri:138 expected:<200> but was:<400>
FeedEntityValidationIT.testFeedEntityWithInvalidTableUri:138 expected:<200> but was:<400>
FeedEntityValidationIT.testFeedEntityWithInvalidTableUri:138 expected:<200> but was:<400>
FeedEntityValidationIT.testFeedEntityWithInvalidTableUri:138 expected:<200> but was:<400>
FeedEntityValidationIT.testFeedEntityWithInvalidTableUri:138 expected:<200> but was:<400>
FeedEntityValidationIT.testFeedEntityWithInvalidTableUri:138 expected:<200> but was:<400>
FeedEntityValidationIT.testFeedEntityWithValidTable:81 expected:<200> but was:<400>
ClusterEntityValidationIT.testClusterEntityWithValidInterfaces:89 expected:<200> but was:<400>
ClusterEntityValidationIT.testValidateACL:150 expected:<200> but was:<400>
ClusterEntityValidationIT.testValidateClusterLocations:156 » Validation Invali...
EntityManagerPaginationJerseyIT.prepare:42->scheduleMultipleProcess:155 expected:<200> but was:<400>
EntityManagerJerseyIT.testClusterSubmitScheduleSuspendResumeDelete:463 expected:<200> but was:<400>
EntityManagerJerseyIT.cleanup:183 » OozieClient java.io.IOException: Error whi...
EntityManagerJerseySmokeIT.testFeedSchedule:110 expected:<200> but was:<400>
EntityManagerJerseySmokeIT.cleanup:60 » OozieClient java.io.IOException: Error...
MetadataResourceJerseyIT.prepare:51 expected:<200> but was:<400>
FalconCLISmokeIT.testSubmitAndScheduleEntityValidCommands:58 expected:<0> but was:<-1>
FalconCLIIT.testClientProperties:723->submitTestFiles:885 expected:<0> but was:<-1>
FalconCLIIT.testContinue:661->submitTestFiles:885 expected:<0> but was:<-1>
FalconCLIIT.testDefinitionEntityValidCommands:153->submitTestFiles:885 expected:<0> but was:<-1>
FalconCLIIT.testDeleteEntityValidCommands:246->submitTestFiles:885 expected:<0> but was:<-1>
FalconCLIIT.testEntityLineage:499 expected:<0> but was:<-1>
FalconCLIIT.testEntityPaginationFilterByCommands:526 expected:<0> but was:<-1>
FalconCLIIT.testInstanceGetLogs:749->submitTestFiles:885 expected:<0> but was:<-1>
FalconCLIIT.testInstanceKillAndRerun:462->submitTestFiles:885 expected:<0> but was:<-1>
FalconCLIIT.testInstanceRunningAndStatusCommands:275->submitTestFiles:885 expected:<0> but was:<-1>
FalconCLIIT.testInstanceRunningAndSummaryCommands:404->submitTestFiles:885 expected:<0> but was:<-1>
FalconCLIIT.testInstanceSuspendAndResume:432->submitTestFiles:885 expected:<0> but was:<-1>
FalconCLIIT.testMetadataListCommands:590->submitTestFiles:885 expected:<0> but was:<-1>
FalconCLIIT.testMetadataRelationsCommands:627->submitTestFiles:885 expected:<0> but was:<-1>
FalconCLIIT.testRecipeCommand:809->recipeSetup:826 expected:<0> but was:<-1>
FalconCLIIT.testScheduleEntityValidCommands:169->submitTestFiles:885 expected:<0> but was:<-1>
FalconCLIIT.testSubmitAndScheduleEntityValidCommands:108 expected:<0> but was:<-1>
FalconCLIIT.testSubmitEntityValidCommands:66 expected:<0> but was:<-1>
FalconCLIIT.testSuspendResumeStatusEntityValidCommands:183->submitTestFiles:885 expected:<0> but was:<-1>
FalconCLIIT.testValidateValidCommands:131 expected:<0> but was:<-1>
Tests run: 158, Failures: 36, Errors: 0, Skipped: 57
[INFO]
[INFO] --- maven-jetty-plugin:6.1.26:stop (stop-jetty) @ falcon-webapp ---
[INFO]
[INFO] --- maven-failsafe-plugin:2.16:verify (verify) @ falcon-webapp ---
[INFO] Stopping server 0
[INFO] Stopped SelectChannelConnector@0.0.0.0:41000
[INFO] Stopped SslSocketConnector@0.0.0.0:41443
[INFO] Failsafe report directory: <https://builds.apache.org/job/Apache-falcon/ws/webapp/target/failsafe-reports>
[INFO] ------------------------------------------------------------------------
[INFO] Reactor Summary:
[INFO]
[INFO] Checkstyle ........................................ SUCCESS [ 1.003 s]
[INFO] Apache Falcon ..................................... SUCCESS [ 5.183 s]
[INFO] Build Tools ....................................... SUCCESS [ 3.736 s]
[INFO] Apache Falcon CLI client .......................... SUCCESS [ 27.492 s]
[INFO] Apache Falcon Metrics ............................. SUCCESS [ 12.284 s]
[INFO] Apache Falcon Hadoop Dependencies ................. SUCCESS [ 13.973 s]
[INFO] Apache Falcon Test Utility ........................ SUCCESS [ 11.433 s]
[INFO] Apache Falcon Commons ............................. SUCCESS [01:33 min]
[INFO] Apache Falcon Oozie EL Extension .................. SUCCESS [ 15.283 s]
[INFO] Apache Falcon Embedded Hadoop - Test Cluster ...... SUCCESS [ 29.362 s]
[INFO] Apache Falcon Sharelib Hive - Test Cluster ........ SUCCESS [ 1.186 s]
[INFO] Apache Falcon Sharelib Pig - Test Cluster ......... SUCCESS [ 0.775 s]
[INFO] Apache Falcon Sharelib Hcatalog - Test Cluster .... SUCCESS [ 0.950 s]
[INFO] Apache Falcon Sharelib Oozie - Test Cluster ....... SUCCESS [ 0.538 s]
[INFO] Apache Falcon Test Tools - Test Cluster ........... SUCCESS [ 0.482 s]
[INFO] Apache Falcon Messaging ........................... SUCCESS [ 25.324 s]
[INFO] Apache Falcon Oozie Adaptor ....................... SUCCESS [ 49.674 s]
[INFO] Apache Falcon Acquisition ......................... SUCCESS [ 0.533 s]
[INFO] Apache Falcon Replication ......................... SUCCESS [ 16.261 s]
[INFO] Apache Falcon Retention ........................... SUCCESS [ 16.406 s]
[INFO] Apache Falcon Archival ............................ SUCCESS [ 0.493 s]
[INFO] Apache Falcon Rerun ............................... SUCCESS [ 24.016 s]
[INFO] Apache Falcon Prism ............................... SUCCESS [ 55.899 s]
[INFO] Apache Falcon Web Application ..................... FAILURE [02:15 min]
[INFO] Apache Falcon Documentation ....................... SKIPPED
[INFO] ------------------------------------------------------------------------
[INFO] BUILD FAILURE
[INFO] ------------------------------------------------------------------------
[INFO] Total time: 09:02 min
[INFO] Finished at: 2015-01-14T00:40:46+00:00
[INFO] Final Memory: 445M/1105M
[INFO] ------------------------------------------------------------------------
[ERROR] Failed to execute goal org.apache.maven.plugins:maven-failsafe-plugin:2.16:verify (verify) on project falcon-webapp: There are test failures.
[ERROR]
[ERROR] Please refer to <https://builds.apache.org/job/Apache-falcon/ws/webapp/target/failsafe-reports> for the individual test results.
[ERROR] -> [Help 1]
[ERROR]
[ERROR] To see the full stack trace of the errors, re-run Maven with the -e switch.
[ERROR] Re-run Maven using the -X switch to enable full debug logging.
[ERROR]
[ERROR] For more information about the errors and possible solutions, please read the following articles:
[ERROR] [Help 1] http://cwiki.apache.org/confluence/display/MAVEN/MojoFailureException
[ERROR]
[ERROR] After correcting the problems, you can resume the build with the command
[ERROR] mvn <goals> -rf :falcon-webapp
Shutting down hive metastore.
[INFO] Shutdown hook executing
[INFO] Shutdown hook complete
Build step 'Execute shell' marked build as failure
[CHECKSTYLE] Collecting checkstyle analysis files...
[CHECKSTYLE] Finding all files that match the pattern **/target/checkstyle-result.xml
[CHECKSTYLE] Parsing 26 files in <https://builds.apache.org/job/Apache-falcon/ws/>
[CHECKSTYLE] Successfully parsed file <https://builds.apache.org/job/Apache-falcon/ws/acquisition/target/checkstyle-result.xml> of module with 0 warnings.
[CHECKSTYLE] Successfully parsed file <https://builds.apache.org/job/Apache-falcon/ws/archival/target/checkstyle-result.xml> of module with 0 warnings.
[CHECKSTYLE] Successfully parsed file <https://builds.apache.org/job/Apache-falcon/ws/build-tools/target/checkstyle-result.xml> of module with 0 warnings.
[CHECKSTYLE] Successfully parsed file <https://builds.apache.org/job/Apache-falcon/ws/client/target/checkstyle-result.xml> of module with 0 warnings.
[CHECKSTYLE] Successfully parsed file <https://builds.apache.org/job/Apache-falcon/ws/common/target/checkstyle-result.xml> of module with 0 warnings.
[CHECKSTYLE] Successfully parsed file <https://builds.apache.org/job/Apache-falcon/ws/docs/target/checkstyle-result.xml> of module with 0 warnings.
[CHECKSTYLE] Successfully parsed file <https://builds.apache.org/job/Apache-falcon/ws/feed/target/checkstyle-result.xml> of module with 0 warnings.
[CHECKSTYLE] Successfully parsed file <https://builds.apache.org/job/Apache-falcon/ws/hadoop-dependencies/target/checkstyle-result.xml> of module with 0 warnings.
[CHECKSTYLE] Successfully parsed file <https://builds.apache.org/job/Apache-falcon/ws/hadoop-webapp/target/checkstyle-result.xml> of module with 0 warnings.
[CHECKSTYLE] Successfully parsed file <https://builds.apache.org/job/Apache-falcon/ws/messaging/target/checkstyle-result.xml> of module with 0 warnings.
[CHECKSTYLE] Successfully parsed file <https://builds.apache.org/job/Apache-falcon/ws/metrics/target/checkstyle-result.xml> of module with 0 warnings.
[CHECKSTYLE] Successfully parsed file <https://builds.apache.org/job/Apache-falcon/ws/oozie-el-extensions/target/checkstyle-result.xml> of module with 0 warnings.
[CHECKSTYLE] Successfully parsed file <https://builds.apache.org/job/Apache-falcon/ws/oozie/target/checkstyle-result.xml> of module with 0 warnings.
[CHECKSTYLE] Successfully parsed file <https://builds.apache.org/job/Apache-falcon/ws/prism/target/checkstyle-result.xml> of module with 0 warnings.
[CHECKSTYLE] Successfully parsed file <https://builds.apache.org/job/Apache-falcon/ws/process/target/checkstyle-result.xml> of module with 0 warnings.
[CHECKSTYLE] Successfully parsed file <https://builds.apache.org/job/Apache-falcon/ws/replication/target/checkstyle-result.xml> of module with 0 warnings.
[CHECKSTYLE] Successfully parsed file <https://builds.apache.org/job/Apache-falcon/ws/rerun/target/checkstyle-result.xml> of module with 0 warnings.
[CHECKSTYLE] Successfully parsed file <https://builds.apache.org/job/Apache-falcon/ws/retention/target/checkstyle-result.xml> of module with 0 warnings.
[CHECKSTYLE] Successfully parsed file <https://builds.apache.org/job/Apache-falcon/ws/target/checkstyle-result.xml> of module with 0 warnings.
[CHECKSTYLE] Successfully parsed file <https://builds.apache.org/job/Apache-falcon/ws/test-tools/hadoop-webapp/target/checkstyle-result.xml> of module with 0 warnings.
[CHECKSTYLE] Successfully parsed file <https://builds.apache.org/job/Apache-falcon/ws/test-tools/hcatalog-sharelib/target/checkstyle-result.xml> of module with 0 warnings.
[CHECKSTYLE] Successfully parsed file <https://builds.apache.org/job/Apache-falcon/ws/test-tools/hive-sharelib/target/checkstyle-result.xml> of module with 0 warnings.
[CHECKSTYLE] Successfully parsed file <https://builds.apache.org/job/Apache-falcon/ws/test-tools/oozie-sharelib/target/checkstyle-result.xml> of module with 0 warnings.
[CHECKSTYLE] Successfully parsed file <https://builds.apache.org/job/Apache-falcon/ws/test-tools/pig-sharelib/target/checkstyle-result.xml> of module with 0 warnings.
[CHECKSTYLE] Successfully parsed file <https://builds.apache.org/job/Apache-falcon/ws/test-tools/target/checkstyle-result.xml> of module with 0 warnings.
[CHECKSTYLE] Successfully parsed file <https://builds.apache.org/job/Apache-falcon/ws/test-util/target/checkstyle-result.xml> of module with 0 warnings.
[CHECKSTYLE] Computing warning deltas based on reference build #529
[FINDBUGS] Collecting findbugs analysis files...
[FINDBUGS] Finding all files that match the pattern **/target/findbugs.xml
[FINDBUGS] Parsing 16 files in <https://builds.apache.org/job/Apache-falcon/ws/>
[FINDBUGS] Successfully parsed file <https://builds.apache.org/job/Apache-falcon/ws/client/target/findbugs.xml> of module with 0 warnings.
[FINDBUGS] Successfully parsed file <https://builds.apache.org/job/Apache-falcon/ws/common/target/findbugs.xml> of module with 0 warnings.
[FINDBUGS] Successfully parsed file <https://builds.apache.org/job/Apache-falcon/ws/feed/target/findbugs.xml> of module with 0 warnings.
[FINDBUGS] Successfully parsed file <https://builds.apache.org/job/Apache-falcon/ws/hadoop-dependencies/target/findbugs.xml> of module with 0 warnings.
[FINDBUGS] Successfully parsed file <https://builds.apache.org/job/Apache-falcon/ws/hadoop-webapp/target/findbugs.xml> of module with 0 warnings.
[FINDBUGS] Successfully parsed file <https://builds.apache.org/job/Apache-falcon/ws/messaging/target/findbugs.xml> of module with 0 warnings.
[FINDBUGS] Successfully parsed file <https://builds.apache.org/job/Apache-falcon/ws/metrics/target/findbugs.xml> of module with 0 warnings.
[FINDBUGS] Successfully parsed file <https://builds.apache.org/job/Apache-falcon/ws/oozie-el-extensions/target/findbugs.xml> of module with 0 warnings.
[FINDBUGS] Successfully parsed file <https://builds.apache.org/job/Apache-falcon/ws/oozie/target/findbugs.xml> of module with 0 warnings.
[FINDBUGS] Successfully parsed file <https://builds.apache.org/job/Apache-falcon/ws/prism/target/findbugs.xml> of module with 0 warnings.
[FINDBUGS] Successfully parsed file <https://builds.apache.org/job/Apache-falcon/ws/process/target/findbugs.xml> of module with 0 warnings.
[FINDBUGS] Successfully parsed file <https://builds.apache.org/job/Apache-falcon/ws/replication/target/findbugs.xml> of module with 0 warnings.
[FINDBUGS] Successfully parsed file <https://builds.apache.org/job/Apache-falcon/ws/rerun/target/findbugs.xml> of module with 0 warnings.
[FINDBUGS] Successfully parsed file <https://builds.apache.org/job/Apache-falcon/ws/retention/target/findbugs.xml> of module with 0 warnings.
[FINDBUGS] Successfully parsed file <https://builds.apache.org/job/Apache-falcon/ws/test-tools/hadoop-webapp/target/findbugs.xml> of module with 0 warnings.
[FINDBUGS] Successfully parsed file <https://builds.apache.org/job/Apache-falcon/ws/test-util/target/findbugs.xml> of module with 0 warnings.
[FINDBUGS] Computing warning deltas based on reference build #529
Archiving artifacts
Sending artifact delta relative to Apache-falcon #529
Archived 17 artifacts
Archive block size is 32768
Received 0 blocks and 8635061 bytes
Compression is 0.0%
Took 2.1 sec
Recording test results
TestNG Reports Processing: START
Looking for TestNG results report in workspace using pattern: **/target/testng-results.xml
Did not find any matching files.
Build failed in Jenkins: Apache-falcon #536
Posted by Apache Jenkins Server <je...@builds.apache.org>.
See <https://builds.apache.org/job/Apache-falcon/536/>
------------------------------------------
[...truncated 5048 lines...]
at org.testng.Assert.assertEquals(Assert.java:118)
at org.testng.Assert.assertEquals(Assert.java:365)
at org.testng.Assert.assertEquals(Assert.java:375)
at org.apache.falcon.cli.FalconCLIIT.submitTestFiles(FalconCLIIT.java:885)
at org.apache.falcon.cli.FalconCLIIT.testInstanceSuspendAndResume(FalconCLIIT.java:432)
testMetadataListCommands(org.apache.falcon.cli.FalconCLIIT) Time elapsed: 0.349 sec <<< FAILURE!
java.lang.AssertionError: expected:<0> but was:<-1>
at org.testng.Assert.fail(Assert.java:89)
at org.testng.Assert.failNotEquals(Assert.java:489)
at org.testng.Assert.assertEquals(Assert.java:118)
at org.testng.Assert.assertEquals(Assert.java:365)
at org.testng.Assert.assertEquals(Assert.java:375)
at org.apache.falcon.cli.FalconCLIIT.submitTestFiles(FalconCLIIT.java:885)
at org.apache.falcon.cli.FalconCLIIT.testMetadataListCommands(FalconCLIIT.java:590)
testMetadataRelationsCommands(org.apache.falcon.cli.FalconCLIIT) Time elapsed: 0.331 sec <<< FAILURE!
java.lang.AssertionError: expected:<0> but was:<-1>
at org.testng.Assert.fail(Assert.java:89)
at org.testng.Assert.failNotEquals(Assert.java:489)
at org.testng.Assert.assertEquals(Assert.java:118)
at org.testng.Assert.assertEquals(Assert.java:365)
at org.testng.Assert.assertEquals(Assert.java:375)
at org.apache.falcon.cli.FalconCLIIT.submitTestFiles(FalconCLIIT.java:885)
at org.apache.falcon.cli.FalconCLIIT.testMetadataRelationsCommands(FalconCLIIT.java:627)
testRecipeCommand(org.apache.falcon.cli.FalconCLIIT) Time elapsed: 0.35 sec <<< FAILURE!
java.lang.AssertionError: expected:<0> but was:<-1>
at org.testng.Assert.fail(Assert.java:89)
at org.testng.Assert.failNotEquals(Assert.java:489)
at org.testng.Assert.assertEquals(Assert.java:118)
at org.testng.Assert.assertEquals(Assert.java:365)
at org.testng.Assert.assertEquals(Assert.java:375)
at org.apache.falcon.cli.FalconCLIIT.recipeSetup(FalconCLIIT.java:826)
at org.apache.falcon.cli.FalconCLIIT.testRecipeCommand(FalconCLIIT.java:809)
testScheduleEntityValidCommands(org.apache.falcon.cli.FalconCLIIT) Time elapsed: 0.349 sec <<< FAILURE!
java.lang.AssertionError: expected:<0> but was:<-1>
at org.testng.Assert.fail(Assert.java:89)
at org.testng.Assert.failNotEquals(Assert.java:489)
at org.testng.Assert.assertEquals(Assert.java:118)
at org.testng.Assert.assertEquals(Assert.java:365)
at org.testng.Assert.assertEquals(Assert.java:375)
at org.apache.falcon.cli.FalconCLIIT.submitTestFiles(FalconCLIIT.java:885)
at org.apache.falcon.cli.FalconCLIIT.testScheduleEntityValidCommands(FalconCLIIT.java:169)
testSubmitAndScheduleEntityValidCommands(org.apache.falcon.cli.FalconCLIIT) Time elapsed: 0.492 sec <<< FAILURE!
java.lang.AssertionError: expected:<0> but was:<-1>
at org.testng.Assert.fail(Assert.java:89)
at org.testng.Assert.failNotEquals(Assert.java:489)
at org.testng.Assert.assertEquals(Assert.java:118)
at org.testng.Assert.assertEquals(Assert.java:365)
at org.testng.Assert.assertEquals(Assert.java:375)
at org.apache.falcon.cli.FalconCLIIT.testSubmitAndScheduleEntityValidCommands(FalconCLIIT.java:108)
testSubmitEntityValidCommands(org.apache.falcon.cli.FalconCLIIT) Time elapsed: 0.322 sec <<< FAILURE!
java.lang.AssertionError: expected:<0> but was:<-1>
at org.testng.Assert.fail(Assert.java:89)
at org.testng.Assert.failNotEquals(Assert.java:489)
at org.testng.Assert.assertEquals(Assert.java:118)
at org.testng.Assert.assertEquals(Assert.java:365)
at org.testng.Assert.assertEquals(Assert.java:375)
at org.apache.falcon.cli.FalconCLIIT.testSubmitEntityValidCommands(FalconCLIIT.java:66)
testSuspendResumeStatusEntityValidCommands(org.apache.falcon.cli.FalconCLIIT) Time elapsed: 0.341 sec <<< FAILURE!
java.lang.AssertionError: expected:<0> but was:<-1>
at org.testng.Assert.fail(Assert.java:89)
at org.testng.Assert.failNotEquals(Assert.java:489)
at org.testng.Assert.assertEquals(Assert.java:118)
at org.testng.Assert.assertEquals(Assert.java:365)
at org.testng.Assert.assertEquals(Assert.java:375)
at org.apache.falcon.cli.FalconCLIIT.submitTestFiles(FalconCLIIT.java:885)
at org.apache.falcon.cli.FalconCLIIT.testSuspendResumeStatusEntityValidCommands(FalconCLIIT.java:183)
testValidateValidCommands(org.apache.falcon.cli.FalconCLIIT) Time elapsed: 0.315 sec <<< FAILURE!
java.lang.AssertionError: expected:<0> but was:<-1>
at org.testng.Assert.fail(Assert.java:89)
at org.testng.Assert.failNotEquals(Assert.java:489)
at org.testng.Assert.assertEquals(Assert.java:118)
at org.testng.Assert.assertEquals(Assert.java:365)
at org.testng.Assert.assertEquals(Assert.java:375)
at org.apache.falcon.cli.FalconCLIIT.testValidateValidCommands(FalconCLIIT.java:131)
Running org.apache.falcon.catalog.HiveCatalogServiceIT
Tests run: 21, Failures: 0, Errors: 0, Skipped: 0, Time elapsed: 14.623 sec - in org.apache.falcon.catalog.HiveCatalogServiceIT
Results :
Failed tests:
FeedEntityValidationIT.testFeedEntityWithInvalidTableUri:138 expected:<200> but was:<400>
FeedEntityValidationIT.testFeedEntityWithInvalidTableUri:138 expected:<200> but was:<400>
FeedEntityValidationIT.testFeedEntityWithInvalidTableUri:138 expected:<200> but was:<400>
FeedEntityValidationIT.testFeedEntityWithInvalidTableUri:138 expected:<200> but was:<400>
FeedEntityValidationIT.testFeedEntityWithInvalidTableUri:138 expected:<200> but was:<400>
FeedEntityValidationIT.testFeedEntityWithInvalidTableUri:138 expected:<200> but was:<400>
FeedEntityValidationIT.testFeedEntityWithValidTable:81 expected:<200> but was:<400>
ClusterEntityValidationIT.testClusterEntityWithValidInterfaces:89 expected:<200> but was:<400>
ClusterEntityValidationIT.testValidateACL:150 expected:<200> but was:<400>
ClusterEntityValidationIT.testValidateClusterLocations:156 » Validation Invali...
EntityManagerPaginationJerseyIT.prepare:42->scheduleMultipleProcess:155 expected:<200> but was:<400>
EntityManagerJerseyIT.testClusterSubmitScheduleSuspendResumeDelete:463 expected:<200> but was:<400>
EntityManagerJerseyIT.cleanup:183 » OozieClient java.io.IOException: Error whi...
EntityManagerJerseySmokeIT.testFeedSchedule:110 expected:<200> but was:<400>
EntityManagerJerseySmokeIT.cleanup:60 » OozieClient java.io.IOException: Error...
MetadataResourceJerseyIT.prepare:51 expected:<200> but was:<400>
FalconCLISmokeIT.testSubmitAndScheduleEntityValidCommands:58 expected:<0> but was:<-1>
FalconCLIIT.testClientProperties:723->submitTestFiles:885 expected:<0> but was:<-1>
FalconCLIIT.testContinue:661->submitTestFiles:885 expected:<0> but was:<-1>
FalconCLIIT.testDefinitionEntityValidCommands:153->submitTestFiles:885 expected:<0> but was:<-1>
FalconCLIIT.testDeleteEntityValidCommands:246->submitTestFiles:885 expected:<0> but was:<-1>
FalconCLIIT.testEntityLineage:499 expected:<0> but was:<-1>
FalconCLIIT.testEntityPaginationFilterByCommands:526 expected:<0> but was:<-1>
FalconCLIIT.testInstanceGetLogs:749->submitTestFiles:885 expected:<0> but was:<-1>
FalconCLIIT.testInstanceKillAndRerun:462->submitTestFiles:885 expected:<0> but was:<-1>
FalconCLIIT.testInstanceRunningAndStatusCommands:275->submitTestFiles:885 expected:<0> but was:<-1>
FalconCLIIT.testInstanceRunningAndSummaryCommands:404->submitTestFiles:885 expected:<0> but was:<-1>
FalconCLIIT.testInstanceSuspendAndResume:432->submitTestFiles:885 expected:<0> but was:<-1>
FalconCLIIT.testMetadataListCommands:590->submitTestFiles:885 expected:<0> but was:<-1>
FalconCLIIT.testMetadataRelationsCommands:627->submitTestFiles:885 expected:<0> but was:<-1>
FalconCLIIT.testRecipeCommand:809->recipeSetup:826 expected:<0> but was:<-1>
FalconCLIIT.testScheduleEntityValidCommands:169->submitTestFiles:885 expected:<0> but was:<-1>
FalconCLIIT.testSubmitAndScheduleEntityValidCommands:108 expected:<0> but was:<-1>
FalconCLIIT.testSubmitEntityValidCommands:66 expected:<0> but was:<-1>
FalconCLIIT.testSuspendResumeStatusEntityValidCommands:183->submitTestFiles:885 expected:<0> but was:<-1>
FalconCLIIT.testValidateValidCommands:131 expected:<0> but was:<-1>
Tests run: 158, Failures: 36, Errors: 0, Skipped: 57
[INFO]
[INFO] --- maven-jetty-plugin:6.1.26:stop (stop-jetty) @ falcon-webapp ---
[INFO]
[INFO] --- maven-failsafe-plugin:2.16:verify (verify) @ falcon-webapp ---
[INFO] Stopping server 0
[INFO] Stopped SelectChannelConnector@0.0.0.0:41000
[INFO] Stopped SslSocketConnector@0.0.0.0:41443
[INFO] Failsafe report directory: <https://builds.apache.org/job/Apache-falcon/ws/webapp/target/failsafe-reports>
[INFO] ------------------------------------------------------------------------
[INFO] Reactor Summary:
[INFO]
[INFO] Checkstyle ........................................ SUCCESS [ 1.004 s]
[INFO] Apache Falcon ..................................... SUCCESS [ 5.192 s]
[INFO] Build Tools ....................................... SUCCESS [ 3.753 s]
[INFO] Apache Falcon CLI client .......................... SUCCESS [ 28.106 s]
[INFO] Apache Falcon Metrics ............................. SUCCESS [ 11.806 s]
[INFO] Apache Falcon Hadoop Dependencies ................. SUCCESS [ 13.558 s]
[INFO] Apache Falcon Test Utility ........................ SUCCESS [ 11.372 s]
[INFO] Apache Falcon Commons ............................. SUCCESS [01:33 min]
[INFO] Apache Falcon Oozie EL Extension .................. SUCCESS [ 14.547 s]
[INFO] Apache Falcon Embedded Hadoop - Test Cluster ...... SUCCESS [ 29.723 s]
[INFO] Apache Falcon Sharelib Hive - Test Cluster ........ SUCCESS [ 1.207 s]
[INFO] Apache Falcon Sharelib Pig - Test Cluster ......... SUCCESS [ 0.747 s]
[INFO] Apache Falcon Sharelib Hcatalog - Test Cluster .... SUCCESS [ 1.015 s]
[INFO] Apache Falcon Sharelib Oozie - Test Cluster ....... SUCCESS [ 0.543 s]
[INFO] Apache Falcon Test Tools - Test Cluster ........... SUCCESS [ 0.498 s]
[INFO] Apache Falcon Messaging ........................... SUCCESS [ 25.294 s]
[INFO] Apache Falcon Oozie Adaptor ....................... SUCCESS [ 50.937 s]
[INFO] Apache Falcon Acquisition ......................... SUCCESS [ 0.520 s]
[INFO] Apache Falcon Replication ......................... SUCCESS [ 15.931 s]
[INFO] Apache Falcon Retention ........................... SUCCESS [ 16.967 s]
[INFO] Apache Falcon Archival ............................ SUCCESS [ 0.510 s]
[INFO] Apache Falcon Rerun ............................... SUCCESS [ 24.626 s]
[INFO] Apache Falcon Prism ............................... SUCCESS [ 55.947 s]
[INFO] Apache Falcon Web Application ..................... FAILURE [02:18 min]
[INFO] Apache Falcon Documentation ....................... SKIPPED
[INFO] ------------------------------------------------------------------------
[INFO] BUILD FAILURE
[INFO] ------------------------------------------------------------------------
[INFO] Total time: 09:07 min
[INFO] Finished at: 2015-01-13T21:00:39+00:00
[INFO] Final Memory: 446M/1128M
[INFO] ------------------------------------------------------------------------
[ERROR] Failed to execute goal org.apache.maven.plugins:maven-failsafe-plugin:2.16:verify (verify) on project falcon-webapp: There are test failures.
[ERROR]
[ERROR] Please refer to <https://builds.apache.org/job/Apache-falcon/ws/webapp/target/failsafe-reports> for the individual test results.
[ERROR] -> [Help 1]
[ERROR]
[ERROR] To see the full stack trace of the errors, re-run Maven with the -e switch.
[ERROR] Re-run Maven using the -X switch to enable full debug logging.
[ERROR]
[ERROR] For more information about the errors and possible solutions, please read the following articles:
[ERROR] [Help 1] http://cwiki.apache.org/confluence/display/MAVEN/MojoFailureException
[ERROR]
[ERROR] After correcting the problems, you can resume the build with the command
[ERROR] mvn <goals> -rf :falcon-webapp
[INFO] Shutdown hook executing
Shutting down hive metastore.
[INFO] Shutdown hook complete
Build step 'Execute shell' marked build as failure
[CHECKSTYLE] Collecting checkstyle analysis files...
[CHECKSTYLE] Finding all files that match the pattern **/target/checkstyle-result.xml
[CHECKSTYLE] Parsing 26 files in <https://builds.apache.org/job/Apache-falcon/ws/>
[CHECKSTYLE] Successfully parsed file <https://builds.apache.org/job/Apache-falcon/ws/acquisition/target/checkstyle-result.xml> of module with 0 warnings.
[CHECKSTYLE] Successfully parsed file <https://builds.apache.org/job/Apache-falcon/ws/archival/target/checkstyle-result.xml> of module with 0 warnings.
[CHECKSTYLE] Successfully parsed file <https://builds.apache.org/job/Apache-falcon/ws/build-tools/target/checkstyle-result.xml> of module with 0 warnings.
[CHECKSTYLE] Successfully parsed file <https://builds.apache.org/job/Apache-falcon/ws/client/target/checkstyle-result.xml> of module with 0 warnings.
[CHECKSTYLE] Successfully parsed file <https://builds.apache.org/job/Apache-falcon/ws/common/target/checkstyle-result.xml> of module with 0 warnings.
[CHECKSTYLE] Successfully parsed file <https://builds.apache.org/job/Apache-falcon/ws/docs/target/checkstyle-result.xml> of module with 0 warnings.
[CHECKSTYLE] Successfully parsed file <https://builds.apache.org/job/Apache-falcon/ws/feed/target/checkstyle-result.xml> of module with 0 warnings.
[CHECKSTYLE] Successfully parsed file <https://builds.apache.org/job/Apache-falcon/ws/hadoop-dependencies/target/checkstyle-result.xml> of module with 0 warnings.
[CHECKSTYLE] Successfully parsed file <https://builds.apache.org/job/Apache-falcon/ws/hadoop-webapp/target/checkstyle-result.xml> of module with 0 warnings.
[CHECKSTYLE] Successfully parsed file <https://builds.apache.org/job/Apache-falcon/ws/messaging/target/checkstyle-result.xml> of module with 0 warnings.
[CHECKSTYLE] Successfully parsed file <https://builds.apache.org/job/Apache-falcon/ws/metrics/target/checkstyle-result.xml> of module with 0 warnings.
[CHECKSTYLE] Successfully parsed file <https://builds.apache.org/job/Apache-falcon/ws/oozie-el-extensions/target/checkstyle-result.xml> of module with 0 warnings.
[CHECKSTYLE] Successfully parsed file <https://builds.apache.org/job/Apache-falcon/ws/oozie/target/checkstyle-result.xml> of module with 0 warnings.
[CHECKSTYLE] Successfully parsed file <https://builds.apache.org/job/Apache-falcon/ws/prism/target/checkstyle-result.xml> of module with 0 warnings.
[CHECKSTYLE] Successfully parsed file <https://builds.apache.org/job/Apache-falcon/ws/process/target/checkstyle-result.xml> of module with 0 warnings.
[CHECKSTYLE] Successfully parsed file <https://builds.apache.org/job/Apache-falcon/ws/replication/target/checkstyle-result.xml> of module with 0 warnings.
[CHECKSTYLE] Successfully parsed file <https://builds.apache.org/job/Apache-falcon/ws/rerun/target/checkstyle-result.xml> of module with 0 warnings.
[CHECKSTYLE] Successfully parsed file <https://builds.apache.org/job/Apache-falcon/ws/retention/target/checkstyle-result.xml> of module with 0 warnings.
[CHECKSTYLE] Successfully parsed file <https://builds.apache.org/job/Apache-falcon/ws/target/checkstyle-result.xml> of module with 0 warnings.
[CHECKSTYLE] Successfully parsed file <https://builds.apache.org/job/Apache-falcon/ws/test-tools/hadoop-webapp/target/checkstyle-result.xml> of module with 0 warnings.
[CHECKSTYLE] Successfully parsed file <https://builds.apache.org/job/Apache-falcon/ws/test-tools/hcatalog-sharelib/target/checkstyle-result.xml> of module with 0 warnings.
[CHECKSTYLE] Successfully parsed file <https://builds.apache.org/job/Apache-falcon/ws/test-tools/hive-sharelib/target/checkstyle-result.xml> of module with 0 warnings.
[CHECKSTYLE] Successfully parsed file <https://builds.apache.org/job/Apache-falcon/ws/test-tools/oozie-sharelib/target/checkstyle-result.xml> of module with 0 warnings.
[CHECKSTYLE] Successfully parsed file <https://builds.apache.org/job/Apache-falcon/ws/test-tools/pig-sharelib/target/checkstyle-result.xml> of module with 0 warnings.
[CHECKSTYLE] Successfully parsed file <https://builds.apache.org/job/Apache-falcon/ws/test-tools/target/checkstyle-result.xml> of module with 0 warnings.
[CHECKSTYLE] Successfully parsed file <https://builds.apache.org/job/Apache-falcon/ws/test-util/target/checkstyle-result.xml> of module with 0 warnings.
[CHECKSTYLE] Computing warning deltas based on reference build #529
[FINDBUGS] Collecting findbugs analysis files...
[FINDBUGS] Finding all files that match the pattern **/target/findbugs.xml
[FINDBUGS] Parsing 16 files in <https://builds.apache.org/job/Apache-falcon/ws/>
[FINDBUGS] Successfully parsed file <https://builds.apache.org/job/Apache-falcon/ws/client/target/findbugs.xml> of module with 0 warnings.
[FINDBUGS] Successfully parsed file <https://builds.apache.org/job/Apache-falcon/ws/common/target/findbugs.xml> of module with 0 warnings.
[FINDBUGS] Successfully parsed file <https://builds.apache.org/job/Apache-falcon/ws/feed/target/findbugs.xml> of module with 0 warnings.
[FINDBUGS] Successfully parsed file <https://builds.apache.org/job/Apache-falcon/ws/hadoop-dependencies/target/findbugs.xml> of module with 0 warnings.
[FINDBUGS] Successfully parsed file <https://builds.apache.org/job/Apache-falcon/ws/hadoop-webapp/target/findbugs.xml> of module with 0 warnings.
[FINDBUGS] Successfully parsed file <https://builds.apache.org/job/Apache-falcon/ws/messaging/target/findbugs.xml> of module with 0 warnings.
[FINDBUGS] Successfully parsed file <https://builds.apache.org/job/Apache-falcon/ws/metrics/target/findbugs.xml> of module with 0 warnings.
[FINDBUGS] Successfully parsed file <https://builds.apache.org/job/Apache-falcon/ws/oozie-el-extensions/target/findbugs.xml> of module with 0 warnings.
[FINDBUGS] Successfully parsed file <https://builds.apache.org/job/Apache-falcon/ws/oozie/target/findbugs.xml> of module with 0 warnings.
[FINDBUGS] Successfully parsed file <https://builds.apache.org/job/Apache-falcon/ws/prism/target/findbugs.xml> of module with 0 warnings.
[FINDBUGS] Successfully parsed file <https://builds.apache.org/job/Apache-falcon/ws/process/target/findbugs.xml> of module with 0 warnings.
[FINDBUGS] Successfully parsed file <https://builds.apache.org/job/Apache-falcon/ws/replication/target/findbugs.xml> of module with 0 warnings.
[FINDBUGS] Successfully parsed file <https://builds.apache.org/job/Apache-falcon/ws/rerun/target/findbugs.xml> of module with 0 warnings.
[FINDBUGS] Successfully parsed file <https://builds.apache.org/job/Apache-falcon/ws/retention/target/findbugs.xml> of module with 0 warnings.
[FINDBUGS] Successfully parsed file <https://builds.apache.org/job/Apache-falcon/ws/test-tools/hadoop-webapp/target/findbugs.xml> of module with 0 warnings.
[FINDBUGS] Successfully parsed file <https://builds.apache.org/job/Apache-falcon/ws/test-util/target/findbugs.xml> of module with 0 warnings.
[FINDBUGS] Computing warning deltas based on reference build #529
Archiving artifacts
Sending artifact delta relative to Apache-falcon #529
Archived 17 artifacts
Archive block size is 32768
Received 0 blocks and 8606194 bytes
Compression is 0.0%
Took 2.2 sec
Recording test results
TestNG Reports Processing: START
Looking for TestNG results report in workspace using pattern: **/target/testng-results.xml
Did not find any matching files.