You are viewing a plain text version of this content. The canonical link for it is here.
Posted to builds@solr.apache.org by Apache Jenkins Server <je...@builds.apache.org> on 2022/10/13 19:35:07 UTC

[JENKINS] Solr » Solr-NightlyTests-main - Build # 576 - Unstable!

Build: https://ci-builds.apache.org/job/Solr/job/Solr-NightlyTests-main/576/

2 tests failed.
FAILED:  org.apache.solr.cloud.RollingRestartTest.test

Error Message:
java.lang.AssertionError: There are still nodes recovering - waited for 330SECONDS

Stack Trace:
java.lang.AssertionError: There are still nodes recovering - waited for 330SECONDS
	at __randomizedtesting.SeedInfo.seed([50B2B7CD4D3D4DCF:D8E68817E3C12037]:0)
	at org.junit.Assert.fail(Assert.java:89)
	at org.apache.solr.cloud.AbstractDistribZkTestBase.waitForRecoveriesToFinish(AbstractDistribZkTestBase.java:224)
	at org.apache.solr.cloud.AbstractDistribZkTestBase.waitForRecoveriesToFinish(AbstractDistribZkTestBase.java:147)
	at org.apache.solr.cloud.AbstractDistribZkTestBase.waitForRecoveriesToFinish(AbstractDistribZkTestBase.java:141)
	at org.apache.solr.cloud.AbstractFullDistribZkTestBase.waitForRecoveriesToFinish(AbstractFullDistribZkTestBase.java:1173)
	at org.apache.solr.cloud.RollingRestartTest.test(RollingRestartTest.java:61)
	at java.base/jdk.internal.reflect.NativeMethodAccessorImpl.invoke0(Native Method)
	at java.base/jdk.internal.reflect.NativeMethodAccessorImpl.invoke(NativeMethodAccessorImpl.java:62)
	at java.base/jdk.internal.reflect.DelegatingMethodAccessorImpl.invoke(DelegatingMethodAccessorImpl.java:43)
	at java.base/java.lang.reflect.Method.invoke(Method.java:566)
	at com.carrotsearch.randomizedtesting.RandomizedRunner.invoke(RandomizedRunner.java:1758)
	at com.carrotsearch.randomizedtesting.RandomizedRunner$8.evaluate(RandomizedRunner.java:946)
	at com.carrotsearch.randomizedtesting.RandomizedRunner$9.evaluate(RandomizedRunner.java:982)
	at com.carrotsearch.randomizedtesting.RandomizedRunner$10.evaluate(RandomizedRunner.java:996)
	at org.apache.solr.BaseDistributedSearchTestCase$ShardsRepeatRule$ShardsFixedStatement.callStatement(BaseDistributedSearchTestCase.java:1167)
	at org.apache.solr.BaseDistributedSearchTestCase$ShardsRepeatRule$ShardsStatement.evaluate(BaseDistributedSearchTestCase.java:1138)
	at com.carrotsearch.randomizedtesting.rules.SystemPropertiesRestoreRule$1.evaluate(SystemPropertiesRestoreRule.java:80)
	at org.junit.rules.RunRules.evaluate(RunRules.java:20)
	at org.apache.lucene.tests.util.TestRuleSetupTeardownChained$1.evaluate(TestRuleSetupTeardownChained.java:44)
	at org.apache.lucene.tests.util.AbstractBeforeAfterRule$1.evaluate(AbstractBeforeAfterRule.java:43)
	at org.apache.lucene.tests.util.TestRuleThreadAndTestName$1.evaluate(TestRuleThreadAndTestName.java:45)
	at org.apache.lucene.tests.util.TestRuleIgnoreAfterMaxFailures$1.evaluate(TestRuleIgnoreAfterMaxFailures.java:60)
	at org.apache.lucene.tests.util.TestRuleMarkFailure$1.evaluate(TestRuleMarkFailure.java:44)
	at org.junit.rules.RunRules.evaluate(RunRules.java:20)
	at com.carrotsearch.randomizedtesting.rules.StatementAdapter.evaluate(StatementAdapter.java:36)
	at com.carrotsearch.randomizedtesting.ThreadLeakControl$StatementRunner.run(ThreadLeakControl.java:390)
	at com.carrotsearch.randomizedtesting.ThreadLeakControl.forkTimeoutingTask(ThreadLeakControl.java:843)
	at com.carrotsearch.randomizedtesting.ThreadLeakControl$3.evaluate(ThreadLeakControl.java:490)
	at com.carrotsearch.randomizedtesting.RandomizedRunner.runSingleTest(RandomizedRunner.java:955)
	at com.carrotsearch.randomizedtesting.RandomizedRunner$5.evaluate(RandomizedRunner.java:840)
	at com.carrotsearch.randomizedtesting.RandomizedRunner$6.evaluate(RandomizedRunner.java:891)
	at com.carrotsearch.randomizedtesting.RandomizedRunner$7.evaluate(RandomizedRunner.java:902)
	at com.carrotsearch.randomizedtesting.rules.StatementAdapter.evaluate(StatementAdapter.java:36)
	at org.apache.lucene.tests.util.AbstractBeforeAfterRule$1.evaluate(AbstractBeforeAfterRule.java:43)
	at org.apache.lucene.tests.util.AbstractBeforeAfterRule$1.evaluate(AbstractBeforeAfterRule.java:43)
	at com.carrotsearch.randomizedtesting.rules.SystemPropertiesRestoreRule$1.evaluate(SystemPropertiesRestoreRule.java:80)
	at org.junit.rules.RunRules.evaluate(RunRules.java:20)
	at org.apache.lucene.tests.util.AbstractBeforeAfterRule$1.evaluate(AbstractBeforeAfterRule.java:43)
	at com.carrotsearch.randomizedtesting.rules.StatementAdapter.evaluate(StatementAdapter.java:36)
	at org.apache.lucene.tests.util.TestRuleStoreClassName$1.evaluate(TestRuleStoreClassName.java:38)
	at com.carrotsearch.randomizedtesting.rules.NoShadowingOrOverridesOnMethodsRule$1.evaluate(NoShadowingOrOverridesOnMethodsRule.java:40)
	at com.carrotsearch.randomizedtesting.rules.NoShadowingOrOverridesOnMethodsRule$1.evaluate(NoShadowingOrOverridesOnMethodsRule.java:40)
	at com.carrotsearch.randomizedtesting.rules.StatementAdapter.evaluate(StatementAdapter.java:36)
	at com.carrotsearch.randomizedtesting.rules.StatementAdapter.evaluate(StatementAdapter.java:36)
	at org.apache.lucene.tests.util.TestRuleAssertionsRequired$1.evaluate(TestRuleAssertionsRequired.java:53)
	at org.apache.lucene.tests.util.AbstractBeforeAfterRule$1.evaluate(AbstractBeforeAfterRule.java:43)
	at org.apache.lucene.tests.util.TestRuleMarkFailure$1.evaluate(TestRuleMarkFailure.java:44)
	at org.apache.lucene.tests.util.TestRuleIgnoreAfterMaxFailures$1.evaluate(TestRuleIgnoreAfterMaxFailures.java:60)
	at org.apache.lucene.tests.util.TestRuleIgnoreTestSuites$1.evaluate(TestRuleIgnoreTestSuites.java:47)
	at org.junit.rules.RunRules.evaluate(RunRules.java:20)
	at com.carrotsearch.randomizedtesting.rules.StatementAdapter.evaluate(StatementAdapter.java:36)
	at com.carrotsearch.randomizedtesting.ThreadLeakControl$StatementRunner.run(ThreadLeakControl.java:390)
	at com.carrotsearch.randomizedtesting.ThreadLeakControl.lambda$forkTimeoutingTask$0(ThreadLeakControl.java:850)
	at java.base/java.lang.Thread.run(Thread.java:829)


FAILED:  org.apache.solr.search.TestReRankQParserPlugin.testMinExactCount

Error Message:
java.lang.AssertionError: REQUEST FAILED: xpath=//result/doc[2]/str[@name='id'][.='0']
	xml response was: <?xml version="1.0" encoding="UTF-8"?>
<response>
<lst name="responseHeader"><int name="status">0</int><int name="QTime">2</int></lst><result name="response" numFound="200" start="0" maxScore="0.0011321187" numFoundExact="true"><doc><str name="id">10</str><float name="score">4.4537134</float></doc><doc><str name="id">11</str><float name="score">0.0011321187</float></doc><doc><str name="id">12</str><float name="score">0.0011321187</float></doc><doc><str name="id">13</str><float name="score">0.0011321187</float></doc><doc><str name="id">14</str><float name="score">0.0011321187</float></doc><doc><str name="id">15</str><float name="score">0.0011321187</float></doc><doc><str name="id">16</str><float name="score">0.0011321187</float></doc><doc><str name="id">17</str><float name="score">0.0011321187</float></doc><doc><str name="id">18</str><float name="score">0.0011321187</float></doc><doc><str name="id">19</str><float name="score">0.0011321187</float></doc></result>
</response>

	request was:q=field_t:0&start=0&rows=10&fl=id,score&sort=score+desc,+id_p_i+asc&rq={!rerank+reRankQuery%3D$rrq+reRankDocs%3D20}&rrq=id:10

Stack Trace:
java.lang.AssertionError: REQUEST FAILED: xpath=//result/doc[2]/str[@name='id'][.='0']
	xml response was: <?xml version="1.0" encoding="UTF-8"?>
<response>
<lst name="responseHeader"><int name="status">0</int><int name="QTime">2</int></lst><result name="response" numFound="200" start="0" maxScore="0.0011321187" numFoundExact="true"><doc><str name="id">10</str><float name="score">4.4537134</float></doc><doc><str name="id">11</str><float name="score">0.0011321187</float></doc><doc><str name="id">12</str><float name="score">0.0011321187</float></doc><doc><str name="id">13</str><float name="score">0.0011321187</float></doc><doc><str name="id">14</str><float name="score">0.0011321187</float></doc><doc><str name="id">15</str><float name="score">0.0011321187</float></doc><doc><str name="id">16</str><float name="score">0.0011321187</float></doc><doc><str name="id">17</str><float name="score">0.0011321187</float></doc><doc><str name="id">18</str><float name="score">0.0011321187</float></doc><doc><str name="id">19</str><float name="score">0.0011321187</float></doc></result>
</response>

	request was:q=field_t:0&start=0&rows=10&fl=id,score&sort=score+desc,+id_p_i+asc&rq={!rerank+reRankQuery%3D$rrq+reRankDocs%3D20}&rrq=id:10
	at __randomizedtesting.SeedInfo.seed([50B2B7CD4D3D4DCF:25328D55A2E0B3B8]:0)
	at org.junit.Assert.fail(Assert.java:89)
	at org.apache.solr.SolrTestCaseJ4.assertQ(SolrTestCaseJ4.java:1036)
	at org.apache.solr.SolrTestCaseJ4.assertQ(SolrTestCaseJ4.java:1000)
	at org.apache.solr.search.TestReRankQParserPlugin.testMinExactCount(TestReRankQParserPlugin.java:1000)
	at java.base/jdk.internal.reflect.NativeMethodAccessorImpl.invoke0(Native Method)
	at java.base/jdk.internal.reflect.NativeMethodAccessorImpl.invoke(NativeMethodAccessorImpl.java:62)
	at java.base/jdk.internal.reflect.DelegatingMethodAccessorImpl.invoke(DelegatingMethodAccessorImpl.java:43)
	at java.base/java.lang.reflect.Method.invoke(Method.java:566)
	at com.carrotsearch.randomizedtesting.RandomizedRunner.invoke(RandomizedRunner.java:1758)
	at com.carrotsearch.randomizedtesting.RandomizedRunner$8.evaluate(RandomizedRunner.java:946)
	at com.carrotsearch.randomizedtesting.RandomizedRunner$9.evaluate(RandomizedRunner.java:982)
	at com.carrotsearch.randomizedtesting.RandomizedRunner$10.evaluate(RandomizedRunner.java:996)
	at com.carrotsearch.randomizedtesting.rules.SystemPropertiesRestoreRule$1.evaluate(SystemPropertiesRestoreRule.java:80)
	at org.junit.rules.RunRules.evaluate(RunRules.java:20)
	at org.apache.lucene.tests.util.TestRuleSetupTeardownChained$1.evaluate(TestRuleSetupTeardownChained.java:44)
	at org.apache.lucene.tests.util.AbstractBeforeAfterRule$1.evaluate(AbstractBeforeAfterRule.java:43)
	at org.apache.lucene.tests.util.TestRuleThreadAndTestName$1.evaluate(TestRuleThreadAndTestName.java:45)
	at org.apache.lucene.tests.util.TestRuleIgnoreAfterMaxFailures$1.evaluate(TestRuleIgnoreAfterMaxFailures.java:60)
	at org.apache.lucene.tests.util.TestRuleMarkFailure$1.evaluate(TestRuleMarkFailure.java:44)
	at org.junit.rules.RunRules.evaluate(RunRules.java:20)
	at com.carrotsearch.randomizedtesting.rules.StatementAdapter.evaluate(StatementAdapter.java:36)
	at com.carrotsearch.randomizedtesting.ThreadLeakControl$StatementRunner.run(ThreadLeakControl.java:390)
	at com.carrotsearch.randomizedtesting.ThreadLeakControl.forkTimeoutingTask(ThreadLeakControl.java:843)
	at com.carrotsearch.randomizedtesting.ThreadLeakControl$3.evaluate(ThreadLeakControl.java:490)
	at com.carrotsearch.randomizedtesting.RandomizedRunner.runSingleTest(RandomizedRunner.java:955)
	at com.carrotsearch.randomizedtesting.RandomizedRunner$5.evaluate(RandomizedRunner.java:840)
	at com.carrotsearch.randomizedtesting.RandomizedRunner$6.evaluate(RandomizedRunner.java:891)
	at com.carrotsearch.randomizedtesting.RandomizedRunner$7.evaluate(RandomizedRunner.java:902)
	at com.carrotsearch.randomizedtesting.rules.StatementAdapter.evaluate(StatementAdapter.java:36)
	at org.apache.lucene.tests.util.AbstractBeforeAfterRule$1.evaluate(AbstractBeforeAfterRule.java:43)
	at org.apache.lucene.tests.util.AbstractBeforeAfterRule$1.evaluate(AbstractBeforeAfterRule.java:43)
	at com.carrotsearch.randomizedtesting.rules.SystemPropertiesRestoreRule$1.evaluate(SystemPropertiesRestoreRule.java:80)
	at org.junit.rules.RunRules.evaluate(RunRules.java:20)
	at org.apache.lucene.tests.util.AbstractBeforeAfterRule$1.evaluate(AbstractBeforeAfterRule.java:43)
	at com.carrotsearch.randomizedtesting.rules.StatementAdapter.evaluate(StatementAdapter.java:36)
	at org.apache.lucene.tests.util.TestRuleStoreClassName$1.evaluate(TestRuleStoreClassName.java:38)
	at com.carrotsearch.randomizedtesting.rules.NoShadowingOrOverridesOnMethodsRule$1.evaluate(NoShadowingOrOverridesOnMethodsRule.java:40)
	at com.carrotsearch.randomizedtesting.rules.NoShadowingOrOverridesOnMethodsRule$1.evaluate(NoShadowingOrOverridesOnMethodsRule.java:40)
	at com.carrotsearch.randomizedtesting.rules.StatementAdapter.evaluate(StatementAdapter.java:36)
	at com.carrotsearch.randomizedtesting.rules.StatementAdapter.evaluate(StatementAdapter.java:36)
	at org.apache.lucene.tests.util.TestRuleAssertionsRequired$1.evaluate(TestRuleAssertionsRequired.java:53)
	at org.apache.lucene.tests.util.AbstractBeforeAfterRule$1.evaluate(AbstractBeforeAfterRule.java:43)
	at org.apache.lucene.tests.util.TestRuleMarkFailure$1.evaluate(TestRuleMarkFailure.java:44)
	at org.apache.lucene.tests.util.TestRuleIgnoreAfterMaxFailures$1.evaluate(TestRuleIgnoreAfterMaxFailures.java:60)
	at org.apache.lucene.tests.util.TestRuleIgnoreTestSuites$1.evaluate(TestRuleIgnoreTestSuites.java:47)
	at org.junit.rules.RunRules.evaluate(RunRules.java:20)
	at com.carrotsearch.randomizedtesting.rules.StatementAdapter.evaluate(StatementAdapter.java:36)
	at com.carrotsearch.randomizedtesting.ThreadLeakControl$StatementRunner.run(ThreadLeakControl.java:390)
	at com.carrotsearch.randomizedtesting.ThreadLeakControl.lambda$forkTimeoutingTask$0(ThreadLeakControl.java:850)
	at java.base/java.lang.Thread.run(Thread.java:829)




Build Log:
[...truncated 16794 lines...]
ERROR: The following test(s) have failed:
  - org.apache.solr.search.TestReRankQParserPlugin.testMinExactCount (:solr:core)
    Test output: /home/jenkins/jenkins-slave/workspace/Solr/Solr-NightlyTests-main/solr/core/build/test-results/test/outputs/OUTPUT-org.apache.solr.search.TestReRankQParserPlugin.txt
    Reproduce with: gradlew :solr:core:test --tests "org.apache.solr.search.TestReRankQParserPlugin.testMinExactCount" -Ptests.jvms=4 -Ptests.haltonfailure=false "-Ptests.jvmargs=-XX:TieredStopAtLevel=1 -XX:ReservedCodeCacheSize=120m" -Ptests.seed=50B2B7CD4D3D4DCF -Ptests.multiplier=2 -Ptests.nightly=true -Ptests.badapples=false -Ptests.file.encoding=ISO-8859-1 -Ptests.linedocsfile=/home/jenkins/jenkins-slave/workspace/Solr/Solr-NightlyTests-main/test-data/enwiki.random.lines.txt

  - org.apache.solr.cloud.RollingRestartTest.test (:solr:core)
    Test output: /home/jenkins/jenkins-slave/workspace/Solr/Solr-NightlyTests-main/solr/core/build/test-results/test/outputs/OUTPUT-org.apache.solr.cloud.RollingRestartTest.txt
    Reproduce with: gradlew :solr:core:test --tests "org.apache.solr.cloud.RollingRestartTest.test" -Ptests.jvms=4 -Ptests.haltonfailure=false "-Ptests.jvmargs=-XX:TieredStopAtLevel=1 -XX:ReservedCodeCacheSize=120m" -Ptests.seed=50B2B7CD4D3D4DCF -Ptests.multiplier=2 -Ptests.nightly=true -Ptests.badapples=false -Ptests.file.encoding=ISO-8859-1 -Ptests.linedocsfile=/home/jenkins/jenkins-slave/workspace/Solr/Solr-NightlyTests-main/test-data/enwiki.random.lines.txt


Deprecated Gradle features were used in this build, making it incompatible with Gradle 8.0.

You can use '--warning-mode all' to show the individual deprecation warnings and determine if they come from your own scripts or plugins.

See https://docs.gradle.org/7.2/userguide/command_line_interface.html#sec:command_line_warnings

BUILD SUCCESSFUL in 1h 56m 32s
126 actionable tasks: 99 executed, 27 up-to-date
Build step 'Invoke Gradle script' changed build result to SUCCESS
Archiving artifacts
hudson.FilePath$ValidateAntFileMask$1Cancel
	at hudson.FilePath$ValidateAntFileMask$1.isCaseSensitive(FilePath.java:3209)
	at org.apache.tools.ant.DirectoryScanner.isIncluded(DirectoryScanner.java:1370)
	at org.apache.tools.ant.DirectoryScanner.scandir(DirectoryScanner.java:1241)
	at org.apache.tools.ant.DirectoryScanner.scandir(DirectoryScanner.java:1267)
	at org.apache.tools.ant.DirectoryScanner.scandir(DirectoryScanner.java:1267)
	at org.apache.tools.ant.DirectoryScanner.scandir(DirectoryScanner.java:1267)
	at org.apache.tools.ant.DirectoryScanner.scandir(DirectoryScanner.java:1267)
	at org.apache.tools.ant.DirectoryScanner.scandir(DirectoryScanner.java:1267)
	at org.apache.tools.ant.DirectoryScanner.scandir(DirectoryScanner.java:1194)
	at org.apache.tools.ant.DirectoryScanner.scandir(DirectoryScanner.java:1156)
	at org.apache.tools.ant.DirectoryScanner.checkIncludePatterns(DirectoryScanner.java:954)
	at org.apache.tools.ant.DirectoryScanner.scan(DirectoryScanner.java:912)
	at hudson.FilePath$ValidateAntFileMask.hasMatch(FilePath.java:3222)
Caused: java.lang.InterruptedException: no matches found within 10000
	at hudson.FilePath$ValidateAntFileMask.hasMatch(FilePath.java:3227)
	at hudson.FilePath$ValidateAntFileMask.invoke(FilePath.java:3105)
	at hudson.FilePath$ValidateAntFileMask.invoke(FilePath.java:3083)
	at hudson.FilePath$FileCallableWrapper.call(FilePath.java:3487)
Also:   hudson.remoting.Channel$CallSiteStackTrace: Remote call to lucene-solr-1
		at hudson.remoting.Channel.attachCallSiteStackTrace(Channel.java:1784)
		at hudson.remoting.UserRequest$ExceptionResponse.retrieve(UserRequest.java:356)
		at hudson.remoting.Channel.call(Channel.java:1000)
		at hudson.FilePath.act(FilePath.java:1194)
		at hudson.FilePath.act(FilePath.java:1183)
		at hudson.FilePath.validateAntFileMask(FilePath.java:3080)
		at hudson.tasks.ArtifactArchiver.perform(ArtifactArchiver.java:269)
		at hudson.tasks.BuildStepCompatibilityLayer.perform(BuildStepCompatibilityLayer.java:79)
		at hudson.tasks.BuildStepMonitor$1.perform(BuildStepMonitor.java:20)
		at hudson.model.AbstractBuild$AbstractBuildExecution.perform(AbstractBuild.java:814)
		at hudson.model.AbstractBuild$AbstractBuildExecution.performAllBuildSteps(AbstractBuild.java:763)
		at hudson.model.Build$BuildExecution.post2(Build.java:179)
		at hudson.model.AbstractBuild$AbstractBuildExecution.post(AbstractBuild.java:707)
		at hudson.model.Run.execute(Run.java:1921)
		at hudson.model.FreeStyleBuild.run(FreeStyleBuild.java:44)
		at hudson.model.ResourceController.execute(ResourceController.java:101)
		at hudson.model.Executor.run(Executor.java:442)
Caused: hudson.FilePath$TunneledInterruptedException
	at hudson.FilePath$FileCallableWrapper.call(FilePath.java:3489)
	at hudson.remoting.UserRequest.perform(UserRequest.java:211)
	at hudson.remoting.UserRequest.perform(UserRequest.java:54)
	at hudson.remoting.Request$2.run(Request.java:376)
	at hudson.remoting.InterceptingExecutorService.lambda$wrap$0(InterceptingExecutorService.java:78)
	at java.base/java.util.concurrent.FutureTask.run(FutureTask.java:264)
	at java.base/java.util.concurrent.ThreadPoolExecutor.runWorker(ThreadPoolExecutor.java:1128)
	at java.base/java.util.concurrent.ThreadPoolExecutor$Worker.run(ThreadPoolExecutor.java:628)
	at java.base/java.lang.Thread.run(Thread.java:829)
Caused: java.lang.InterruptedException: java.lang.InterruptedException: no matches found within 10000
	at hudson.FilePath.act(FilePath.java:1196)
	at hudson.FilePath.act(FilePath.java:1183)
	at hudson.FilePath.validateAntFileMask(FilePath.java:3080)
	at hudson.tasks.ArtifactArchiver.perform(ArtifactArchiver.java:269)
	at hudson.tasks.BuildStepCompatibilityLayer.perform(BuildStepCompatibilityLayer.java:79)
	at hudson.tasks.BuildStepMonitor$1.perform(BuildStepMonitor.java:20)
	at hudson.model.AbstractBuild$AbstractBuildExecution.perform(AbstractBuild.java:814)
	at hudson.model.AbstractBuild$AbstractBuildExecution.performAllBuildSteps(AbstractBuild.java:763)
	at hudson.model.Build$BuildExecution.post2(Build.java:179)
	at hudson.model.AbstractBuild$AbstractBuildExecution.post(AbstractBuild.java:707)
	at hudson.model.Run.execute(Run.java:1921)
	at hudson.model.FreeStyleBuild.run(FreeStyleBuild.java:44)
	at hudson.model.ResourceController.execute(ResourceController.java:101)
	at hudson.model.Executor.run(Executor.java:442)
No artifacts found that match the file pattern "**/*.events,heapdumps/**,**/hs_err_pid*". Configuration error?
Recording test results
[Checks API] No suitable checks publisher found.
Build step 'Publish JUnit test result report' changed build result to UNSTABLE
Email was triggered for: Unstable (Test Failures)
Sending email for trigger: Unstable (Test Failures)

[JENKINS] Solr » Solr-NightlyTests-main - Build # 579 - Still Unstable!

Posted by Apache Jenkins Server <je...@builds.apache.org>.
Build: https://ci-builds.apache.org/job/Solr/job/Solr-NightlyTests-main/579/

12 tests failed.
FAILED:  org.apache.solr.hdfs.cloud.HdfsBasicDistributedZk2Test.test

Error Message:
java.lang.ExceptionInInitializerError

Stack Trace:
java.lang.ExceptionInInitializerError
	at __randomizedtesting.SeedInfo.seed([48E34A1FF4C72CE2:C0B775C55A3B411A]:0)
	at org.apache.hadoop.shaded.com.sun.xml.bind.v2.runtime.reflect.opt.AccessorInjector.prepare(AccessorInjector.java:83)
	at org.apache.hadoop.shaded.com.sun.xml.bind.v2.runtime.reflect.opt.OptimizedAccessorFactory.get(OptimizedAccessorFactory.java:176)
	at org.apache.hadoop.shaded.com.sun.xml.bind.v2.runtime.reflect.Accessor$FieldReflection.optimize(Accessor.java:282)
	at org.apache.hadoop.shaded.com.sun.xml.bind.v2.runtime.property.ArrayProperty.<init>(ArrayProperty.java:69)
	at org.apache.hadoop.shaded.com.sun.xml.bind.v2.runtime.property.ArrayERProperty.<init>(ArrayERProperty.java:88)
	at org.apache.hadoop.shaded.com.sun.xml.bind.v2.runtime.property.ArrayElementProperty.<init>(ArrayElementProperty.java:100)
	at org.apache.hadoop.shaded.com.sun.xml.bind.v2.runtime.property.ArrayElementNodeProperty.<init>(ArrayElementNodeProperty.java:62)
	at java.base/jdk.internal.reflect.NativeConstructorAccessorImpl.newInstance0(Native Method)
	at java.base/jdk.internal.reflect.NativeConstructorAccessorImpl.newInstance(NativeConstructorAccessorImpl.java:62)
	at java.base/jdk.internal.reflect.DelegatingConstructorAccessorImpl.newInstance(DelegatingConstructorAccessorImpl.java:45)
	at java.base/java.lang.reflect.Constructor.newInstance(Constructor.java:490)
	at org.apache.hadoop.shaded.com.sun.xml.bind.v2.runtime.property.PropertyFactory.create(PropertyFactory.java:128)
	at org.apache.hadoop.shaded.com.sun.xml.bind.v2.runtime.ClassBeanInfoImpl.<init>(ClassBeanInfoImpl.java:183)
	at org.apache.hadoop.shaded.com.sun.xml.bind.v2.runtime.JAXBContextImpl.getOrCreate(JAXBContextImpl.java:532)
	at org.apache.hadoop.shaded.com.sun.xml.bind.v2.runtime.JAXBContextImpl.<init>(JAXBContextImpl.java:347)
	at org.apache.hadoop.shaded.com.sun.xml.bind.v2.runtime.JAXBContextImpl$JAXBContextBuilder.build(JAXBContextImpl.java:1170)
	at org.apache.hadoop.shaded.com.sun.xml.bind.v2.ContextFactory.createContext(ContextFactory.java:145)
	at org.apache.hadoop.shaded.com.sun.xml.bind.v2.ContextFactory.createContext(ContextFactory.java:236)
	at java.base/jdk.internal.reflect.NativeMethodAccessorImpl.invoke0(Native Method)
	at java.base/jdk.internal.reflect.NativeMethodAccessorImpl.invoke(NativeMethodAccessorImpl.java:62)
	at java.base/jdk.internal.reflect.DelegatingMethodAccessorImpl.invoke(DelegatingMethodAccessorImpl.java:43)
	at java.base/java.lang.reflect.Method.invoke(Method.java:566)
	at javax.xml.bind.ContextFinder.newInstance(ContextFinder.java:171)
	at javax.xml.bind.ContextFinder.newInstance(ContextFinder.java:129)
	at javax.xml.bind.ContextFinder.find(ContextFinder.java:307)
	at javax.xml.bind.JAXBContext.newInstance(JAXBContext.java:478)
	at javax.xml.bind.JAXBContext.newInstance(JAXBContext.java:435)
	at org.glassfish.jersey.server.wadl.internal.WadlApplicationContextImpl.getJAXBContextFromWadlGenerator(WadlApplicationContextImpl.java:121)
	at org.glassfish.jersey.server.wadl.internal.WadlApplicationContextImpl.isJaxbImplAvailable(WadlApplicationContextImpl.java:270)
	at org.glassfish.jersey.server.wadl.WadlFeature.configure(WadlFeature.java:65)
	at org.glassfish.jersey.model.internal.CommonConfig.configureFeatures(CommonConfig.java:728)
	at org.glassfish.jersey.model.internal.CommonConfig.configureMetaProviders(CommonConfig.java:647)
	at org.glassfish.jersey.server.ResourceConfig.configureMetaProviders(ResourceConfig.java:824)
	at org.glassfish.jersey.server.ApplicationHandler.initialize(ApplicationHandler.java:332)
	at org.glassfish.jersey.server.ApplicationHandler.lambda$initialize$1(ApplicationHandler.java:297)
	at org.glassfish.jersey.internal.Errors.process(Errors.java:292)
	at org.glassfish.jersey.internal.Errors.process(Errors.java:274)
	at org.glassfish.jersey.internal.Errors.processWithException(Errors.java:232)
	at org.glassfish.jersey.server.ApplicationHandler.initialize(ApplicationHandler.java:296)
	at org.glassfish.jersey.server.ApplicationHandler.<init>(ApplicationHandler.java:261)
	at org.glassfish.jersey.server.ApplicationHandler.<init>(ApplicationHandler.java:236)
	at org.apache.solr.core.CoreContainer.load(CoreContainer.java:1086)
	at org.apache.solr.servlet.CoreContainerProvider.createCoreContainer(CoreContainerProvider.java:377)
	at org.apache.solr.servlet.CoreContainerProvider.init(CoreContainerProvider.java:226)
	at org.apache.solr.client.solrj.embedded.JettySolrRunner$1.lifeCycleStarted(JettySolrRunner.java:402)
	at org.eclipse.jetty.util.component.AbstractLifeCycle.setStarted(AbstractLifeCycle.java:194)
	at org.eclipse.jetty.util.component.AbstractLifeCycle.start(AbstractLifeCycle.java:74)
	at org.apache.solr.client.solrj.embedded.JettySolrRunner.retryOnPortBindFailure(JettySolrRunner.java:614)
	at org.apache.solr.client.solrj.embedded.JettySolrRunner.start(JettySolrRunner.java:552)
	at org.apache.solr.client.solrj.embedded.JettySolrRunner.start(JettySolrRunner.java:523)
	at org.apache.solr.cloud.AbstractFullDistribZkTestBase.createServers(AbstractFullDistribZkTestBase.java:354)
	at org.apache.solr.BaseDistributedSearchTestCase$ShardsRepeatRule$ShardsFixedStatement.callStatement(BaseDistributedSearchTestCase.java:1165)
	at org.apache.solr.BaseDistributedSearchTestCase$ShardsRepeatRule$ShardsStatement.evaluate(BaseDistributedSearchTestCase.java:1138)
	at com.carrotsearch.randomizedtesting.rules.SystemPropertiesRestoreRule$1.evaluate(SystemPropertiesRestoreRule.java:80)
	at org.junit.rules.RunRules.evaluate(RunRules.java:20)
	at org.apache.lucene.tests.util.TestRuleSetupTeardownChained$1.evaluate(TestRuleSetupTeardownChained.java:44)
	at org.apache.lucene.tests.util.AbstractBeforeAfterRule$1.evaluate(AbstractBeforeAfterRule.java:43)
	at org.apache.lucene.tests.util.TestRuleThreadAndTestName$1.evaluate(TestRuleThreadAndTestName.java:45)
	at org.apache.lucene.tests.util.TestRuleIgnoreAfterMaxFailures$1.evaluate(TestRuleIgnoreAfterMaxFailures.java:60)
	at org.apache.lucene.tests.util.TestRuleMarkFailure$1.evaluate(TestRuleMarkFailure.java:44)
	at org.junit.rules.RunRules.evaluate(RunRules.java:20)
	at com.carrotsearch.randomizedtesting.rules.StatementAdapter.evaluate(StatementAdapter.java:36)
	at com.carrotsearch.randomizedtesting.ThreadLeakControl$StatementRunner.run(ThreadLeakControl.java:390)
	at com.carrotsearch.randomizedtesting.ThreadLeakControl.forkTimeoutingTask(ThreadLeakControl.java:843)
	at com.carrotsearch.randomizedtesting.ThreadLeakControl$3.evaluate(ThreadLeakControl.java:490)
	at com.carrotsearch.randomizedtesting.RandomizedRunner.runSingleTest(RandomizedRunner.java:955)
	at com.carrotsearch.randomizedtesting.RandomizedRunner$5.evaluate(RandomizedRunner.java:840)
	at com.carrotsearch.randomizedtesting.RandomizedRunner$6.evaluate(RandomizedRunner.java:891)
	at com.carrotsearch.randomizedtesting.RandomizedRunner$7.evaluate(RandomizedRunner.java:902)
	at com.carrotsearch.randomizedtesting.rules.StatementAdapter.evaluate(StatementAdapter.java:36)
	at org.apache.lucene.tests.util.AbstractBeforeAfterRule$1.evaluate(AbstractBeforeAfterRule.java:43)
	at org.apache.lucene.tests.util.AbstractBeforeAfterRule$1.evaluate(AbstractBeforeAfterRule.java:43)
	at com.carrotsearch.randomizedtesting.rules.SystemPropertiesRestoreRule$1.evaluate(SystemPropertiesRestoreRule.java:80)
	at org.junit.rules.RunRules.evaluate(RunRules.java:20)
	at org.apache.lucene.tests.util.AbstractBeforeAfterRule$1.evaluate(AbstractBeforeAfterRule.java:43)
	at com.carrotsearch.randomizedtesting.rules.StatementAdapter.evaluate(StatementAdapter.java:36)
	at org.apache.lucene.tests.util.TestRuleStoreClassName$1.evaluate(TestRuleStoreClassName.java:38)
	at com.carrotsearch.randomizedtesting.rules.NoShadowingOrOverridesOnMethodsRule$1.evaluate(NoShadowingOrOverridesOnMethodsRule.java:40)
	at com.carrotsearch.randomizedtesting.rules.NoShadowingOrOverridesOnMethodsRule$1.evaluate(NoShadowingOrOverridesOnMethodsRule.java:40)
	at com.carrotsearch.randomizedtesting.rules.StatementAdapter.evaluate(StatementAdapter.java:36)
	at com.carrotsearch.randomizedtesting.rules.StatementAdapter.evaluate(StatementAdapter.java:36)
	at org.apache.lucene.tests.util.TestRuleAssertionsRequired$1.evaluate(TestRuleAssertionsRequired.java:53)
	at org.apache.lucene.tests.util.AbstractBeforeAfterRule$1.evaluate(AbstractBeforeAfterRule.java:43)
	at org.apache.lucene.tests.util.TestRuleMarkFailure$1.evaluate(TestRuleMarkFailure.java:44)
	at org.apache.lucene.tests.util.TestRuleIgnoreAfterMaxFailures$1.evaluate(TestRuleIgnoreAfterMaxFailures.java:60)
	at org.apache.lucene.tests.util.TestRuleIgnoreTestSuites$1.evaluate(TestRuleIgnoreTestSuites.java:47)
	at org.junit.rules.RunRules.evaluate(RunRules.java:20)
	at com.carrotsearch.randomizedtesting.rules.StatementAdapter.evaluate(StatementAdapter.java:36)
	at com.carrotsearch.randomizedtesting.ThreadLeakControl$StatementRunner.run(ThreadLeakControl.java:390)
	at com.carrotsearch.randomizedtesting.ThreadLeakControl.lambda$forkTimeoutingTask$0(ThreadLeakControl.java:850)
	at java.base/java.lang.Thread.run(Thread.java:829)
Caused by: java.lang.reflect.InaccessibleObjectException: Unable to make protected final java.lang.Class java.lang.ClassLoader.defineClass(java.lang.String,byte[],int,int) throws java.lang.ClassFormatError accessible: module java.base does not "opens java.lang" to unnamed module @79e868c6
	at java.base/java.lang.reflect.AccessibleObject.checkCanSetAccessible(AccessibleObject.java:340)
	at java.base/java.lang.reflect.AccessibleObject.checkCanSetAccessible(AccessibleObject.java:280)
	at java.base/java.lang.reflect.Method.checkCanSetAccessible(Method.java:198)
	at java.base/java.lang.reflect.Method.setAccessible(Method.java:192)
	at org.apache.hadoop.shaded.com.sun.xml.bind.v2.runtime.reflect.opt.Injector$1.run(Injector.java:177)
	at org.apache.hadoop.shaded.com.sun.xml.bind.v2.runtime.reflect.opt.Injector$1.run(Injector.java:174)
	at java.base/java.security.AccessController.doPrivileged(Native Method)
	at org.apache.hadoop.shaded.com.sun.xml.bind.v2.runtime.reflect.opt.Injector.<clinit>(Injector.java:172)
	... 91 more


FAILED:  org.apache.solr.hdfs.cloud.HdfsBasicDistributedZk2Test.classMethod

Error Message:
com.carrotsearch.randomizedtesting.ThreadLeakError: 22 threads leaked from SUITE scope at org.apache.solr.hdfs.cloud.HdfsBasicDistributedZk2Test: 
   1) Thread[id=196, name=zkCallback-23-thread-2, state=TIMED_WAITING, group=TGRP-HdfsBasicDistributedZk2Test]
        at java.base@11.0.16.1/jdk.internal.misc.Unsafe.park(Native Method)
        at java.base@11.0.16.1/java.util.concurrent.locks.LockSupport.parkNanos(LockSupport.java:234)
        at java.base@11.0.16.1/java.util.concurrent.SynchronousQueue$TransferStack.awaitFulfill(SynchronousQueue.java:462)
        at java.base@11.0.16.1/java.util.concurrent.SynchronousQueue$TransferStack.transfer(SynchronousQueue.java:361)
        at java.base@11.0.16.1/java.util.concurrent.SynchronousQueue.poll(SynchronousQueue.java:937)
        at java.base@11.0.16.1/java.util.concurrent.ThreadPoolExecutor.getTask(ThreadPoolExecutor.java:1053)
        at java.base@11.0.16.1/java.util.concurrent.ThreadPoolExecutor.runWorker(ThreadPoolExecutor.java:1114)
        at java.base@11.0.16.1/java.util.concurrent.ThreadPoolExecutor$Worker.run(ThreadPoolExecutor.java:628)
        at java.base@11.0.16.1/java.lang.Thread.run(Thread.java:829)
   2) Thread[id=166, name=TEST-HdfsBasicDistributedZk2Test.test-seed#[48E34A1FF4C72CE2]-SendThread(127.0.0.1:43711), state=TIMED_WAITING, group=TGRP-HdfsBasicDistributedZk2Test]
        at java.base@11.0.16.1/java.lang.Thread.sleep(Native Method)
        at app//org.apache.zookeeper.ClientCnxn$SendThread.startConnect(ClientCnxn.java:1136)
        at app//org.apache.zookeeper.ClientCnxn$SendThread.run(ClientCnxn.java:1200)
   3) Thread[id=167, name=TEST-HdfsBasicDistributedZk2Test.test-seed#[48E34A1FF4C72CE2]-EventThread, state=WAITING, group=TGRP-HdfsBasicDistributedZk2Test]
        at java.base@11.0.16.1/jdk.internal.misc.Unsafe.park(Native Method)
        at java.base@11.0.16.1/java.util.concurrent.locks.LockSupport.park(LockSupport.java:194)
        at java.base@11.0.16.1/java.util.concurrent.locks.AbstractQueuedSynchronizer$ConditionObject.await(AbstractQueuedSynchronizer.java:2081)
        at java.base@11.0.16.1/java.util.concurrent.LinkedBlockingQueue.take(LinkedBlockingQueue.java:433)
        at app//org.apache.zookeeper.ClientCnxn$EventThread.run(ClientCnxn.java:549)
   4) Thread[id=162, name=h2sc-19-thread-1, state=RUNNABLE, group=TGRP-HdfsBasicDistributedZk2Test]
        at java.base@11.0.16.1/sun.nio.ch.EPoll.wait(Native Method)
        at java.base@11.0.16.1/sun.nio.ch.EPollSelectorImpl.doSelect(EPollSelectorImpl.java:120)
        at java.base@11.0.16.1/sun.nio.ch.SelectorImpl.lockAndDoSelect(SelectorImpl.java:124)
        at java.base@11.0.16.1/sun.nio.ch.SelectorImpl.select(SelectorImpl.java:141)
        at app//org.eclipse.jetty.io.ManagedSelector.nioSelect(ManagedSelector.java:183)
        at app//org.eclipse.jetty.io.ManagedSelector.select(ManagedSelector.java:190)
        at app//org.eclipse.jetty.io.ManagedSelector$SelectorProducer.select(ManagedSelector.java:606)
        at app//org.eclipse.jetty.io.ManagedSelector$SelectorProducer.produce(ManagedSelector.java:543)
        at app//org.eclipse.jetty.util.thread.strategy.EatWhatYouKill.produceTask(EatWhatYouKill.java:362)
        at app//org.eclipse.jetty.util.thread.strategy.EatWhatYouKill.doProduce(EatWhatYouKill.java:186)
        at app//org.eclipse.jetty.util.thread.strategy.EatWhatYouKill.tryProduce(EatWhatYouKill.java:173)
        at app//org.eclipse.jetty.util.thread.strategy.EatWhatYouKill.produce(EatWhatYouKill.java:137)
        at app//org.eclipse.jetty.io.ManagedSelector$$Lambda$357/0x000000010085cc40.run(Unknown Source)
        at app//org.apache.solr.common.util.ExecutorUtil$MDCAwareThreadPoolExecutor.lambda$execute$0(ExecutorUtil.java:271)
        at app//org.apache.solr.common.util.ExecutorUtil$MDCAwareThreadPoolExecutor$$Lambda$321/0x000000010080ec40.run(Unknown Source)
        at java.base@11.0.16.1/java.util.concurrent.ThreadPoolExecutor.runWorker(ThreadPoolExecutor.java:1128)
        at java.base@11.0.16.1/java.util.concurrent.ThreadPoolExecutor$Worker.run(ThreadPoolExecutor.java:628)
        at java.base@11.0.16.1/java.lang.Thread.run(Thread.java:829)
   5) Thread[id=152, name=qtp1024864234-152, state=TIMED_WAITING, group=TGRP-HdfsBasicDistributedZk2Test]
        at java.base@11.0.16.1/jdk.internal.misc.Unsafe.park(Native Method)
        at java.base@11.0.16.1/java.util.concurrent.locks.LockSupport.parkNanos(LockSupport.java:234)
        at java.base@11.0.16.1/java.util.concurrent.locks.AbstractQueuedSynchronizer$ConditionObject.awaitNanos(AbstractQueuedSynchronizer.java:2123)
        at app//org.eclipse.jetty.util.BlockingArrayQueue.poll(BlockingArrayQueue.java:382)
        at app//org.eclipse.jetty.util.thread.QueuedThreadPool$Runner.idleJobPoll(QueuedThreadPool.java:974)
        at app//org.eclipse.jetty.util.thread.QueuedThreadPool$Runner.run(QueuedThreadPool.java:1018)
        at java.base@11.0.16.1/java.lang.Thread.run(Thread.java:829)
   6) Thread[id=172, name=CloserThread, state=WAITING, group=TGRP-HdfsBasicDistributedZk2Test]
        at java.base@11.0.16.1/java.lang.Object.wait(Native Method)
        at java.base@11.0.16.1/java.lang.Object.wait(Object.java:328)
        at app//org.apache.solr.core.CloserThread.run(CoreContainer.java:2506)
   7) Thread[id=171, name=zkCallback-23-thread-1, state=TIMED_WAITING, group=TGRP-HdfsBasicDistributedZk2Test]
        at java.base@11.0.16.1/jdk.internal.misc.Unsafe.park(Native Method)
        at java.base@11.0.16.1/java.util.concurrent.locks.LockSupport.parkNanos(LockSupport.java:234)
        at java.base@11.0.16.1/java.util.concurrent.SynchronousQueue$TransferStack.awaitFulfill(SynchronousQueue.java:462)
        at java.base@11.0.16.1/java.util.concurrent.SynchronousQueue$TransferStack.transfer(SynchronousQueue.java:361)
        at java.base@11.0.16.1/java.util.concurrent.SynchronousQueue.poll(SynchronousQueue.java:937)
        at java.base@11.0.16.1/java.util.concurrent.ThreadPoolExecutor.getTask(ThreadPoolExecutor.java:1053)
        at java.base@11.0.16.1/java.util.concurrent.ThreadPoolExecutor.runWorker(ThreadPoolExecutor.java:1114)
        at java.base@11.0.16.1/java.util.concurrent.ThreadPoolExecutor$Worker.run(ThreadPoolExecutor.java:628)
        at java.base@11.0.16.1/java.lang.Thread.run(Thread.java:829)
   8) Thread[id=159, name=httpShardExecutor-17-thread-1, state=RUNNABLE, group=TGRP-HdfsBasicDistributedZk2Test]
        at java.base@11.0.16.1/sun.nio.ch.EPoll.wait(Native Method)
        at java.base@11.0.16.1/sun.nio.ch.EPollSelectorImpl.doSelect(EPollSelectorImpl.java:120)
        at java.base@11.0.16.1/sun.nio.ch.SelectorImpl.lockAndDoSelect(SelectorImpl.java:124)
        at java.base@11.0.16.1/sun.nio.ch.SelectorImpl.select(SelectorImpl.java:141)
        at app//org.eclipse.jetty.io.ManagedSelector.nioSelect(ManagedSelector.java:183)
        at app//org.eclipse.jetty.io.ManagedSelector.select(ManagedSelector.java:190)
        at app//org.eclipse.jetty.io.ManagedSelector$SelectorProducer.select(ManagedSelector.java:606)
        at app//org.eclipse.jetty.io.ManagedSelector$SelectorProducer.produce(ManagedSelector.java:543)
        at app//org.eclipse.jetty.util.thread.strategy.EatWhatYouKill.produceTask(EatWhatYouKill.java:362)
        at app//org.eclipse.jetty.util.thread.strategy.EatWhatYouKill.doProduce(EatWhatYouKill.java:186)
        at app//org.eclipse.jetty.util.thread.strategy.EatWhatYouKill.tryProduce(EatWhatYouKill.java:173)
        at app//org.eclipse.jetty.util.thread.strategy.EatWhatYouKill.produce(EatWhatYouKill.java:137)
        at app//org.eclipse.jetty.io.ManagedSelector$$Lambda$357/0x000000010085cc40.run(Unknown Source)
        at app//org.apache.solr.common.util.ExecutorUtil$MDCAwareThreadPoolExecutor.lambda$execute$0(ExecutorUtil.java:271)
        at app//org.apache.solr.common.util.ExecutorUtil$MDCAwareThreadPoolExecutor$$Lambda$321/0x000000010080ec40.run(Unknown Source)
        at java.base@11.0.16.1/java.util.concurrent.ThreadPoolExecutor.runWorker(ThreadPoolExecutor.java:1128)
        at java.base@11.0.16.1/java.util.concurrent.ThreadPoolExecutor$Worker.run(ThreadPoolExecutor.java:628)
        at java.base@11.0.16.1/java.lang.Thread.run(Thread.java:829)
   9) Thread[id=169, name=OverseerStateUpdate-72371257379717125-127.0.0.1:40345_rn_%2Fbe-n_0000000000, state=TIMED_WAITING, group=Overseer state updater.]
        at java.base@11.0.16.1/jdk.internal.misc.Unsafe.park(Native Method)
        at java.base@11.0.16.1/java.util.concurrent.locks.LockSupport.parkNanos(LockSupport.java:234)
        at java.base@11.0.16.1/java.util.concurrent.locks.AbstractQueuedSynchronizer$ConditionObject.awaitNanos(AbstractQueuedSynchronizer.java:2123)
        at app//org.apache.solr.cloud.ZkDistributedQueue.peekElements(ZkDistributedQueue.java:488)
        at app//org.apache.solr.cloud.Overseer$ClusterStateUpdater.run(Overseer.java:320)
        at java.base@11.0.16.1/java.lang.Thread.run(Thread.java:829)
  10) Thread[id=154, name=qtp1024864234-154, state=TIMED_WAITING, group=TGRP-HdfsBasicDistributedZk2Test]
        at java.base@11.0.16.1/jdk.internal.misc.Unsafe.park(Native Method)
        at java.base@11.0.16.1/java.util.concurrent.locks.LockSupport.parkNanos(LockSupport.java:234)
        at java.base@11.0.16.1/java.util.concurrent.locks.AbstractQueuedSynchronizer$ConditionObject.awaitNanos(AbstractQueuedSynchronizer.java:2123)
        at app//org.eclipse.jetty.util.BlockingArrayQueue.poll(BlockingArrayQueue.java:382)
        at app//org.eclipse.jetty.util.thread.QueuedThreadPool$Runner.idleJobPoll(QueuedThreadPool.java:974)
        at app//org.eclipse.jetty.util.thread.QueuedThreadPool$Runner.run(QueuedThreadPool.java:1018)
        at java.base@11.0.16.1/java.lang.Thread.run(Thread.java:829)
  11) Thread[id=155, name=Session-HouseKeeper-47679f67-1, state=TIMED_WAITING, group=TGRP-HdfsBasicDistributedZk2Test]
        at java.base@11.0.16.1/jdk.internal.misc.Unsafe.park(Native Method)
        at java.base@11.0.16.1/java.util.concurrent.locks.LockSupport.parkNanos(LockSupport.java:234)
        at java.base@11.0.16.1/java.util.concurrent.locks.AbstractQueuedSynchronizer$ConditionObject.awaitNanos(AbstractQueuedSynchronizer.java:2123)
        at java.base@11.0.16.1/java.util.concurrent.ScheduledThreadPoolExecutor$DelayedWorkQueue.take(ScheduledThreadPoolExecutor.java:1182)
        at java.base@11.0.16.1/java.util.concurrent.ScheduledThreadPoolExecutor$DelayedWorkQueue.take(ScheduledThreadPoolExecutor.java:899)
        at java.base@11.0.16.1/java.util.concurrent.ThreadPoolExecutor.getTask(ThreadPoolExecutor.java:1054)
        at java.base@11.0.16.1/java.util.concurrent.ThreadPoolExecutor.runWorker(ThreadPoolExecutor.java:1114)
        at java.base@11.0.16.1/java.util.concurrent.ThreadPoolExecutor$Worker.run(ThreadPoolExecutor.java:628)
        at java.base@11.0.16.1/java.lang.Thread.run(Thread.java:829)
  12) Thread[id=170, name=OverseerCollectionConfigSetProcessor-72371257379717125-127.0.0.1:40345_rn_%2Fbe-n_0000000000, state=WAITING, group=Overseer collection creation process.]
        at java.base@11.0.16.1/java.lang.Object.wait(Native Method)
        at java.base@11.0.16.1/java.lang.Object.wait(Object.java:328)
        at app//org.apache.zookeeper.ClientCnxn.submitRequest(ClientCnxn.java:1590)
        at app//org.apache.zookeeper.ClientCnxn.submitRequest(ClientCnxn.java:1562)
        at app//org.apache.zookeeper.ZooKeeper.getData(ZooKeeper.java:1970)
        at app//org.apache.solr.common.cloud.SolrZkClient.lambda$getData$6(SolrZkClient.java:432)
        at app//org.apache.solr.common.cloud.SolrZkClient$$Lambda$453/0x0000000100966440.execute(Unknown Source)
        at app//org.apache.solr.common.cloud.ZkCmdExecutor.retryOperation(ZkCmdExecutor.java:72)
        at app//org.apache.solr.common.cloud.SolrZkClient.getData(SolrZkClient.java:432)
        at app//org.apache.solr.cloud.OverseerTaskProcessor.amILeader(OverseerTaskProcessor.java:486)
        at app//org.apache.solr.cloud.OverseerTaskProcessor.run(OverseerTaskProcessor.java:232)
        at java.base@11.0.16.1/java.lang.Thread.run(Thread.java:829)
  13) Thread[id=197, name=zkCallback-23-thread-3, state=TIMED_WAITING, group=TGRP-HdfsBasicDistributedZk2Test]
        at java.base@11.0.16.1/jdk.internal.misc.Unsafe.park(Native Method)
        at java.base@11.0.16.1/java.util.concurrent.locks.LockSupport.parkNanos(LockSupport.java:234)
        at java.base@11.0.16.1/java.util.concurrent.SynchronousQueue$TransferStack.awaitFulfill(SynchronousQueue.java:462)
        at java.base@11.0.16.1/java.util.concurrent.SynchronousQueue$TransferStack.transfer(SynchronousQueue.java:361)
        at java.base@11.0.16.1/java.util.concurrent.SynchronousQueue.poll(SynchronousQueue.java:937)
        at java.base@11.0.16.1/java.util.concurrent.ThreadPoolExecutor.getTask(ThreadPoolExecutor.java:1053)
        at java.base@11.0.16.1/java.util.concurrent.ThreadPoolExecutor.runWorker(ThreadPoolExecutor.java:1114)
        at java.base@11.0.16.1/java.util.concurrent.ThreadPoolExecutor$Worker.run(ThreadPoolExecutor.java:628)
        at java.base@11.0.16.1/java.lang.Thread.run(Thread.java:829)
  14) Thread[id=151, name=qtp1024864234-151, state=TIMED_WAITING, group=TGRP-HdfsBasicDistributedZk2Test]
        at java.base@11.0.16.1/jdk.internal.misc.Unsafe.park(Native Method)
        at java.base@11.0.16.1/java.util.concurrent.locks.LockSupport.parkNanos(LockSupport.java:234)
        at java.base@11.0.16.1/java.util.concurrent.locks.AbstractQueuedSynchronizer$ConditionObject.awaitNanos(AbstractQueuedSynchronizer.java:2123)
        at app//org.eclipse.jetty.util.BlockingArrayQueue.poll(BlockingArrayQueue.java:382)
        at app//org.eclipse.jetty.util.thread.QueuedThreadPool$Runner.idleJobPoll(QueuedThreadPool.java:974)
        at app//org.eclipse.jetty.util.thread.QueuedThreadPool$Runner.run(QueuedThreadPool.java:1018)
        at java.base@11.0.16.1/java.lang.Thread.run(Thread.java:829)
  15) Thread[id=168, name=zkConnectionManagerCallback-24-thread-1, state=WAITING, group=TGRP-HdfsBasicDistributedZk2Test]
        at java.base@11.0.16.1/jdk.internal.misc.Unsafe.park(Native Method)
        at java.base@11.0.16.1/java.util.concurrent.locks.LockSupport.park(LockSupport.java:194)
        at java.base@11.0.16.1/java.util.concurrent.locks.AbstractQueuedSynchronizer$ConditionObject.await(AbstractQueuedSynchronizer.java:2081)
        at java.base@11.0.16.1/java.util.concurrent.LinkedBlockingQueue.take(LinkedBlockingQueue.java:433)
        at java.base@11.0.16.1/java.util.concurrent.ThreadPoolExecutor.getTask(ThreadPoolExecutor.java:1054)
        at java.base@11.0.16.1/java.util.concurrent.ThreadPoolExecutor.runWorker(ThreadPoolExecutor.java:1114)
        at java.base@11.0.16.1/java.util.concurrent.ThreadPoolExecutor$Worker.run(ThreadPoolExecutor.java:628)
        at java.base@11.0.16.1/java.lang.Thread.run(Thread.java:829)
  16) Thread[id=173, name=coreContainerWorkExecutor-14-thread-1, state=TIMED_WAITING, group=TGRP-HdfsBasicDistributedZk2Test]
        at java.base@11.0.16.1/jdk.internal.misc.Unsafe.park(Native Method)
        at java.base@11.0.16.1/java.util.concurrent.locks.LockSupport.parkNanos(LockSupport.java:234)
        at java.base@11.0.16.1/java.util.concurrent.SynchronousQueue$TransferStack.awaitFulfill(SynchronousQueue.java:462)
        at java.base@11.0.16.1/java.util.concurrent.SynchronousQueue$TransferStack.transfer(SynchronousQueue.java:361)
        at java.base@11.0.16.1/java.util.concurrent.SynchronousQueue.poll(SynchronousQueue.java:937)
        at java.base@11.0.16.1/java.util.concurrent.ThreadPoolExecutor.getTask(ThreadPoolExecutor.java:1053)
        at java.base@11.0.16.1/java.util.concurrent.ThreadPoolExecutor.runWorker(ThreadPoolExecutor.java:1114)
        at java.base@11.0.16.1/java.util.concurrent.ThreadPoolExecutor$Worker.run(ThreadPoolExecutor.java:628)
        at java.base@11.0.16.1/java.lang.Thread.run(Thread.java:829)
  17) Thread[id=148, name=qtp1024864234-148, state=RUNNABLE, group=TGRP-HdfsBasicDistributedZk2Test]
        at java.base@11.0.16.1/sun.nio.ch.EPoll.wait(Native Method)
        at java.base@11.0.16.1/sun.nio.ch.EPollSelectorImpl.doSelect(EPollSelectorImpl.java:120)
        at java.base@11.0.16.1/sun.nio.ch.SelectorImpl.lockAndDoSelect(SelectorImpl.java:124)
        at java.base@11.0.16.1/sun.nio.ch.SelectorImpl.select(SelectorImpl.java:141)
        at app//org.eclipse.jetty.io.ManagedSelector.nioSelect(ManagedSelector.java:183)
        at app//org.eclipse.jetty.io.ManagedSelector.select(ManagedSelector.java:190)
        at app//org.eclipse.jetty.io.ManagedSelector$SelectorProducer.select(ManagedSelector.java:606)
        at app//org.eclipse.jetty.io.ManagedSelector$SelectorProducer.produce(ManagedSelector.java:543)
        at app//org.eclipse.jetty.util.thread.strategy.EatWhatYouKill.produceTask(EatWhatYouKill.java:362)
        at app//org.eclipse.jetty.util.thread.strategy.EatWhatYouKill.doProduce(EatWhatYouKill.java:186)
        at app//org.eclipse.jetty.util.thread.strategy.EatWhatYouKill.tryProduce(EatWhatYouKill.java:173)
        at app//org.eclipse.jetty.util.thread.strategy.EatWhatYouKill.produce(EatWhatYouKill.java:137)
        at app//org.eclipse.jetty.io.ManagedSelector$$Lambda$357/0x000000010085cc40.run(Unknown Source)
        at app//org.eclipse.jetty.util.thread.QueuedThreadPool.runJob(QueuedThreadPool.java:883)
        at app//org.eclipse.jetty.util.thread.QueuedThreadPool$Runner.run(QueuedThreadPool.java:1034)
        at java.base@11.0.16.1/java.lang.Thread.run(Thread.java:829)
  18) Thread[id=198, name=zkCallback-23-thread-4, state=TIMED_WAITING, group=TGRP-HdfsBasicDistributedZk2Test]
        at java.base@11.0.16.1/jdk.internal.misc.Unsafe.park(Native Method)
        at java.base@11.0.16.1/java.util.concurrent.locks.LockSupport.parkNanos(LockSupport.java:234)
        at java.base@11.0.16.1/java.util.concurrent.SynchronousQueue$TransferStack.awaitFulfill(SynchronousQueue.java:462)
        at java.base@11.0.16.1/java.util.concurrent.SynchronousQueue$TransferStack.transfer(SynchronousQueue.java:361)
        at java.base@11.0.16.1/java.util.concurrent.SynchronousQueue.poll(SynchronousQueue.java:937)
        at java.base@11.0.16.1/java.util.concurrent.ThreadPoolExecutor.getTask(ThreadPoolExecutor.java:1053)
        at java.base@11.0.16.1/java.util.concurrent.ThreadPoolExecutor.runWorker(ThreadPoolExecutor.java:1114)
        at java.base@11.0.16.1/java.util.concurrent.ThreadPoolExecutor$Worker.run(ThreadPoolExecutor.java:628)
        at java.base@11.0.16.1/java.lang.Thread.run(Thread.java:829)
  19) Thread[id=150, name=qtp1024864234-150-acceptor-0@1d804ec4-ServerConnector@4a0c25fc{ssl, (ssl, alpn, http/1.1, h2)}{127.0.0.1:40345}, state=RUNNABLE, group=TGRP-HdfsBasicDistributedZk2Test]
        at java.base@11.0.16.1/sun.nio.ch.ServerSocketChannelImpl.accept0(Native Method)
        at java.base@11.0.16.1/sun.nio.ch.ServerSocketChannelImpl.accept(ServerSocketChannelImpl.java:533)
        at java.base@11.0.16.1/sun.nio.ch.ServerSocketChannelImpl.accept(ServerSocketChannelImpl.java:285)
        at app//org.eclipse.jetty.server.ServerConnector.accept(ServerConnector.java:388)
        at app//org.eclipse.jetty.server.AbstractConnector$Acceptor.run(AbstractConnector.java:704)
        at app//org.eclipse.jetty.util.thread.QueuedThreadPool.runJob(QueuedThreadPool.java:883)
        at app//org.eclipse.jetty.util.thread.QueuedThreadPool$Runner.run(QueuedThreadPool.java:1034)
        at java.base@11.0.16.1/java.lang.Thread.run(Thread.java:829)
  20) Thread[id=147, name=qtp1024864234-147, state=RUNNABLE, group=TGRP-HdfsBasicDistributedZk2Test]
        at java.base@11.0.16.1/sun.nio.ch.EPoll.wait(Native Method)
        at java.base@11.0.16.1/sun.nio.ch.EPollSelectorImpl.doSelect(EPollSelectorImpl.java:120)
        at java.base@11.0.16.1/sun.nio.ch.SelectorImpl.lockAndDoSelect(SelectorImpl.java:124)
        at java.base@11.0.16.1/sun.nio.ch.SelectorImpl.select(SelectorImpl.java:141)
        at app//org.eclipse.jetty.io.ManagedSelector.nioSelect(ManagedSelector.java:183)
        at app//org.eclipse.jetty.io.ManagedSelector.select(ManagedSelector.java:190)
        at app//org.eclipse.jetty.io.ManagedSelector$SelectorProducer.select(ManagedSelector.java:606)
        at app//org.eclipse.jetty.io.ManagedSelector$SelectorProducer.produce(ManagedSelector.java:543)
        at app//org.eclipse.jetty.util.thread.strategy.EatWhatYouKill.produceTask(EatWhatYouKill.java:362)
        at app//org.eclipse.jetty.util.thread.strategy.EatWhatYouKill.doProduce(EatWhatYouKill.java:186)
        at app//org.eclipse.jetty.util.thread.strategy.EatWhatYouKill.tryProduce(EatWhatYouKill.java:173)
        at app//org.eclipse.jetty.util.thread.strategy.EatWhatYouKill.produce(EatWhatYouKill.java:137)
        at app//org.eclipse.jetty.io.ManagedSelector$$Lambda$357/0x000000010085cc40.run(Unknown Source)
        at app//org.eclipse.jetty.util.thread.QueuedThreadPool.runJob(QueuedThreadPool.java:883)
        at app//org.eclipse.jetty.util.thread.QueuedThreadPool$Runner.run(QueuedThreadPool.java:1034)
        at java.base@11.0.16.1/java.lang.Thread.run(Thread.java:829)
  21) Thread[id=149, name=qtp1024864234-149, state=TIMED_WAITING, group=TGRP-HdfsBasicDistributedZk2Test]
        at java.base@11.0.16.1/jdk.internal.misc.Unsafe.park(Native Method)
        at java.base@11.0.16.1/java.util.concurrent.locks.LockSupport.parkNanos(LockSupport.java:234)
        at java.base@11.0.16.1/java.util.concurrent.locks.AbstractQueuedSynchronizer$ConditionObject.awaitNanos(AbstractQueuedSynchronizer.java:2123)
        at app//org.eclipse.jetty.util.BlockingArrayQueue.poll(BlockingArrayQueue.java:382)
        at app//org.eclipse.jetty.util.thread.QueuedThreadPool$Runner.idleJobPoll(QueuedThreadPool.java:974)
        at app//org.eclipse.jetty.util.thread.QueuedThreadPool$Runner.run(QueuedThreadPool.java:1018)
        at java.base@11.0.16.1/java.lang.Thread.run(Thread.java:829)
  22) Thread[id=153, name=qtp1024864234-153, state=TIMED_WAITING, group=TGRP-HdfsBasicDistributedZk2Test]
        at java.base@11.0.16.1/jdk.internal.misc.Unsafe.park(Native Method)
        at java.base@11.0.16.1/java.util.concurrent.locks.LockSupport.parkNanos(LockSupport.java:234)
        at java.base@11.0.16.1/java.util.concurrent.locks.AbstractQueuedSynchronizer$ConditionObject.awaitNanos(AbstractQueuedSynchronizer.java:2123)
        at app//org.eclipse.jetty.util.BlockingArrayQueue.poll(BlockingArrayQueue.java:382)
        at app//org.eclipse.jetty.util.thread.QueuedThreadPool$Runner.idleJobPoll(QueuedThreadPool.java:974)
        at app//org.eclipse.jetty.util.thread.QueuedThreadPool$Runner.run(QueuedThreadPool.java:1018)
        at java.base@11.0.16.1/java.lang.Thread.run(Thread.java:829)

Stack Trace:
com.carrotsearch.randomizedtesting.ThreadLeakError: 22 threads leaked from SUITE scope at org.apache.solr.hdfs.cloud.HdfsBasicDistributedZk2Test: 
   1) Thread[id=196, name=zkCallback-23-thread-2, state=TIMED_WAITING, group=TGRP-HdfsBasicDistributedZk2Test]
        at java.base@11.0.16.1/jdk.internal.misc.Unsafe.park(Native Method)
        at java.base@11.0.16.1/java.util.concurrent.locks.LockSupport.parkNanos(LockSupport.java:234)
        at java.base@11.0.16.1/java.util.concurrent.SynchronousQueue$TransferStack.awaitFulfill(SynchronousQueue.java:462)
        at java.base@11.0.16.1/java.util.concurrent.SynchronousQueue$TransferStack.transfer(SynchronousQueue.java:361)
        at java.base@11.0.16.1/java.util.concurrent.SynchronousQueue.poll(SynchronousQueue.java:937)
        at java.base@11.0.16.1/java.util.concurrent.ThreadPoolExecutor.getTask(ThreadPoolExecutor.java:1053)
        at java.base@11.0.16.1/java.util.concurrent.ThreadPoolExecutor.runWorker(ThreadPoolExecutor.java:1114)
        at java.base@11.0.16.1/java.util.concurrent.ThreadPoolExecutor$Worker.run(ThreadPoolExecutor.java:628)
        at java.base@11.0.16.1/java.lang.Thread.run(Thread.java:829)
   2) Thread[id=166, name=TEST-HdfsBasicDistributedZk2Test.test-seed#[48E34A1FF4C72CE2]-SendThread(127.0.0.1:43711), state=TIMED_WAITING, group=TGRP-HdfsBasicDistributedZk2Test]
        at java.base@11.0.16.1/java.lang.Thread.sleep(Native Method)
        at app//org.apache.zookeeper.ClientCnxn$SendThread.startConnect(ClientCnxn.java:1136)
        at app//org.apache.zookeeper.ClientCnxn$SendThread.run(ClientCnxn.java:1200)
   3) Thread[id=167, name=TEST-HdfsBasicDistributedZk2Test.test-seed#[48E34A1FF4C72CE2]-EventThread, state=WAITING, group=TGRP-HdfsBasicDistributedZk2Test]
        at java.base@11.0.16.1/jdk.internal.misc.Unsafe.park(Native Method)
        at java.base@11.0.16.1/java.util.concurrent.locks.LockSupport.park(LockSupport.java:194)
        at java.base@11.0.16.1/java.util.concurrent.locks.AbstractQueuedSynchronizer$ConditionObject.await(AbstractQueuedSynchronizer.java:2081)
        at java.base@11.0.16.1/java.util.concurrent.LinkedBlockingQueue.take(LinkedBlockingQueue.java:433)
        at app//org.apache.zookeeper.ClientCnxn$EventThread.run(ClientCnxn.java:549)
   4) Thread[id=162, name=h2sc-19-thread-1, state=RUNNABLE, group=TGRP-HdfsBasicDistributedZk2Test]
        at java.base@11.0.16.1/sun.nio.ch.EPoll.wait(Native Method)
        at java.base@11.0.16.1/sun.nio.ch.EPollSelectorImpl.doSelect(EPollSelectorImpl.java:120)
        at java.base@11.0.16.1/sun.nio.ch.SelectorImpl.lockAndDoSelect(SelectorImpl.java:124)
        at java.base@11.0.16.1/sun.nio.ch.SelectorImpl.select(SelectorImpl.java:141)
        at app//org.eclipse.jetty.io.ManagedSelector.nioSelect(ManagedSelector.java:183)
        at app//org.eclipse.jetty.io.ManagedSelector.select(ManagedSelector.java:190)
        at app//org.eclipse.jetty.io.ManagedSelector$SelectorProducer.select(ManagedSelector.java:606)
        at app//org.eclipse.jetty.io.ManagedSelector$SelectorProducer.produce(ManagedSelector.java:543)
        at app//org.eclipse.jetty.util.thread.strategy.EatWhatYouKill.produceTask(EatWhatYouKill.java:362)
        at app//org.eclipse.jetty.util.thread.strategy.EatWhatYouKill.doProduce(EatWhatYouKill.java:186)
        at app//org.eclipse.jetty.util.thread.strategy.EatWhatYouKill.tryProduce(EatWhatYouKill.java:173)
        at app//org.eclipse.jetty.util.thread.strategy.EatWhatYouKill.produce(EatWhatYouKill.java:137)
        at app//org.eclipse.jetty.io.ManagedSelector$$Lambda$357/0x000000010085cc40.run(Unknown Source)
        at app//org.apache.solr.common.util.ExecutorUtil$MDCAwareThreadPoolExecutor.lambda$execute$0(ExecutorUtil.java:271)
        at app//org.apache.solr.common.util.ExecutorUtil$MDCAwareThreadPoolExecutor$$Lambda$321/0x000000010080ec40.run(Unknown Source)
        at java.base@11.0.16.1/java.util.concurrent.ThreadPoolExecutor.runWorker(ThreadPoolExecutor.java:1128)
        at java.base@11.0.16.1/java.util.concurrent.ThreadPoolExecutor$Worker.run(ThreadPoolExecutor.java:628)
        at java.base@11.0.16.1/java.lang.Thread.run(Thread.java:829)
   5) Thread[id=152, name=qtp1024864234-152, state=TIMED_WAITING, group=TGRP-HdfsBasicDistributedZk2Test]
        at java.base@11.0.16.1/jdk.internal.misc.Unsafe.park(Native Method)
        at java.base@11.0.16.1/java.util.concurrent.locks.LockSupport.parkNanos(LockSupport.java:234)
        at java.base@11.0.16.1/java.util.concurrent.locks.AbstractQueuedSynchronizer$ConditionObject.awaitNanos(AbstractQueuedSynchronizer.java:2123)
        at app//org.eclipse.jetty.util.BlockingArrayQueue.poll(BlockingArrayQueue.java:382)
        at app//org.eclipse.jetty.util.thread.QueuedThreadPool$Runner.idleJobPoll(QueuedThreadPool.java:974)
        at app//org.eclipse.jetty.util.thread.QueuedThreadPool$Runner.run(QueuedThreadPool.java:1018)
        at java.base@11.0.16.1/java.lang.Thread.run(Thread.java:829)
   6) Thread[id=172, name=CloserThread, state=WAITING, group=TGRP-HdfsBasicDistributedZk2Test]
        at java.base@11.0.16.1/java.lang.Object.wait(Native Method)
        at java.base@11.0.16.1/java.lang.Object.wait(Object.java:328)
        at app//org.apache.solr.core.CloserThread.run(CoreContainer.java:2506)
   7) Thread[id=171, name=zkCallback-23-thread-1, state=TIMED_WAITING, group=TGRP-HdfsBasicDistributedZk2Test]
        at java.base@11.0.16.1/jdk.internal.misc.Unsafe.park(Native Method)
        at java.base@11.0.16.1/java.util.concurrent.locks.LockSupport.parkNanos(LockSupport.java:234)
        at java.base@11.0.16.1/java.util.concurrent.SynchronousQueue$TransferStack.awaitFulfill(SynchronousQueue.java:462)
        at java.base@11.0.16.1/java.util.concurrent.SynchronousQueue$TransferStack.transfer(SynchronousQueue.java:361)
        at java.base@11.0.16.1/java.util.concurrent.SynchronousQueue.poll(SynchronousQueue.java:937)
        at java.base@11.0.16.1/java.util.concurrent.ThreadPoolExecutor.getTask(ThreadPoolExecutor.java:1053)
        at java.base@11.0.16.1/java.util.concurrent.ThreadPoolExecutor.runWorker(ThreadPoolExecutor.java:1114)
        at java.base@11.0.16.1/java.util.concurrent.ThreadPoolExecutor$Worker.run(ThreadPoolExecutor.java:628)
        at java.base@11.0.16.1/java.lang.Thread.run(Thread.java:829)
   8) Thread[id=159, name=httpShardExecutor-17-thread-1, state=RUNNABLE, group=TGRP-HdfsBasicDistributedZk2Test]
        at java.base@11.0.16.1/sun.nio.ch.EPoll.wait(Native Method)
        at java.base@11.0.16.1/sun.nio.ch.EPollSelectorImpl.doSelect(EPollSelectorImpl.java:120)
        at java.base@11.0.16.1/sun.nio.ch.SelectorImpl.lockAndDoSelect(SelectorImpl.java:124)
        at java.base@11.0.16.1/sun.nio.ch.SelectorImpl.select(SelectorImpl.java:141)
        at app//org.eclipse.jetty.io.ManagedSelector.nioSelect(ManagedSelector.java:183)
        at app//org.eclipse.jetty.io.ManagedSelector.select(ManagedSelector.java:190)
        at app//org.eclipse.jetty.io.ManagedSelector$SelectorProducer.select(ManagedSelector.java:606)
        at app//org.eclipse.jetty.io.ManagedSelector$SelectorProducer.produce(ManagedSelector.java:543)
        at app//org.eclipse.jetty.util.thread.strategy.EatWhatYouKill.produceTask(EatWhatYouKill.java:362)
        at app//org.eclipse.jetty.util.thread.strategy.EatWhatYouKill.doProduce(EatWhatYouKill.java:186)
        at app//org.eclipse.jetty.util.thread.strategy.EatWhatYouKill.tryProduce(EatWhatYouKill.java:173)
        at app//org.eclipse.jetty.util.thread.strategy.EatWhatYouKill.produce(EatWhatYouKill.java:137)
        at app//org.eclipse.jetty.io.ManagedSelector$$Lambda$357/0x000000010085cc40.run(Unknown Source)
        at app//org.apache.solr.common.util.ExecutorUtil$MDCAwareThreadPoolExecutor.lambda$execute$0(ExecutorUtil.java:271)
        at app//org.apache.solr.common.util.ExecutorUtil$MDCAwareThreadPoolExecutor$$Lambda$321/0x000000010080ec40.run(Unknown Source)
        at java.base@11.0.16.1/java.util.concurrent.ThreadPoolExecutor.runWorker(ThreadPoolExecutor.java:1128)
        at java.base@11.0.16.1/java.util.concurrent.ThreadPoolExecutor$Worker.run(ThreadPoolExecutor.java:628)
        at java.base@11.0.16.1/java.lang.Thread.run(Thread.java:829)
   9) Thread[id=169, name=OverseerStateUpdate-72371257379717125-127.0.0.1:40345_rn_%2Fbe-n_0000000000, state=TIMED_WAITING, group=Overseer state updater.]
        at java.base@11.0.16.1/jdk.internal.misc.Unsafe.park(Native Method)
        at java.base@11.0.16.1/java.util.concurrent.locks.LockSupport.parkNanos(LockSupport.java:234)
        at java.base@11.0.16.1/java.util.concurrent.locks.AbstractQueuedSynchronizer$ConditionObject.awaitNanos(AbstractQueuedSynchronizer.java:2123)
        at app//org.apache.solr.cloud.ZkDistributedQueue.peekElements(ZkDistributedQueue.java:488)
        at app//org.apache.solr.cloud.Overseer$ClusterStateUpdater.run(Overseer.java:320)
        at java.base@11.0.16.1/java.lang.Thread.run(Thread.java:829)
  10) Thread[id=154, name=qtp1024864234-154, state=TIMED_WAITING, group=TGRP-HdfsBasicDistributedZk2Test]
        at java.base@11.0.16.1/jdk.internal.misc.Unsafe.park(Native Method)
        at java.base@11.0.16.1/java.util.concurrent.locks.LockSupport.parkNanos(LockSupport.java:234)
        at java.base@11.0.16.1/java.util.concurrent.locks.AbstractQueuedSynchronizer$ConditionObject.awaitNanos(AbstractQueuedSynchronizer.java:2123)
        at app//org.eclipse.jetty.util.BlockingArrayQueue.poll(BlockingArrayQueue.java:382)
        at app//org.eclipse.jetty.util.thread.QueuedThreadPool$Runner.idleJobPoll(QueuedThreadPool.java:974)
        at app//org.eclipse.jetty.util.thread.QueuedThreadPool$Runner.run(QueuedThreadPool.java:1018)
        at java.base@11.0.16.1/java.lang.Thread.run(Thread.java:829)
  11) Thread[id=155, name=Session-HouseKeeper-47679f67-1, state=TIMED_WAITING, group=TGRP-HdfsBasicDistributedZk2Test]
        at java.base@11.0.16.1/jdk.internal.misc.Unsafe.park(Native Method)
        at java.base@11.0.16.1/java.util.concurrent.locks.LockSupport.parkNanos(LockSupport.java:234)
        at java.base@11.0.16.1/java.util.concurrent.locks.AbstractQueuedSynchronizer$ConditionObject.awaitNanos(AbstractQueuedSynchronizer.java:2123)
        at java.base@11.0.16.1/java.util.concurrent.ScheduledThreadPoolExecutor$DelayedWorkQueue.take(ScheduledThreadPoolExecutor.java:1182)
        at java.base@11.0.16.1/java.util.concurrent.ScheduledThreadPoolExecutor$DelayedWorkQueue.take(ScheduledThreadPoolExecutor.java:899)
        at java.base@11.0.16.1/java.util.concurrent.ThreadPoolExecutor.getTask(ThreadPoolExecutor.java:1054)
        at java.base@11.0.16.1/java.util.concurrent.ThreadPoolExecutor.runWorker(ThreadPoolExecutor.java:1114)
        at java.base@11.0.16.1/java.util.concurrent.ThreadPoolExecutor$Worker.run(ThreadPoolExecutor.java:628)
        at java.base@11.0.16.1/java.lang.Thread.run(Thread.java:829)
  12) Thread[id=170, name=OverseerCollectionConfigSetProcessor-72371257379717125-127.0.0.1:40345_rn_%2Fbe-n_0000000000, state=WAITING, group=Overseer collection creation process.]
        at java.base@11.0.16.1/java.lang.Object.wait(Native Method)
        at java.base@11.0.16.1/java.lang.Object.wait(Object.java:328)
        at app//org.apache.zookeeper.ClientCnxn.submitRequest(ClientCnxn.java:1590)
        at app//org.apache.zookeeper.ClientCnxn.submitRequest(ClientCnxn.java:1562)
        at app//org.apache.zookeeper.ZooKeeper.getData(ZooKeeper.java:1970)
        at app//org.apache.solr.common.cloud.SolrZkClient.lambda$getData$6(SolrZkClient.java:432)
        at app//org.apache.solr.common.cloud.SolrZkClient$$Lambda$453/0x0000000100966440.execute(Unknown Source)
        at app//org.apache.solr.common.cloud.ZkCmdExecutor.retryOperation(ZkCmdExecutor.java:72)
        at app//org.apache.solr.common.cloud.SolrZkClient.getData(SolrZkClient.java:432)
        at app//org.apache.solr.cloud.OverseerTaskProcessor.amILeader(OverseerTaskProcessor.java:486)
        at app//org.apache.solr.cloud.OverseerTaskProcessor.run(OverseerTaskProcessor.java:232)
        at java.base@11.0.16.1/java.lang.Thread.run(Thread.java:829)
  13) Thread[id=197, name=zkCallback-23-thread-3, state=TIMED_WAITING, group=TGRP-HdfsBasicDistributedZk2Test]
        at java.base@11.0.16.1/jdk.internal.misc.Unsafe.park(Native Method)
        at java.base@11.0.16.1/java.util.concurrent.locks.LockSupport.parkNanos(LockSupport.java:234)
        at java.base@11.0.16.1/java.util.concurrent.SynchronousQueue$TransferStack.awaitFulfill(SynchronousQueue.java:462)
        at java.base@11.0.16.1/java.util.concurrent.SynchronousQueue$TransferStack.transfer(SynchronousQueue.java:361)
        at java.base@11.0.16.1/java.util.concurrent.SynchronousQueue.poll(SynchronousQueue.java:937)
        at java.base@11.0.16.1/java.util.concurrent.ThreadPoolExecutor.getTask(ThreadPoolExecutor.java:1053)
        at java.base@11.0.16.1/java.util.concurrent.ThreadPoolExecutor.runWorker(ThreadPoolExecutor.java:1114)
        at java.base@11.0.16.1/java.util.concurrent.ThreadPoolExecutor$Worker.run(ThreadPoolExecutor.java:628)
        at java.base@11.0.16.1/java.lang.Thread.run(Thread.java:829)
  14) Thread[id=151, name=qtp1024864234-151, state=TIMED_WAITING, group=TGRP-HdfsBasicDistributedZk2Test]
        at java.base@11.0.16.1/jdk.internal.misc.Unsafe.park(Native Method)
        at java.base@11.0.16.1/java.util.concurrent.locks.LockSupport.parkNanos(LockSupport.java:234)
        at java.base@11.0.16.1/java.util.concurrent.locks.AbstractQueuedSynchronizer$ConditionObject.awaitNanos(AbstractQueuedSynchronizer.java:2123)
        at app//org.eclipse.jetty.util.BlockingArrayQueue.poll(BlockingArrayQueue.java:382)
        at app//org.eclipse.jetty.util.thread.QueuedThreadPool$Runner.idleJobPoll(QueuedThreadPool.java:974)
        at app//org.eclipse.jetty.util.thread.QueuedThreadPool$Runner.run(QueuedThreadPool.java:1018)
        at java.base@11.0.16.1/java.lang.Thread.run(Thread.java:829)
  15) Thread[id=168, name=zkConnectionManagerCallback-24-thread-1, state=WAITING, group=TGRP-HdfsBasicDistributedZk2Test]
        at java.base@11.0.16.1/jdk.internal.misc.Unsafe.park(Native Method)
        at java.base@11.0.16.1/java.util.concurrent.locks.LockSupport.park(LockSupport.java:194)
        at java.base@11.0.16.1/java.util.concurrent.locks.AbstractQueuedSynchronizer$ConditionObject.await(AbstractQueuedSynchronizer.java:2081)
        at java.base@11.0.16.1/java.util.concurrent.LinkedBlockingQueue.take(LinkedBlockingQueue.java:433)
        at java.base@11.0.16.1/java.util.concurrent.ThreadPoolExecutor.getTask(ThreadPoolExecutor.java:1054)
        at java.base@11.0.16.1/java.util.concurrent.ThreadPoolExecutor.runWorker(ThreadPoolExecutor.java:1114)
        at java.base@11.0.16.1/java.util.concurrent.ThreadPoolExecutor$Worker.run(ThreadPoolExecutor.java:628)
        at java.base@11.0.16.1/java.lang.Thread.run(Thread.java:829)
  16) Thread[id=173, name=coreContainerWorkExecutor-14-thread-1, state=TIMED_WAITING, group=TGRP-HdfsBasicDistributedZk2Test]
        at java.base@11.0.16.1/jdk.internal.misc.Unsafe.park(Native Method)
        at java.base@11.0.16.1/java.util.concurrent.locks.LockSupport.parkNanos(LockSupport.java:234)
        at java.base@11.0.16.1/java.util.concurrent.SynchronousQueue$TransferStack.awaitFulfill(SynchronousQueue.java:462)
        at java.base@11.0.16.1/java.util.concurrent.SynchronousQueue$TransferStack.transfer(SynchronousQueue.java:361)
        at java.base@11.0.16.1/java.util.concurrent.SynchronousQueue.poll(SynchronousQueue.java:937)
        at java.base@11.0.16.1/java.util.concurrent.ThreadPoolExecutor.getTask(ThreadPoolExecutor.java:1053)
        at java.base@11.0.16.1/java.util.concurrent.ThreadPoolExecutor.runWorker(ThreadPoolExecutor.java:1114)
        at java.base@11.0.16.1/java.util.concurrent.ThreadPoolExecutor$Worker.run(ThreadPoolExecutor.java:628)
        at java.base@11.0.16.1/java.lang.Thread.run(Thread.java:829)
  17) Thread[id=148, name=qtp1024864234-148, state=RUNNABLE, group=TGRP-HdfsBasicDistributedZk2Test]
        at java.base@11.0.16.1/sun.nio.ch.EPoll.wait(Native Method)
        at java.base@11.0.16.1/sun.nio.ch.EPollSelectorImpl.doSelect(EPollSelectorImpl.java:120)
        at java.base@11.0.16.1/sun.nio.ch.SelectorImpl.lockAndDoSelect(SelectorImpl.java:124)
        at java.base@11.0.16.1/sun.nio.ch.SelectorImpl.select(SelectorImpl.java:141)
        at app//org.eclipse.jetty.io.ManagedSelector.nioSelect(ManagedSelector.java:183)
        at app//org.eclipse.jetty.io.ManagedSelector.select(ManagedSelector.java:190)
        at app//org.eclipse.jetty.io.ManagedSelector$SelectorProducer.select(ManagedSelector.java:606)
        at app//org.eclipse.jetty.io.ManagedSelector$SelectorProducer.produce(ManagedSelector.java:543)
        at app//org.eclipse.jetty.util.thread.strategy.EatWhatYouKill.produceTask(EatWhatYouKill.java:362)
        at app//org.eclipse.jetty.util.thread.strategy.EatWhatYouKill.doProduce(EatWhatYouKill.java:186)
        at app//org.eclipse.jetty.util.thread.strategy.EatWhatYouKill.tryProduce(EatWhatYouKill.java:173)
        at app//org.eclipse.jetty.util.thread.strategy.EatWhatYouKill.produce(EatWhatYouKill.java:137)
        at app//org.eclipse.jetty.io.ManagedSelector$$Lambda$357/0x000000010085cc40.run(Unknown Source)
        at app//org.eclipse.jetty.util.thread.QueuedThreadPool.runJob(QueuedThreadPool.java:883)
        at app//org.eclipse.jetty.util.thread.QueuedThreadPool$Runner.run(QueuedThreadPool.java:1034)
        at java.base@11.0.16.1/java.lang.Thread.run(Thread.java:829)
  18) Thread[id=198, name=zkCallback-23-thread-4, state=TIMED_WAITING, group=TGRP-HdfsBasicDistributedZk2Test]
        at java.base@11.0.16.1/jdk.internal.misc.Unsafe.park(Native Method)
        at java.base@11.0.16.1/java.util.concurrent.locks.LockSupport.parkNanos(LockSupport.java:234)
        at java.base@11.0.16.1/java.util.concurrent.SynchronousQueue$TransferStack.awaitFulfill(SynchronousQueue.java:462)
        at java.base@11.0.16.1/java.util.concurrent.SynchronousQueue$TransferStack.transfer(SynchronousQueue.java:361)
        at java.base@11.0.16.1/java.util.concurrent.SynchronousQueue.poll(SynchronousQueue.java:937)
        at java.base@11.0.16.1/java.util.concurrent.ThreadPoolExecutor.getTask(ThreadPoolExecutor.java:1053)
        at java.base@11.0.16.1/java.util.concurrent.ThreadPoolExecutor.runWorker(ThreadPoolExecutor.java:1114)
        at java.base@11.0.16.1/java.util.concurrent.ThreadPoolExecutor$Worker.run(ThreadPoolExecutor.java:628)
        at java.base@11.0.16.1/java.lang.Thread.run(Thread.java:829)
  19) Thread[id=150, name=qtp1024864234-150-acceptor-0@1d804ec4-ServerConnector@4a0c25fc{ssl, (ssl, alpn, http/1.1, h2)}{127.0.0.1:40345}, state=RUNNABLE, group=TGRP-HdfsBasicDistributedZk2Test]
        at java.base@11.0.16.1/sun.nio.ch.ServerSocketChannelImpl.accept0(Native Method)
        at java.base@11.0.16.1/sun.nio.ch.ServerSocketChannelImpl.accept(ServerSocketChannelImpl.java:533)
        at java.base@11.0.16.1/sun.nio.ch.ServerSocketChannelImpl.accept(ServerSocketChannelImpl.java:285)
        at app//org.eclipse.jetty.server.ServerConnector.accept(ServerConnector.java:388)
        at app//org.eclipse.jetty.server.AbstractConnector$Acceptor.run(AbstractConnector.java:704)
        at app//org.eclipse.jetty.util.thread.QueuedThreadPool.runJob(QueuedThreadPool.java:883)
        at app//org.eclipse.jetty.util.thread.QueuedThreadPool$Runner.run(QueuedThreadPool.java:1034)
        at java.base@11.0.16.1/java.lang.Thread.run(Thread.java:829)
  20) Thread[id=147, name=qtp1024864234-147, state=RUNNABLE, group=TGRP-HdfsBasicDistributedZk2Test]
        at java.base@11.0.16.1/sun.nio.ch.EPoll.wait(Native Method)
        at java.base@11.0.16.1/sun.nio.ch.EPollSelectorImpl.doSelect(EPollSelectorImpl.java:120)
        at java.base@11.0.16.1/sun.nio.ch.SelectorImpl.lockAndDoSelect(SelectorImpl.java:124)
        at java.base@11.0.16.1/sun.nio.ch.SelectorImpl.select(SelectorImpl.java:141)
        at app//org.eclipse.jetty.io.ManagedSelector.nioSelect(ManagedSelector.java:183)
        at app//org.eclipse.jetty.io.ManagedSelector.select(ManagedSelector.java:190)
        at app//org.eclipse.jetty.io.ManagedSelector$SelectorProducer.select(ManagedSelector.java:606)
        at app//org.eclipse.jetty.io.ManagedSelector$SelectorProducer.produce(ManagedSelector.java:543)
        at app//org.eclipse.jetty.util.thread.strategy.EatWhatYouKill.produceTask(EatWhatYouKill.java:362)
        at app//org.eclipse.jetty.util.thread.strategy.EatWhatYouKill.doProduce(EatWhatYouKill.java:186)
        at app//org.eclipse.jetty.util.thread.strategy.EatWhatYouKill.tryProduce(EatWhatYouKill.java:173)
        at app//org.eclipse.jetty.util.thread.strategy.EatWhatYouKill.produce(EatWhatYouKill.java:137)
        at app//org.eclipse.jetty.io.ManagedSelector$$Lambda$357/0x000000010085cc40.run(Unknown Source)
        at app//org.eclipse.jetty.util.thread.QueuedThreadPool.runJob(QueuedThreadPool.java:883)
        at app//org.eclipse.jetty.util.thread.QueuedThreadPool$Runner.run(QueuedThreadPool.java:1034)
        at java.base@11.0.16.1/java.lang.Thread.run(Thread.java:829)
  21) Thread[id=149, name=qtp1024864234-149, state=TIMED_WAITING, group=TGRP-HdfsBasicDistributedZk2Test]
        at java.base@11.0.16.1/jdk.internal.misc.Unsafe.park(Native Method)
        at java.base@11.0.16.1/java.util.concurrent.locks.LockSupport.parkNanos(LockSupport.java:234)
        at java.base@11.0.16.1/java.util.concurrent.locks.AbstractQueuedSynchronizer$ConditionObject.awaitNanos(AbstractQueuedSynchronizer.java:2123)
        at app//org.eclipse.jetty.util.BlockingArrayQueue.poll(BlockingArrayQueue.java:382)
        at app//org.eclipse.jetty.util.thread.QueuedThreadPool$Runner.idleJobPoll(QueuedThreadPool.java:974)
        at app//org.eclipse.jetty.util.thread.QueuedThreadPool$Runner.run(QueuedThreadPool.java:1018)
        at java.base@11.0.16.1/java.lang.Thread.run(Thread.java:829)
  22) Thread[id=153, name=qtp1024864234-153, state=TIMED_WAITING, group=TGRP-HdfsBasicDistributedZk2Test]
        at java.base@11.0.16.1/jdk.internal.misc.Unsafe.park(Native Method)
        at java.base@11.0.16.1/java.util.concurrent.locks.LockSupport.parkNanos(LockSupport.java:234)
        at java.base@11.0.16.1/java.util.concurrent.locks.AbstractQueuedSynchronizer$ConditionObject.awaitNanos(AbstractQueuedSynchronizer.java:2123)
        at app//org.eclipse.jetty.util.BlockingArrayQueue.poll(BlockingArrayQueue.java:382)
        at app//org.eclipse.jetty.util.thread.QueuedThreadPool$Runner.idleJobPoll(QueuedThreadPool.java:974)
        at app//org.eclipse.jetty.util.thread.QueuedThreadPool$Runner.run(QueuedThreadPool.java:1018)
        at java.base@11.0.16.1/java.lang.Thread.run(Thread.java:829)
	at __randomizedtesting.SeedInfo.seed([48E34A1FF4C72CE2]:0)


FAILED:  org.apache.solr.hdfs.cloud.HdfsBasicDistributedZk2Test.classMethod

Error Message:
com.carrotsearch.randomizedtesting.ThreadLeakError: There are still zombie threads that couldn't be terminated:
   1) Thread[id=196, name=zkCallback-23-thread-2, state=TIMED_WAITING, group=TGRP-HdfsBasicDistributedZk2Test]
        at java.base@11.0.16.1/jdk.internal.misc.Unsafe.park(Native Method)
        at java.base@11.0.16.1/java.util.concurrent.locks.LockSupport.parkNanos(LockSupport.java:234)
        at java.base@11.0.16.1/java.util.concurrent.SynchronousQueue$TransferStack.awaitFulfill(SynchronousQueue.java:462)
        at java.base@11.0.16.1/java.util.concurrent.SynchronousQueue$TransferStack.transfer(SynchronousQueue.java:361)
        at java.base@11.0.16.1/java.util.concurrent.SynchronousQueue.poll(SynchronousQueue.java:937)
        at java.base@11.0.16.1/java.util.concurrent.ThreadPoolExecutor.getTask(ThreadPoolExecutor.java:1053)
        at java.base@11.0.16.1/java.util.concurrent.ThreadPoolExecutor.runWorker(ThreadPoolExecutor.java:1114)
        at java.base@11.0.16.1/java.util.concurrent.ThreadPoolExecutor$Worker.run(ThreadPoolExecutor.java:628)
        at java.base@11.0.16.1/java.lang.Thread.run(Thread.java:829)
   2) Thread[id=166, name=TEST-HdfsBasicDistributedZk2Test.test-seed#[48E34A1FF4C72CE2]-SendThread(127.0.0.1:43711), state=TIMED_WAITING, group=TGRP-HdfsBasicDistributedZk2Test]
        at java.base@11.0.16.1/java.lang.Thread.sleep(Native Method)
        at app//org.apache.zookeeper.ClientCnxn$SendThread.startConnect(ClientCnxn.java:1136)
        at app//org.apache.zookeeper.ClientCnxn$SendThread.run(ClientCnxn.java:1200)
   3) Thread[id=197, name=zkCallback-23-thread-3, state=TIMED_WAITING, group=TGRP-HdfsBasicDistributedZk2Test]
        at java.base@11.0.16.1/jdk.internal.misc.Unsafe.park(Native Method)
        at java.base@11.0.16.1/java.util.concurrent.locks.LockSupport.parkNanos(LockSupport.java:234)
        at java.base@11.0.16.1/java.util.concurrent.SynchronousQueue$TransferStack.awaitFulfill(SynchronousQueue.java:462)
        at java.base@11.0.16.1/java.util.concurrent.SynchronousQueue$TransferStack.transfer(SynchronousQueue.java:361)
        at java.base@11.0.16.1/java.util.concurrent.SynchronousQueue.poll(SynchronousQueue.java:937)
        at java.base@11.0.16.1/java.util.concurrent.ThreadPoolExecutor.getTask(ThreadPoolExecutor.java:1053)
        at java.base@11.0.16.1/java.util.concurrent.ThreadPoolExecutor.runWorker(ThreadPoolExecutor.java:1114)
        at java.base@11.0.16.1/java.util.concurrent.ThreadPoolExecutor$Worker.run(ThreadPoolExecutor.java:628)
        at java.base@11.0.16.1/java.lang.Thread.run(Thread.java:829)
   4) Thread[id=151, name=qtp1024864234-151, state=TIMED_WAITING, group=TGRP-HdfsBasicDistributedZk2Test]
        at java.base@11.0.16.1/jdk.internal.misc.Unsafe.park(Native Method)
        at java.base@11.0.16.1/java.util.concurrent.locks.LockSupport.parkNanos(LockSupport.java:234)
        at java.base@11.0.16.1/java.util.concurrent.locks.AbstractQueuedSynchronizer$ConditionObject.awaitNanos(AbstractQueuedSynchronizer.java:2123)
        at app//org.eclipse.jetty.util.BlockingArrayQueue.poll(BlockingArrayQueue.java:382)
        at app//org.eclipse.jetty.util.thread.QueuedThreadPool$Runner.idleJobPoll(QueuedThreadPool.java:974)
        at app//org.eclipse.jetty.util.thread.QueuedThreadPool$Runner.run(QueuedThreadPool.java:1018)
        at java.base@11.0.16.1/java.lang.Thread.run(Thread.java:829)
   5) Thread[id=168, name=zkConnectionManagerCallback-24-thread-1, state=WAITING, group=TGRP-HdfsBasicDistributedZk2Test]
        at java.base@11.0.16.1/jdk.internal.misc.Unsafe.park(Native Method)
        at java.base@11.0.16.1/java.util.concurrent.locks.LockSupport.park(LockSupport.java:194)
        at java.base@11.0.16.1/java.util.concurrent.locks.AbstractQueuedSynchronizer$ConditionObject.await(AbstractQueuedSynchronizer.java:2081)
        at java.base@11.0.16.1/java.util.concurrent.LinkedBlockingQueue.take(LinkedBlockingQueue.java:433)
        at java.base@11.0.16.1/java.util.concurrent.ThreadPoolExecutor.getTask(ThreadPoolExecutor.java:1054)
        at java.base@11.0.16.1/java.util.concurrent.ThreadPoolExecutor.runWorker(ThreadPoolExecutor.java:1114)
        at java.base@11.0.16.1/java.util.concurrent.ThreadPoolExecutor$Worker.run(ThreadPoolExecutor.java:628)
        at java.base@11.0.16.1/java.lang.Thread.run(Thread.java:829)
   6) Thread[id=173, name=coreContainerWorkExecutor-14-thread-1, state=TIMED_WAITING, group=TGRP-HdfsBasicDistributedZk2Test]
        at java.base@11.0.16.1/jdk.internal.misc.Unsafe.park(Native Method)
        at java.base@11.0.16.1/java.util.concurrent.locks.LockSupport.parkNanos(LockSupport.java:234)
        at java.base@11.0.16.1/java.util.concurrent.SynchronousQueue$TransferStack.awaitFulfill(SynchronousQueue.java:462)
        at java.base@11.0.16.1/java.util.concurrent.SynchronousQueue$TransferStack.transfer(SynchronousQueue.java:361)
        at java.base@11.0.16.1/java.util.concurrent.SynchronousQueue.poll(SynchronousQueue.java:937)
        at java.base@11.0.16.1/java.util.concurrent.ThreadPoolExecutor.getTask(ThreadPoolExecutor.java:1053)
        at java.base@11.0.16.1/java.util.concurrent.ThreadPoolExecutor.runWorker(ThreadPoolExecutor.java:1114)
        at java.base@11.0.16.1/java.util.concurrent.ThreadPoolExecutor$Worker.run(ThreadPoolExecutor.java:628)
        at java.base@11.0.16.1/java.lang.Thread.run(Thread.java:829)
   7) Thread[id=148, name=qtp1024864234-148, state=RUNNABLE, group=TGRP-HdfsBasicDistributedZk2Test]
        at java.base@11.0.16.1/sun.nio.ch.EPoll.wait(Native Method)
        at java.base@11.0.16.1/sun.nio.ch.EPollSelectorImpl.doSelect(EPollSelectorImpl.java:120)
        at java.base@11.0.16.1/sun.nio.ch.SelectorImpl.lockAndDoSelect(SelectorImpl.java:124)
        at java.base@11.0.16.1/sun.nio.ch.SelectorImpl.select(SelectorImpl.java:141)
        at app//org.eclipse.jetty.io.ManagedSelector.nioSelect(ManagedSelector.java:183)
        at app//org.eclipse.jetty.io.ManagedSelector.select(ManagedSelector.java:190)
        at app//org.eclipse.jetty.io.ManagedSelector$SelectorProducer.select(ManagedSelector.java:606)
        at app//org.eclipse.jetty.io.ManagedSelector$SelectorProducer.produce(ManagedSelector.java:543)
        at app//org.eclipse.jetty.util.thread.strategy.EatWhatYouKill.produceTask(EatWhatYouKill.java:362)
        at app//org.eclipse.jetty.util.thread.strategy.EatWhatYouKill.doProduce(EatWhatYouKill.java:186)
        at app//org.eclipse.jetty.util.thread.strategy.EatWhatYouKill.tryProduce(EatWhatYouKill.java:173)
        at app//org.eclipse.jetty.util.thread.strategy.EatWhatYouKill.produce(EatWhatYouKill.java:137)
        at app//org.eclipse.jetty.io.ManagedSelector$$Lambda$357/0x000000010085cc40.run(Unknown Source)
        at app//org.eclipse.jetty.util.thread.QueuedThreadPool.runJob(QueuedThreadPool.java:883)
        at app//org.eclipse.jetty.util.thread.QueuedThreadPool$Runner.run(QueuedThreadPool.java:1034)
        at java.base@11.0.16.1/java.lang.Thread.run(Thread.java:829)
   8) Thread[id=198, name=zkCallback-23-thread-4, state=TIMED_WAITING, group=TGRP-HdfsBasicDistributedZk2Test]
        at java.base@11.0.16.1/jdk.internal.misc.Unsafe.park(Native Method)
        at java.base@11.0.16.1/java.util.concurrent.locks.LockSupport.parkNanos(LockSupport.java:234)
        at java.base@11.0.16.1/java.util.concurrent.SynchronousQueue$TransferStack.awaitFulfill(SynchronousQueue.java:462)
        at java.base@11.0.16.1/java.util.concurrent.SynchronousQueue$TransferStack.transfer(SynchronousQueue.java:361)
        at java.base@11.0.16.1/java.util.concurrent.SynchronousQueue.poll(SynchronousQueue.java:937)
        at java.base@11.0.16.1/java.util.concurrent.ThreadPoolExecutor.getTask(ThreadPoolExecutor.java:1053)
        at java.base@11.0.16.1/java.util.concurrent.ThreadPoolExecutor.runWorker(ThreadPoolExecutor.java:1114)
        at java.base@11.0.16.1/java.util.concurrent.ThreadPoolExecutor$Worker.run(ThreadPoolExecutor.java:628)
        at java.base@11.0.16.1/java.lang.Thread.run(Thread.java:829)
   9) Thread[id=162, name=h2sc-19-thread-1, state=RUNNABLE, group=TGRP-HdfsBasicDistributedZk2Test]
        at java.base@11.0.16.1/sun.nio.ch.EPoll.wait(Native Method)
        at java.base@11.0.16.1/sun.nio.ch.EPollSelectorImpl.doSelect(EPollSelectorImpl.java:120)
        at java.base@11.0.16.1/sun.nio.ch.SelectorImpl.lockAndDoSelect(SelectorImpl.java:124)
        at java.base@11.0.16.1/sun.nio.ch.SelectorImpl.select(SelectorImpl.java:141)
        at app//org.eclipse.jetty.io.ManagedSelector.nioSelect(ManagedSelector.java:183)
        at app//org.eclipse.jetty.io.ManagedSelector.select(ManagedSelector.java:190)
        at app//org.eclipse.jetty.io.ManagedSelector$SelectorProducer.select(ManagedSelector.java:606)
        at app//org.eclipse.jetty.io.ManagedSelector$SelectorProducer.produce(ManagedSelector.java:543)
        at app//org.eclipse.jetty.util.thread.strategy.EatWhatYouKill.produceTask(EatWhatYouKill.java:362)
        at app//org.eclipse.jetty.util.thread.strategy.EatWhatYouKill.doProduce(EatWhatYouKill.java:186)
        at app//org.eclipse.jetty.util.thread.strategy.EatWhatYouKill.tryProduce(EatWhatYouKill.java:173)
        at app//org.eclipse.jetty.util.thread.strategy.EatWhatYouKill.produce(EatWhatYouKill.java:137)
        at app//org.eclipse.jetty.io.ManagedSelector$$Lambda$357/0x000000010085cc40.run(Unknown Source)
        at app//org.apache.solr.common.util.ExecutorUtil$MDCAwareThreadPoolExecutor.lambda$execute$0(ExecutorUtil.java:271)
        at app//org.apache.solr.common.util.ExecutorUtil$MDCAwareThreadPoolExecutor$$Lambda$321/0x000000010080ec40.run(Unknown Source)
        at java.base@11.0.16.1/java.util.concurrent.ThreadPoolExecutor.runWorker(ThreadPoolExecutor.java:1128)
        at java.base@11.0.16.1/java.util.concurrent.ThreadPoolExecutor$Worker.run(ThreadPoolExecutor.java:628)
        at java.base@11.0.16.1/java.lang.Thread.run(Thread.java:829)
  10) Thread[id=152, name=qtp1024864234-152, state=TIMED_WAITING, group=TGRP-HdfsBasicDistributedZk2Test]
        at java.base@11.0.16.1/jdk.internal.misc.Unsafe.park(Native Method)
        at java.base@11.0.16.1/java.util.concurrent.locks.LockSupport.parkNanos(LockSupport.java:234)
        at java.base@11.0.16.1/java.util.concurrent.locks.AbstractQueuedSynchronizer$ConditionObject.awaitNanos(AbstractQueuedSynchronizer.java:2123)
        at app//org.eclipse.jetty.util.BlockingArrayQueue.poll(BlockingArrayQueue.java:382)
        at app//org.eclipse.jetty.util.thread.QueuedThreadPool$Runner.idleJobPoll(QueuedThreadPool.java:974)
        at app//org.eclipse.jetty.util.thread.QueuedThreadPool$Runner.run(QueuedThreadPool.java:1018)
        at java.base@11.0.16.1/java.lang.Thread.run(Thread.java:829)
  11) Thread[id=172, name=CloserThread, state=WAITING, group=TGRP-HdfsBasicDistributedZk2Test]
        at java.base@11.0.16.1/java.lang.Object.wait(Native Method)
        at java.base@11.0.16.1/java.lang.Object.wait(Object.java:328)
        at app//org.apache.solr.core.CloserThread.run(CoreContainer.java:2506)
  12) Thread[id=171, name=zkCallback-23-thread-1, state=TIMED_WAITING, group=TGRP-HdfsBasicDistributedZk2Test]
        at java.base@11.0.16.1/jdk.internal.misc.Unsafe.park(Native Method)
        at java.base@11.0.16.1/java.util.concurrent.locks.LockSupport.parkNanos(LockSupport.java:234)
        at java.base@11.0.16.1/java.util.concurrent.SynchronousQueue$TransferStack.awaitFulfill(SynchronousQueue.java:462)
        at java.base@11.0.16.1/java.util.concurrent.SynchronousQueue$TransferStack.transfer(SynchronousQueue.java:361)
        at java.base@11.0.16.1/java.util.concurrent.SynchronousQueue.poll(SynchronousQueue.java:937)
        at java.base@11.0.16.1/java.util.concurrent.ThreadPoolExecutor.getTask(ThreadPoolExecutor.java:1053)
        at java.base@11.0.16.1/java.util.concurrent.ThreadPoolExecutor.runWorker(ThreadPoolExecutor.java:1114)
        at java.base@11.0.16.1/java.util.concurrent.ThreadPoolExecutor$Worker.run(ThreadPoolExecutor.java:628)
        at java.base@11.0.16.1/java.lang.Thread.run(Thread.java:829)
  13) Thread[id=159, name=httpShardExecutor-17-thread-1, state=RUNNABLE, group=TGRP-HdfsBasicDistributedZk2Test]
        at java.base@11.0.16.1/sun.nio.ch.EPoll.wait(Native Method)
        at java.base@11.0.16.1/sun.nio.ch.EPollSelectorImpl.doSelect(EPollSelectorImpl.java:120)
        at java.base@11.0.16.1/sun.nio.ch.SelectorImpl.lockAndDoSelect(SelectorImpl.java:124)
        at java.base@11.0.16.1/sun.nio.ch.SelectorImpl.select(SelectorImpl.java:141)
        at app//org.eclipse.jetty.io.ManagedSelector.nioSelect(ManagedSelector.java:183)
        at app//org.eclipse.jetty.io.ManagedSelector.select(ManagedSelector.java:190)
        at app//org.eclipse.jetty.io.ManagedSelector$SelectorProducer.select(ManagedSelector.java:606)
        at app//org.eclipse.jetty.io.ManagedSelector$SelectorProducer.produce(ManagedSelector.java:543)
        at app//org.eclipse.jetty.util.thread.strategy.EatWhatYouKill.produceTask(EatWhatYouKill.java:362)
        at app//org.eclipse.jetty.util.thread.strategy.EatWhatYouKill.doProduce(EatWhatYouKill.java:186)
        at app//org.eclipse.jetty.util.thread.strategy.EatWhatYouKill.tryProduce(EatWhatYouKill.java:173)
        at app//org.eclipse.jetty.util.thread.strategy.EatWhatYouKill.produce(EatWhatYouKill.java:137)
        at app//org.eclipse.jetty.io.ManagedSelector$$Lambda$357/0x000000010085cc40.run(Unknown Source)
        at app//org.apache.solr.common.util.ExecutorUtil$MDCAwareThreadPoolExecutor.lambda$execute$0(ExecutorUtil.java:271)
        at app//org.apache.solr.common.util.ExecutorUtil$MDCAwareThreadPoolExecutor$$Lambda$321/0x000000010080ec40.run(Unknown Source)
        at java.base@11.0.16.1/java.util.concurrent.ThreadPoolExecutor.runWorker(ThreadPoolExecutor.java:1128)
        at java.base@11.0.16.1/java.util.concurrent.ThreadPoolExecutor$Worker.run(ThreadPoolExecutor.java:628)
        at java.base@11.0.16.1/java.lang.Thread.run(Thread.java:829)
  14) Thread[id=154, name=qtp1024864234-154, state=TIMED_WAITING, group=TGRP-HdfsBasicDistributedZk2Test]
        at java.base@11.0.16.1/jdk.internal.misc.Unsafe.park(Native Method)
        at java.base@11.0.16.1/java.util.concurrent.locks.LockSupport.parkNanos(LockSupport.java:234)
        at java.base@11.0.16.1/java.util.concurrent.locks.AbstractQueuedSynchronizer$ConditionObject.awaitNanos(AbstractQueuedSynchronizer.java:2123)
        at app//org.eclipse.jetty.util.BlockingArrayQueue.poll(BlockingArrayQueue.java:382)
        at app//org.eclipse.jetty.util.thread.QueuedThreadPool$Runner.idleJobPoll(QueuedThreadPool.java:974)
        at app//org.eclipse.jetty.util.thread.QueuedThreadPool$Runner.run(QueuedThreadPool.java:1018)
        at java.base@11.0.16.1/java.lang.Thread.run(Thread.java:829)
  15) Thread[id=155, name=Session-HouseKeeper-47679f67-1, state=TIMED_WAITING, group=TGRP-HdfsBasicDistributedZk2Test]
        at java.base@11.0.16.1/jdk.internal.misc.Unsafe.park(Native Method)
        at java.base@11.0.16.1/java.util.concurrent.locks.LockSupport.parkNanos(LockSupport.java:234)
        at java.base@11.0.16.1/java.util.concurrent.locks.AbstractQueuedSynchronizer$ConditionObject.awaitNanos(AbstractQueuedSynchronizer.java:2123)
        at java.base@11.0.16.1/java.util.concurrent.ScheduledThreadPoolExecutor$DelayedWorkQueue.take(ScheduledThreadPoolExecutor.java:1182)
        at java.base@11.0.16.1/java.util.concurrent.ScheduledThreadPoolExecutor$DelayedWorkQueue.take(ScheduledThreadPoolExecutor.java:899)
        at java.base@11.0.16.1/java.util.concurrent.ThreadPoolExecutor.getTask(ThreadPoolExecutor.java:1054)
        at java.base@11.0.16.1/java.util.concurrent.ThreadPoolExecutor.runWorker(ThreadPoolExecutor.java:1114)
        at java.base@11.0.16.1/java.util.concurrent.ThreadPoolExecutor$Worker.run(ThreadPoolExecutor.java:628)
        at java.base@11.0.16.1/java.lang.Thread.run(Thread.java:829)
  16) Thread[id=150, name=qtp1024864234-150, state=TIMED_WAITING, group=TGRP-HdfsBasicDistributedZk2Test]
        at java.base@11.0.16.1/jdk.internal.misc.Unsafe.park(Native Method)
        at java.base@11.0.16.1/java.util.concurrent.locks.LockSupport.parkNanos(LockSupport.java:234)
        at java.base@11.0.16.1/java.util.concurrent.locks.AbstractQueuedSynchronizer$ConditionObject.awaitNanos(AbstractQueuedSynchronizer.java:2123)
        at app//org.eclipse.jetty.util.BlockingArrayQueue.poll(BlockingArrayQueue.java:382)
        at app//org.eclipse.jetty.util.thread.QueuedThreadPool$Runner.idleJobPoll(QueuedThreadPool.java:974)
        at app//org.eclipse.jetty.util.thread.QueuedThreadPool$Runner.run(QueuedThreadPool.java:1018)
        at java.base@11.0.16.1/java.lang.Thread.run(Thread.java:829)
  17) Thread[id=147, name=qtp1024864234-147, state=RUNNABLE, group=TGRP-HdfsBasicDistributedZk2Test]
        at java.base@11.0.16.1/sun.nio.ch.EPoll.wait(Native Method)
        at java.base@11.0.16.1/sun.nio.ch.EPollSelectorImpl.doSelect(EPollSelectorImpl.java:120)
        at java.base@11.0.16.1/sun.nio.ch.SelectorImpl.lockAndDoSelect(SelectorImpl.java:124)
        at java.base@11.0.16.1/sun.nio.ch.SelectorImpl.select(SelectorImpl.java:141)
        at app//org.eclipse.jetty.io.ManagedSelector.nioSelect(ManagedSelector.java:183)
        at app//org.eclipse.jetty.io.ManagedSelector.select(ManagedSelector.java:190)
        at app//org.eclipse.jetty.io.ManagedSelector$SelectorProducer.select(ManagedSelector.java:606)
        at app//org.eclipse.jetty.io.ManagedSelector$SelectorProducer.produce(ManagedSelector.java:543)
        at app//org.eclipse.jetty.util.thread.strategy.EatWhatYouKill.produceTask(EatWhatYouKill.java:362)
        at app//org.eclipse.jetty.util.thread.strategy.EatWhatYouKill.doProduce(EatWhatYouKill.java:186)
        at app//org.eclipse.jetty.util.thread.strategy.EatWhatYouKill.tryProduce(EatWhatYouKill.java:173)
        at app//org.eclipse.jetty.util.thread.strategy.EatWhatYouKill.produce(EatWhatYouKill.java:137)
        at app//org.eclipse.jetty.io.ManagedSelector$$Lambda$357/0x000000010085cc40.run(Unknown Source)
        at app//org.eclipse.jetty.util.thread.QueuedThreadPool.runJob(QueuedThreadPool.java:883)
        at app//org.eclipse.jetty.util.thread.QueuedThreadPool$Runner.run(QueuedThreadPool.java:1034)
        at java.base@11.0.16.1/java.lang.Thread.run(Thread.java:829)
  18) Thread[id=149, name=qtp1024864234-149, state=TIMED_WAITING, group=TGRP-HdfsBasicDistributedZk2Test]
        at java.base@11.0.16.1/jdk.internal.misc.Unsafe.park(Native Method)
        at java.base@11.0.16.1/java.util.concurrent.locks.LockSupport.parkNanos(LockSupport.java:234)
        at java.base@11.0.16.1/java.util.concurrent.locks.AbstractQueuedSynchronizer$ConditionObject.awaitNanos(AbstractQueuedSynchronizer.java:2123)
        at app//org.eclipse.jetty.util.BlockingArrayQueue.poll(BlockingArrayQueue.java:382)
        at app//org.eclipse.jetty.util.thread.QueuedThreadPool$Runner.idleJobPoll(QueuedThreadPool.java:974)
        at app//org.eclipse.jetty.util.thread.QueuedThreadPool$Runner.run(QueuedThreadPool.java:1018)
        at java.base@11.0.16.1/java.lang.Thread.run(Thread.java:829)
  19) Thread[id=153, name=qtp1024864234-153, state=TIMED_WAITING, group=TGRP-HdfsBasicDistributedZk2Test]
        at java.base@11.0.16.1/jdk.internal.misc.Unsafe.park(Native Method)
        at java.base@11.0.16.1/java.util.concurrent.locks.LockSupport.parkNanos(LockSupport.java:234)
        at java.base@11.0.16.1/java.util.concurrent.locks.AbstractQueuedSynchronizer$ConditionObject.awaitNanos(AbstractQueuedSynchronizer.java:2123)
        at app//org.eclipse.jetty.util.BlockingArrayQueue.poll(BlockingArrayQueue.java:382)
        at app//org.eclipse.jetty.util.thread.QueuedThreadPool$Runner.idleJobPoll(QueuedThreadPool.java:974)
        at app//org.eclipse.jetty.util.thread.QueuedThreadPool$Runner.run(QueuedThreadPool.java:1018)
        at java.base@11.0.16.1/java.lang.Thread.run(Thread.java:829)

Stack Trace:
com.carrotsearch.randomizedtesting.ThreadLeakError: There are still zombie threads that couldn't be terminated:
   1) Thread[id=196, name=zkCallback-23-thread-2, state=TIMED_WAITING, group=TGRP-HdfsBasicDistributedZk2Test]
        at java.base@11.0.16.1/jdk.internal.misc.Unsafe.park(Native Method)
        at java.base@11.0.16.1/java.util.concurrent.locks.LockSupport.parkNanos(LockSupport.java:234)
        at java.base@11.0.16.1/java.util.concurrent.SynchronousQueue$TransferStack.awaitFulfill(SynchronousQueue.java:462)
        at java.base@11.0.16.1/java.util.concurrent.SynchronousQueue$TransferStack.transfer(SynchronousQueue.java:361)
        at java.base@11.0.16.1/java.util.concurrent.SynchronousQueue.poll(SynchronousQueue.java:937)
        at java.base@11.0.16.1/java.util.concurrent.ThreadPoolExecutor.getTask(ThreadPoolExecutor.java:1053)
        at java.base@11.0.16.1/java.util.concurrent.ThreadPoolExecutor.runWorker(ThreadPoolExecutor.java:1114)
        at java.base@11.0.16.1/java.util.concurrent.ThreadPoolExecutor$Worker.run(ThreadPoolExecutor.java:628)
        at java.base@11.0.16.1/java.lang.Thread.run(Thread.java:829)
   2) Thread[id=166, name=TEST-HdfsBasicDistributedZk2Test.test-seed#[48E34A1FF4C72CE2]-SendThread(127.0.0.1:43711), state=TIMED_WAITING, group=TGRP-HdfsBasicDistributedZk2Test]
        at java.base@11.0.16.1/java.lang.Thread.sleep(Native Method)
        at app//org.apache.zookeeper.ClientCnxn$SendThread.startConnect(ClientCnxn.java:1136)
        at app//org.apache.zookeeper.ClientCnxn$SendThread.run(ClientCnxn.java:1200)
   3) Thread[id=197, name=zkCallback-23-thread-3, state=TIMED_WAITING, group=TGRP-HdfsBasicDistributedZk2Test]
        at java.base@11.0.16.1/jdk.internal.misc.Unsafe.park(Native Method)
        at java.base@11.0.16.1/java.util.concurrent.locks.LockSupport.parkNanos(LockSupport.java:234)
        at java.base@11.0.16.1/java.util.concurrent.SynchronousQueue$TransferStack.awaitFulfill(SynchronousQueue.java:462)
        at java.base@11.0.16.1/java.util.concurrent.SynchronousQueue$TransferStack.transfer(SynchronousQueue.java:361)
        at java.base@11.0.16.1/java.util.concurrent.SynchronousQueue.poll(SynchronousQueue.java:937)
        at java.base@11.0.16.1/java.util.concurrent.ThreadPoolExecutor.getTask(ThreadPoolExecutor.java:1053)
        at java.base@11.0.16.1/java.util.concurrent.ThreadPoolExecutor.runWorker(ThreadPoolExecutor.java:1114)
        at java.base@11.0.16.1/java.util.concurrent.ThreadPoolExecutor$Worker.run(ThreadPoolExecutor.java:628)
        at java.base@11.0.16.1/java.lang.Thread.run(Thread.java:829)
   4) Thread[id=151, name=qtp1024864234-151, state=TIMED_WAITING, group=TGRP-HdfsBasicDistributedZk2Test]
        at java.base@11.0.16.1/jdk.internal.misc.Unsafe.park(Native Method)
        at java.base@11.0.16.1/java.util.concurrent.locks.LockSupport.parkNanos(LockSupport.java:234)
        at java.base@11.0.16.1/java.util.concurrent.locks.AbstractQueuedSynchronizer$ConditionObject.awaitNanos(AbstractQueuedSynchronizer.java:2123)
        at app//org.eclipse.jetty.util.BlockingArrayQueue.poll(BlockingArrayQueue.java:382)
        at app//org.eclipse.jetty.util.thread.QueuedThreadPool$Runner.idleJobPoll(QueuedThreadPool.java:974)
        at app//org.eclipse.jetty.util.thread.QueuedThreadPool$Runner.run(QueuedThreadPool.java:1018)
        at java.base@11.0.16.1/java.lang.Thread.run(Thread.java:829)
   5) Thread[id=168, name=zkConnectionManagerCallback-24-thread-1, state=WAITING, group=TGRP-HdfsBasicDistributedZk2Test]
        at java.base@11.0.16.1/jdk.internal.misc.Unsafe.park(Native Method)
        at java.base@11.0.16.1/java.util.concurrent.locks.LockSupport.park(LockSupport.java:194)
        at java.base@11.0.16.1/java.util.concurrent.locks.AbstractQueuedSynchronizer$ConditionObject.await(AbstractQueuedSynchronizer.java:2081)
        at java.base@11.0.16.1/java.util.concurrent.LinkedBlockingQueue.take(LinkedBlockingQueue.java:433)
        at java.base@11.0.16.1/java.util.concurrent.ThreadPoolExecutor.getTask(ThreadPoolExecutor.java:1054)
        at java.base@11.0.16.1/java.util.concurrent.ThreadPoolExecutor.runWorker(ThreadPoolExecutor.java:1114)
        at java.base@11.0.16.1/java.util.concurrent.ThreadPoolExecutor$Worker.run(ThreadPoolExecutor.java:628)
        at java.base@11.0.16.1/java.lang.Thread.run(Thread.java:829)
   6) Thread[id=173, name=coreContainerWorkExecutor-14-thread-1, state=TIMED_WAITING, group=TGRP-HdfsBasicDistributedZk2Test]
        at java.base@11.0.16.1/jdk.internal.misc.Unsafe.park(Native Method)
        at java.base@11.0.16.1/java.util.concurrent.locks.LockSupport.parkNanos(LockSupport.java:234)
        at java.base@11.0.16.1/java.util.concurrent.SynchronousQueue$TransferStack.awaitFulfill(SynchronousQueue.java:462)
        at java.base@11.0.16.1/java.util.concurrent.SynchronousQueue$TransferStack.transfer(SynchronousQueue.java:361)
        at java.base@11.0.16.1/java.util.concurrent.SynchronousQueue.poll(SynchronousQueue.java:937)
        at java.base@11.0.16.1/java.util.concurrent.ThreadPoolExecutor.getTask(ThreadPoolExecutor.java:1053)
        at java.base@11.0.16.1/java.util.concurrent.ThreadPoolExecutor.runWorker(ThreadPoolExecutor.java:1114)
        at java.base@11.0.16.1/java.util.concurrent.ThreadPoolExecutor$Worker.run(ThreadPoolExecutor.java:628)
        at java.base@11.0.16.1/java.lang.Thread.run(Thread.java:829)
   7) Thread[id=148, name=qtp1024864234-148, state=RUNNABLE, group=TGRP-HdfsBasicDistributedZk2Test]
        at java.base@11.0.16.1/sun.nio.ch.EPoll.wait(Native Method)
        at java.base@11.0.16.1/sun.nio.ch.EPollSelectorImpl.doSelect(EPollSelectorImpl.java:120)
        at java.base@11.0.16.1/sun.nio.ch.SelectorImpl.lockAndDoSelect(SelectorImpl.java:124)
        at java.base@11.0.16.1/sun.nio.ch.SelectorImpl.select(SelectorImpl.java:141)
        at app//org.eclipse.jetty.io.ManagedSelector.nioSelect(ManagedSelector.java:183)
        at app//org.eclipse.jetty.io.ManagedSelector.select(ManagedSelector.java:190)
        at app//org.eclipse.jetty.io.ManagedSelector$SelectorProducer.select(ManagedSelector.java:606)
        at app//org.eclipse.jetty.io.ManagedSelector$SelectorProducer.produce(ManagedSelector.java:543)
        at app//org.eclipse.jetty.util.thread.strategy.EatWhatYouKill.produceTask(EatWhatYouKill.java:362)
        at app//org.eclipse.jetty.util.thread.strategy.EatWhatYouKill.doProduce(EatWhatYouKill.java:186)
        at app//org.eclipse.jetty.util.thread.strategy.EatWhatYouKill.tryProduce(EatWhatYouKill.java:173)
        at app//org.eclipse.jetty.util.thread.strategy.EatWhatYouKill.produce(EatWhatYouKill.java:137)
        at app//org.eclipse.jetty.io.ManagedSelector$$Lambda$357/0x000000010085cc40.run(Unknown Source)
        at app//org.eclipse.jetty.util.thread.QueuedThreadPool.runJob(QueuedThreadPool.java:883)
        at app//org.eclipse.jetty.util.thread.QueuedThreadPool$Runner.run(QueuedThreadPool.java:1034)
        at java.base@11.0.16.1/java.lang.Thread.run(Thread.java:829)
   8) Thread[id=198, name=zkCallback-23-thread-4, state=TIMED_WAITING, group=TGRP-HdfsBasicDistributedZk2Test]
        at java.base@11.0.16.1/jdk.internal.misc.Unsafe.park(Native Method)
        at java.base@11.0.16.1/java.util.concurrent.locks.LockSupport.parkNanos(LockSupport.java:234)
        at java.base@11.0.16.1/java.util.concurrent.SynchronousQueue$TransferStack.awaitFulfill(SynchronousQueue.java:462)
        at java.base@11.0.16.1/java.util.concurrent.SynchronousQueue$TransferStack.transfer(SynchronousQueue.java:361)
        at java.base@11.0.16.1/java.util.concurrent.SynchronousQueue.poll(SynchronousQueue.java:937)
        at java.base@11.0.16.1/java.util.concurrent.ThreadPoolExecutor.getTask(ThreadPoolExecutor.java:1053)
        at java.base@11.0.16.1/java.util.concurrent.ThreadPoolExecutor.runWorker(ThreadPoolExecutor.java:1114)
        at java.base@11.0.16.1/java.util.concurrent.ThreadPoolExecutor$Worker.run(ThreadPoolExecutor.java:628)
        at java.base@11.0.16.1/java.lang.Thread.run(Thread.java:829)
   9) Thread[id=162, name=h2sc-19-thread-1, state=RUNNABLE, group=TGRP-HdfsBasicDistributedZk2Test]
        at java.base@11.0.16.1/sun.nio.ch.EPoll.wait(Native Method)
        at java.base@11.0.16.1/sun.nio.ch.EPollSelectorImpl.doSelect(EPollSelectorImpl.java:120)
        at java.base@11.0.16.1/sun.nio.ch.SelectorImpl.lockAndDoSelect(SelectorImpl.java:124)
        at java.base@11.0.16.1/sun.nio.ch.SelectorImpl.select(SelectorImpl.java:141)
        at app//org.eclipse.jetty.io.ManagedSelector.nioSelect(ManagedSelector.java:183)
        at app//org.eclipse.jetty.io.ManagedSelector.select(ManagedSelector.java:190)
        at app//org.eclipse.jetty.io.ManagedSelector$SelectorProducer.select(ManagedSelector.java:606)
        at app//org.eclipse.jetty.io.ManagedSelector$SelectorProducer.produce(ManagedSelector.java:543)
        at app//org.eclipse.jetty.util.thread.strategy.EatWhatYouKill.produceTask(EatWhatYouKill.java:362)
        at app//org.eclipse.jetty.util.thread.strategy.EatWhatYouKill.doProduce(EatWhatYouKill.java:186)
        at app//org.eclipse.jetty.util.thread.strategy.EatWhatYouKill.tryProduce(EatWhatYouKill.java:173)
        at app//org.eclipse.jetty.util.thread.strategy.EatWhatYouKill.produce(EatWhatYouKill.java:137)
        at app//org.eclipse.jetty.io.ManagedSelector$$Lambda$357/0x000000010085cc40.run(Unknown Source)
        at app//org.apache.solr.common.util.ExecutorUtil$MDCAwareThreadPoolExecutor.lambda$execute$0(ExecutorUtil.java:271)
        at app//org.apache.solr.common.util.ExecutorUtil$MDCAwareThreadPoolExecutor$$Lambda$321/0x000000010080ec40.run(Unknown Source)
        at java.base@11.0.16.1/java.util.concurrent.ThreadPoolExecutor.runWorker(ThreadPoolExecutor.java:1128)
        at java.base@11.0.16.1/java.util.concurrent.ThreadPoolExecutor$Worker.run(ThreadPoolExecutor.java:628)
        at java.base@11.0.16.1/java.lang.Thread.run(Thread.java:829)
  10) Thread[id=152, name=qtp1024864234-152, state=TIMED_WAITING, group=TGRP-HdfsBasicDistributedZk2Test]
        at java.base@11.0.16.1/jdk.internal.misc.Unsafe.park(Native Method)
        at java.base@11.0.16.1/java.util.concurrent.locks.LockSupport.parkNanos(LockSupport.java:234)
        at java.base@11.0.16.1/java.util.concurrent.locks.AbstractQueuedSynchronizer$ConditionObject.awaitNanos(AbstractQueuedSynchronizer.java:2123)
        at app//org.eclipse.jetty.util.BlockingArrayQueue.poll(BlockingArrayQueue.java:382)
        at app//org.eclipse.jetty.util.thread.QueuedThreadPool$Runner.idleJobPoll(QueuedThreadPool.java:974)
        at app//org.eclipse.jetty.util.thread.QueuedThreadPool$Runner.run(QueuedThreadPool.java:1018)
        at java.base@11.0.16.1/java.lang.Thread.run(Thread.java:829)
  11) Thread[id=172, name=CloserThread, state=WAITING, group=TGRP-HdfsBasicDistributedZk2Test]
        at java.base@11.0.16.1/java.lang.Object.wait(Native Method)
        at java.base@11.0.16.1/java.lang.Object.wait(Object.java:328)
        at app//org.apache.solr.core.CloserThread.run(CoreContainer.java:2506)
  12) Thread[id=171, name=zkCallback-23-thread-1, state=TIMED_WAITING, group=TGRP-HdfsBasicDistributedZk2Test]
        at java.base@11.0.16.1/jdk.internal.misc.Unsafe.park(Native Method)
        at java.base@11.0.16.1/java.util.concurrent.locks.LockSupport.parkNanos(LockSupport.java:234)
        at java.base@11.0.16.1/java.util.concurrent.SynchronousQueue$TransferStack.awaitFulfill(SynchronousQueue.java:462)
        at java.base@11.0.16.1/java.util.concurrent.SynchronousQueue$TransferStack.transfer(SynchronousQueue.java:361)
        at java.base@11.0.16.1/java.util.concurrent.SynchronousQueue.poll(SynchronousQueue.java:937)
        at java.base@11.0.16.1/java.util.concurrent.ThreadPoolExecutor.getTask(ThreadPoolExecutor.java:1053)
        at java.base@11.0.16.1/java.util.concurrent.ThreadPoolExecutor.runWorker(ThreadPoolExecutor.java:1114)
        at java.base@11.0.16.1/java.util.concurrent.ThreadPoolExecutor$Worker.run(ThreadPoolExecutor.java:628)
        at java.base@11.0.16.1/java.lang.Thread.run(Thread.java:829)
  13) Thread[id=159, name=httpShardExecutor-17-thread-1, state=RUNNABLE, group=TGRP-HdfsBasicDistributedZk2Test]
        at java.base@11.0.16.1/sun.nio.ch.EPoll.wait(Native Method)
        at java.base@11.0.16.1/sun.nio.ch.EPollSelectorImpl.doSelect(EPollSelectorImpl.java:120)
        at java.base@11.0.16.1/sun.nio.ch.SelectorImpl.lockAndDoSelect(SelectorImpl.java:124)
        at java.base@11.0.16.1/sun.nio.ch.SelectorImpl.select(SelectorImpl.java:141)
        at app//org.eclipse.jetty.io.ManagedSelector.nioSelect(ManagedSelector.java:183)
        at app//org.eclipse.jetty.io.ManagedSelector.select(ManagedSelector.java:190)
        at app//org.eclipse.jetty.io.ManagedSelector$SelectorProducer.select(ManagedSelector.java:606)
        at app//org.eclipse.jetty.io.ManagedSelector$SelectorProducer.produce(ManagedSelector.java:543)
        at app//org.eclipse.jetty.util.thread.strategy.EatWhatYouKill.produceTask(EatWhatYouKill.java:362)
        at app//org.eclipse.jetty.util.thread.strategy.EatWhatYouKill.doProduce(EatWhatYouKill.java:186)
        at app//org.eclipse.jetty.util.thread.strategy.EatWhatYouKill.tryProduce(EatWhatYouKill.java:173)
        at app//org.eclipse.jetty.util.thread.strategy.EatWhatYouKill.produce(EatWhatYouKill.java:137)
        at app//org.eclipse.jetty.io.ManagedSelector$$Lambda$357/0x000000010085cc40.run(Unknown Source)
        at app//org.apache.solr.common.util.ExecutorUtil$MDCAwareThreadPoolExecutor.lambda$execute$0(ExecutorUtil.java:271)
        at app//org.apache.solr.common.util.ExecutorUtil$MDCAwareThreadPoolExecutor$$Lambda$321/0x000000010080ec40.run(Unknown Source)
        at java.base@11.0.16.1/java.util.

[...truncated too long message...]

servedCodeCacheSize=120m" -Ptests.seed=48E34A1FF4C72CE2 -Ptests.multiplier=2 -Ptests.nightly=true -Ptests.badapples=false -Ptests.file.encoding=US-ASCII -Ptests.linedocsfile=/home/jenkins/jenkins-slave/workspace/Solr/Solr-NightlyTests-main/test-data/enwiki.random.lines.txt

  - org.apache.solr.hdfs.cloud.HdfsBasicDistributedZk2Test.classMethod (:solr:modules:hdfs)
    Test output: /home/jenkins/jenkins-slave/workspace/Solr/Solr-NightlyTests-main/solr/modules/hdfs/property 'outputLocation'/outputs/OUTPUT-org.apache.solr.hdfs.cloud.HdfsBasicDistributedZk2Test.txt
    Reproduce with: gradlew :solr:modules:hdfs:test --tests "org.apache.solr.hdfs.cloud.HdfsBasicDistributedZk2Test.classMethod" -Ptests.jvms=4 -Ptests.haltonfailure=false "-Ptests.jvmargs=-XX:TieredStopAtLevel=1 -XX:ReservedCodeCacheSize=120m" -Ptests.seed=48E34A1FF4C72CE2 -Ptests.multiplier=2 -Ptests.nightly=true -Ptests.badapples=false -Ptests.file.encoding=US-ASCII -Ptests.linedocsfile=/home/jenkins/jenkins-slave/workspace/Solr/Solr-NightlyTests-main/test-data/enwiki.random.lines.txt

  - org.apache.solr.hdfs.cloud.HdfsBasicDistributedZkTest.classMethod (:solr:modules:hdfs)
    Test output: /home/jenkins/jenkins-slave/workspace/Solr/Solr-NightlyTests-main/solr/modules/hdfs/property 'outputLocation'/outputs/OUTPUT-org.apache.solr.hdfs.cloud.HdfsBasicDistributedZkTest.txt
    Reproduce with: gradlew :solr:modules:hdfs:test --tests "org.apache.solr.hdfs.cloud.HdfsBasicDistributedZkTest.classMethod" -Ptests.jvms=4 -Ptests.haltonfailure=false "-Ptests.jvmargs=-XX:TieredStopAtLevel=1 -XX:ReservedCodeCacheSize=120m" -Ptests.seed=48E34A1FF4C72CE2 -Ptests.multiplier=2 -Ptests.nightly=true -Ptests.badapples=false -Ptests.file.encoding=US-ASCII -Ptests.linedocsfile=/home/jenkins/jenkins-slave/workspace/Solr/Solr-NightlyTests-main/test-data/enwiki.random.lines.txt

  - org.apache.solr.hdfs.cloud.HdfsBasicDistributedZkTest.classMethod (:solr:modules:hdfs)
    Test output: /home/jenkins/jenkins-slave/workspace/Solr/Solr-NightlyTests-main/solr/modules/hdfs/property 'outputLocation'/outputs/OUTPUT-org.apache.solr.hdfs.cloud.HdfsBasicDistributedZkTest.txt
    Reproduce with: gradlew :solr:modules:hdfs:test --tests "org.apache.solr.hdfs.cloud.HdfsBasicDistributedZkTest.classMethod" -Ptests.jvms=4 -Ptests.haltonfailure=false "-Ptests.jvmargs=-XX:TieredStopAtLevel=1 -XX:ReservedCodeCacheSize=120m" -Ptests.seed=48E34A1FF4C72CE2 -Ptests.multiplier=2 -Ptests.nightly=true -Ptests.badapples=false -Ptests.file.encoding=US-ASCII -Ptests.linedocsfile=/home/jenkins/jenkins-slave/workspace/Solr/Solr-NightlyTests-main/test-data/enwiki.random.lines.txt

  - org.apache.solr.hdfs.cloud.HdfsChaosMonkeyNothingIsSafeTest.classMethod (:solr:modules:hdfs)
    Test output: /home/jenkins/jenkins-slave/workspace/Solr/Solr-NightlyTests-main/solr/modules/hdfs/property 'outputLocation'/outputs/OUTPUT-org.apache.solr.hdfs.cloud.HdfsChaosMonkeyNothingIsSafeTest.txt
    Reproduce with: gradlew :solr:modules:hdfs:test --tests "org.apache.solr.hdfs.cloud.HdfsChaosMonkeyNothingIsSafeTest.classMethod" -Ptests.jvms=4 -Ptests.haltonfailure=false "-Ptests.jvmargs=-XX:TieredStopAtLevel=1 -XX:ReservedCodeCacheSize=120m" -Ptests.seed=48E34A1FF4C72CE2 -Ptests.multiplier=2 -Ptests.nightly=true -Ptests.badapples=false -Ptests.file.encoding=US-ASCII -Ptests.linedocsfile=/home/jenkins/jenkins-slave/workspace/Solr/Solr-NightlyTests-main/test-data/enwiki.random.lines.txt

  - org.apache.solr.hdfs.cloud.HdfsChaosMonkeyNothingIsSafeTest.classMethod (:solr:modules:hdfs)
    Test output: /home/jenkins/jenkins-slave/workspace/Solr/Solr-NightlyTests-main/solr/modules/hdfs/property 'outputLocation'/outputs/OUTPUT-org.apache.solr.hdfs.cloud.HdfsChaosMonkeyNothingIsSafeTest.txt
    Reproduce with: gradlew :solr:modules:hdfs:test --tests "org.apache.solr.hdfs.cloud.HdfsChaosMonkeyNothingIsSafeTest.classMethod" -Ptests.jvms=4 -Ptests.haltonfailure=false "-Ptests.jvmargs=-XX:TieredStopAtLevel=1 -XX:ReservedCodeCacheSize=120m" -Ptests.seed=48E34A1FF4C72CE2 -Ptests.multiplier=2 -Ptests.nightly=true -Ptests.badapples=false -Ptests.file.encoding=US-ASCII -Ptests.linedocsfile=/home/jenkins/jenkins-slave/workspace/Solr/Solr-NightlyTests-main/test-data/enwiki.random.lines.txt


BUILD SUCCESSFUL in 1h 14m 42s
145 actionable tasks: 145 executed
Build step 'Invoke Gradle script' changed build result to SUCCESS
Archiving artifacts
hudson.FilePath$ValidateAntFileMask$1Cancel
	at hudson.FilePath$ValidateAntFileMask$1.isCaseSensitive(FilePath.java:3209)
	at org.apache.tools.ant.DirectoryScanner.lambda$isIncluded$3(DirectoryScanner.java:1374)
	at java.base/java.util.stream.MatchOps$1MatchSink.accept(MatchOps.java:90)
	at java.base/java.util.Spliterators$ArraySpliterator.tryAdvance(Spliterators.java:958)
	at java.base/java.util.stream.ReferencePipeline.forEachWithCancel(ReferencePipeline.java:127)
	at java.base/java.util.stream.AbstractPipeline.copyIntoWithCancel(AbstractPipeline.java:502)
	at java.base/java.util.stream.AbstractPipeline.copyInto(AbstractPipeline.java:488)
	at java.base/java.util.stream.AbstractPipeline.wrapAndCopyInto(AbstractPipeline.java:474)
	at java.base/java.util.stream.MatchOps$MatchOp.evaluateSequential(MatchOps.java:230)
	at java.base/java.util.stream.MatchOps$MatchOp.evaluateSequential(MatchOps.java:196)
	at java.base/java.util.stream.AbstractPipeline.evaluate(AbstractPipeline.java:234)
	at java.base/java.util.stream.ReferencePipeline.anyMatch(ReferencePipeline.java:528)
	at org.apache.tools.ant.DirectoryScanner.isIncluded(DirectoryScanner.java:1374)
	at org.apache.tools.ant.DirectoryScanner.scandir(DirectoryScanner.java:1241)
	at org.apache.tools.ant.DirectoryScanner.scandir(DirectoryScanner.java:1267)
	at org.apache.tools.ant.DirectoryScanner.scandir(DirectoryScanner.java:1267)
	at org.apache.tools.ant.DirectoryScanner.scandir(DirectoryScanner.java:1267)
	at org.apache.tools.ant.DirectoryScanner.scandir(DirectoryScanner.java:1267)
	at org.apache.tools.ant.DirectoryScanner.scandir(DirectoryScanner.java:1194)
	at org.apache.tools.ant.DirectoryScanner.scandir(DirectoryScanner.java:1156)
	at org.apache.tools.ant.DirectoryScanner.checkIncludePatterns(DirectoryScanner.java:954)
	at org.apache.tools.ant.DirectoryScanner.scan(DirectoryScanner.java:912)
	at hudson.FilePath$ValidateAntFileMask.hasMatch(FilePath.java:3222)
Caused: java.lang.InterruptedException: no matches found within 10000
	at hudson.FilePath$ValidateAntFileMask.hasMatch(FilePath.java:3227)
	at hudson.FilePath$ValidateAntFileMask.invoke(FilePath.java:3105)
	at hudson.FilePath$ValidateAntFileMask.invoke(FilePath.java:3083)
	at hudson.FilePath$FileCallableWrapper.call(FilePath.java:3487)
Also:   hudson.remoting.Channel$CallSiteStackTrace: Remote call to lucene-solr-1
		at hudson.remoting.Channel.attachCallSiteStackTrace(Channel.java:1784)
		at hudson.remoting.UserRequest$ExceptionResponse.retrieve(UserRequest.java:356)
		at hudson.remoting.Channel.call(Channel.java:1000)
		at hudson.FilePath.act(FilePath.java:1194)
		at hudson.FilePath.act(FilePath.java:1183)
		at hudson.FilePath.validateAntFileMask(FilePath.java:3080)
		at hudson.tasks.ArtifactArchiver.perform(ArtifactArchiver.java:269)
		at hudson.tasks.BuildStepCompatibilityLayer.perform(BuildStepCompatibilityLayer.java:79)
		at hudson.tasks.BuildStepMonitor$1.perform(BuildStepMonitor.java:20)
		at hudson.model.AbstractBuild$AbstractBuildExecution.perform(AbstractBuild.java:814)
		at hudson.model.AbstractBuild$AbstractBuildExecution.performAllBuildSteps(AbstractBuild.java:763)
		at hudson.model.Build$BuildExecution.post2(Build.java:179)
		at hudson.model.AbstractBuild$AbstractBuildExecution.post(AbstractBuild.java:707)
		at hudson.model.Run.execute(Run.java:1921)
		at hudson.model.FreeStyleBuild.run(FreeStyleBuild.java:44)
		at hudson.model.ResourceController.execute(ResourceController.java:101)
		at hudson.model.Executor.run(Executor.java:442)
Caused: hudson.FilePath$TunneledInterruptedException
	at hudson.FilePath$FileCallableWrapper.call(FilePath.java:3489)
	at hudson.remoting.UserRequest.perform(UserRequest.java:211)
	at hudson.remoting.UserRequest.perform(UserRequest.java:54)
	at hudson.remoting.Request$2.run(Request.java:376)
	at hudson.remoting.InterceptingExecutorService.lambda$wrap$0(InterceptingExecutorService.java:78)
	at java.base/java.util.concurrent.FutureTask.run(FutureTask.java:264)
	at java.base/java.util.concurrent.ThreadPoolExecutor.runWorker(ThreadPoolExecutor.java:1128)
	at java.base/java.util.concurrent.ThreadPoolExecutor$Worker.run(ThreadPoolExecutor.java:628)
	at java.base/java.lang.Thread.run(Thread.java:829)
Caused: java.lang.InterruptedException: java.lang.InterruptedException: no matches found within 10000
	at hudson.FilePath.act(FilePath.java:1196)
	at hudson.FilePath.act(FilePath.java:1183)
	at hudson.FilePath.validateAntFileMask(FilePath.java:3080)
	at hudson.tasks.ArtifactArchiver.perform(ArtifactArchiver.java:269)
	at hudson.tasks.BuildStepCompatibilityLayer.perform(BuildStepCompatibilityLayer.java:79)
	at hudson.tasks.BuildStepMonitor$1.perform(BuildStepMonitor.java:20)
	at hudson.model.AbstractBuild$AbstractBuildExecution.perform(AbstractBuild.java:814)
	at hudson.model.AbstractBuild$AbstractBuildExecution.performAllBuildSteps(AbstractBuild.java:763)
	at hudson.model.Build$BuildExecution.post2(Build.java:179)
	at hudson.model.AbstractBuild$AbstractBuildExecution.post(AbstractBuild.java:707)
	at hudson.model.Run.execute(Run.java:1921)
	at hudson.model.FreeStyleBuild.run(FreeStyleBuild.java:44)
	at hudson.model.ResourceController.execute(ResourceController.java:101)
	at hudson.model.Executor.run(Executor.java:442)
No artifacts found that match the file pattern "**/*.events,heapdumps/**,**/hs_err_pid*". Configuration error?
Recording test results
[Checks API] No suitable checks publisher found.
Build step 'Publish JUnit test result report' changed build result to UNSTABLE
Email was triggered for: Unstable (Test Failures)
Sending email for trigger: Unstable (Test Failures)

[JENKINS] Solr » Solr-NightlyTests-main - Build # 578 - Still Unstable!

Posted by Apache Jenkins Server <je...@builds.apache.org>.
Build: https://ci-builds.apache.org/job/Solr/job/Solr-NightlyTests-main/578/

1 tests failed.
FAILED:  org.apache.solr.handler.component.TestDistributedStatsComponentCardinality.test

Error Message:
com.carrotsearch.randomizedtesting.UncaughtExceptionError: Captured an uncaught exception in thread: Thread[id=35254, name=StressRunner, state=RUNNABLE, group=TGRP-TestDistributedStatsComponentCardinality]

Stack Trace:
com.carrotsearch.randomizedtesting.UncaughtExceptionError: Captured an uncaught exception in thread: Thread[id=35254, name=StressRunner, state=RUNNABLE, group=TGRP-TestDistributedStatsComponentCardinality]
	at __randomizedtesting.SeedInfo.seed([9569BF48BC21A639:1D3D809212DDCBC1]:0)
Caused by: org.apache.solr.client.solrj.impl.BaseHttpSolrClient$RemoteSolrException: Error from server at http://127.0.0.1:46187/_hfq/g/collection1: org.apache.solr.client.solrj.SolrServerException: Total timeout 15000 ms elapsed
	at __randomizedtesting.SeedInfo.seed([9569BF48BC21A639]:0)
	at app//org.apache.solr.client.solrj.impl.HttpSolrClient.executeMethod(HttpSolrClient.java:720)
	at app//org.apache.solr.client.solrj.impl.HttpSolrClient.request(HttpSolrClient.java:234)
	at app//org.apache.solr.client.solrj.impl.HttpSolrClient.request(HttpSolrClient.java:215)
	at app//org.apache.solr.client.solrj.SolrRequest.process(SolrRequest.java:234)
	at app//org.apache.solr.client.solrj.SolrClient.query(SolrClient.java:927)
	at app//org.apache.solr.client.solrj.SolrClient.query(SolrClient.java:940)
	at app//org.apache.solr.BaseDistributedSearchTestCase.lambda$query$4(BaseDistributedSearchTestCase.java:755)
	at java.base@11.0.16.1/java.lang.Thread.run(Thread.java:829)




Build Log:
[...truncated 31759 lines...]
ERROR: The following test(s) have failed:
  - org.apache.solr.handler.component.TestDistributedStatsComponentCardinality.test (:solr:core)
    Test output: /home/jenkins/jenkins-slave/workspace/Solr/Solr-NightlyTests-main/solr/core/build/test-results/test/outputs/OUTPUT-org.apache.solr.handler.component.TestDistributedStatsComponentCardinality.txt
    Reproduce with: gradlew :solr:core:test --tests "org.apache.solr.handler.component.TestDistributedStatsComponentCardinality.test" -Ptests.jvms=4 -Ptests.haltonfailure=false "-Ptests.jvmargs=-XX:TieredStopAtLevel=1 -XX:ReservedCodeCacheSize=120m" -Ptests.seed=9569BF48BC21A639 -Ptests.multiplier=2 -Ptests.nightly=true -Ptests.badapples=false -Ptests.file.encoding=ISO-8859-1 -Ptests.linedocsfile=/home/jenkins/jenkins-slave/workspace/Solr/Solr-NightlyTests-main/test-data/enwiki.random.lines.txt


Deprecated Gradle features were used in this build, making it incompatible with Gradle 8.0.

You can use '--warning-mode all' to show the individual deprecation warnings and determine if they come from your own scripts or plugins.

See https://docs.gradle.org/7.2/userguide/command_line_interface.html#sec:command_line_warnings

BUILD SUCCESSFUL in 1h 56m 33s
126 actionable tasks: 100 executed, 26 up-to-date
Build step 'Invoke Gradle script' changed build result to SUCCESS
Archiving artifacts
hudson.FilePath$ValidateAntFileMask$1Cancel
	at hudson.FilePath$ValidateAntFileMask$1.isCaseSensitive(FilePath.java:3209)
	at org.apache.tools.ant.DirectoryScanner.isIncluded(DirectoryScanner.java:1370)
	at org.apache.tools.ant.DirectoryScanner.scandir(DirectoryScanner.java:1241)
	at org.apache.tools.ant.DirectoryScanner.scandir(DirectoryScanner.java:1267)
	at org.apache.tools.ant.DirectoryScanner.scandir(DirectoryScanner.java:1267)
	at org.apache.tools.ant.DirectoryScanner.scandir(DirectoryScanner.java:1267)
	at org.apache.tools.ant.DirectoryScanner.scandir(DirectoryScanner.java:1267)
	at org.apache.tools.ant.DirectoryScanner.scandir(DirectoryScanner.java:1267)
	at org.apache.tools.ant.DirectoryScanner.scandir(DirectoryScanner.java:1194)
	at org.apache.tools.ant.DirectoryScanner.scandir(DirectoryScanner.java:1156)
	at org.apache.tools.ant.DirectoryScanner.checkIncludePatterns(DirectoryScanner.java:954)
	at org.apache.tools.ant.DirectoryScanner.scan(DirectoryScanner.java:912)
	at hudson.FilePath$ValidateAntFileMask.hasMatch(FilePath.java:3222)
Caused: java.lang.InterruptedException: no matches found within 10000
	at hudson.FilePath$ValidateAntFileMask.hasMatch(FilePath.java:3227)
	at hudson.FilePath$ValidateAntFileMask.invoke(FilePath.java:3105)
	at hudson.FilePath$ValidateAntFileMask.invoke(FilePath.java:3083)
	at hudson.FilePath$FileCallableWrapper.call(FilePath.java:3487)
Also:   hudson.remoting.Channel$CallSiteStackTrace: Remote call to lucene-solr-1
		at hudson.remoting.Channel.attachCallSiteStackTrace(Channel.java:1784)
		at hudson.remoting.UserRequest$ExceptionResponse.retrieve(UserRequest.java:356)
		at hudson.remoting.Channel.call(Channel.java:1000)
		at hudson.FilePath.act(FilePath.java:1194)
		at hudson.FilePath.act(FilePath.java:1183)
		at hudson.FilePath.validateAntFileMask(FilePath.java:3080)
		at hudson.tasks.ArtifactArchiver.perform(ArtifactArchiver.java:269)
		at hudson.tasks.BuildStepCompatibilityLayer.perform(BuildStepCompatibilityLayer.java:79)
		at hudson.tasks.BuildStepMonitor$1.perform(BuildStepMonitor.java:20)
		at hudson.model.AbstractBuild$AbstractBuildExecution.perform(AbstractBuild.java:814)
		at hudson.model.AbstractBuild$AbstractBuildExecution.performAllBuildSteps(AbstractBuild.java:763)
		at hudson.model.Build$BuildExecution.post2(Build.java:179)
		at hudson.model.AbstractBuild$AbstractBuildExecution.post(AbstractBuild.java:707)
		at hudson.model.Run.execute(Run.java:1921)
		at hudson.model.FreeStyleBuild.run(FreeStyleBuild.java:44)
		at hudson.model.ResourceController.execute(ResourceController.java:101)
		at hudson.model.Executor.run(Executor.java:442)
Caused: hudson.FilePath$TunneledInterruptedException
	at hudson.FilePath$FileCallableWrapper.call(FilePath.java:3489)
	at hudson.remoting.UserRequest.perform(UserRequest.java:211)
	at hudson.remoting.UserRequest.perform(UserRequest.java:54)
	at hudson.remoting.Request$2.run(Request.java:376)
	at hudson.remoting.InterceptingExecutorService.lambda$wrap$0(InterceptingExecutorService.java:78)
	at java.base/java.util.concurrent.FutureTask.run(FutureTask.java:264)
	at java.base/java.util.concurrent.ThreadPoolExecutor.runWorker(ThreadPoolExecutor.java:1128)
	at java.base/java.util.concurrent.ThreadPoolExecutor$Worker.run(ThreadPoolExecutor.java:628)
	at java.base/java.lang.Thread.run(Thread.java:829)
Caused: java.lang.InterruptedException: java.lang.InterruptedException: no matches found within 10000
	at hudson.FilePath.act(FilePath.java:1196)
	at hudson.FilePath.act(FilePath.java:1183)
	at hudson.FilePath.validateAntFileMask(FilePath.java:3080)
	at hudson.tasks.ArtifactArchiver.perform(ArtifactArchiver.java:269)
	at hudson.tasks.BuildStepCompatibilityLayer.perform(BuildStepCompatibilityLayer.java:79)
	at hudson.tasks.BuildStepMonitor$1.perform(BuildStepMonitor.java:20)
	at hudson.model.AbstractBuild$AbstractBuildExecution.perform(AbstractBuild.java:814)
	at hudson.model.AbstractBuild$AbstractBuildExecution.performAllBuildSteps(AbstractBuild.java:763)
	at hudson.model.Build$BuildExecution.post2(Build.java:179)
	at hudson.model.AbstractBuild$AbstractBuildExecution.post(AbstractBuild.java:707)
	at hudson.model.Run.execute(Run.java:1921)
	at hudson.model.FreeStyleBuild.run(FreeStyleBuild.java:44)
	at hudson.model.ResourceController.execute(ResourceController.java:101)
	at hudson.model.Executor.run(Executor.java:442)
No artifacts found that match the file pattern "**/*.events,heapdumps/**,**/hs_err_pid*". Configuration error?
Recording test results
[Checks API] No suitable checks publisher found.
Build step 'Publish JUnit test result report' changed build result to UNSTABLE
Email was triggered for: Unstable (Test Failures)
Sending email for trigger: Unstable (Test Failures)

[JENKINS] Solr » Solr-NightlyTests-main - Build # 577 - Still Unstable!

Posted by Apache Jenkins Server <je...@builds.apache.org>.
Build: https://ci-builds.apache.org/job/Solr/job/Solr-NightlyTests-main/577/

1 tests failed.
FAILED:  org.apache.solr.handler.component.TestDistributedStatsComponentCardinality.test

Error Message:
com.carrotsearch.randomizedtesting.UncaughtExceptionError: Captured an uncaught exception in thread: Thread[id=1780, name=StressRunner, state=RUNNABLE, group=TGRP-TestDistributedStatsComponentCardinality]

Stack Trace:
com.carrotsearch.randomizedtesting.UncaughtExceptionError: Captured an uncaught exception in thread: Thread[id=1780, name=StressRunner, state=RUNNABLE, group=TGRP-TestDistributedStatsComponentCardinality]
	at __randomizedtesting.SeedInfo.seed([4201426ED22C7A53:CA557DB47CD017AB]:0)
Caused by: org.apache.solr.client.solrj.impl.BaseHttpSolrClient$RemoteSolrException: Error from server at http://127.0.0.1:44685/collection1: org.apache.solr.client.solrj.SolrServerException: Total timeout 15000 ms elapsed
	at __randomizedtesting.SeedInfo.seed([4201426ED22C7A53]:0)
	at app//org.apache.solr.client.solrj.impl.HttpSolrClient.executeMethod(HttpSolrClient.java:720)
	at app//org.apache.solr.client.solrj.impl.HttpSolrClient.request(HttpSolrClient.java:234)
	at app//org.apache.solr.client.solrj.impl.HttpSolrClient.request(HttpSolrClient.java:215)
	at app//org.apache.solr.client.solrj.SolrRequest.process(SolrRequest.java:234)
	at app//org.apache.solr.client.solrj.SolrClient.query(SolrClient.java:927)
	at app//org.apache.solr.client.solrj.SolrClient.query(SolrClient.java:940)
	at app//org.apache.solr.BaseDistributedSearchTestCase.lambda$query$4(BaseDistributedSearchTestCase.java:755)
	at java.base@11.0.16.1/java.lang.Thread.run(Thread.java:829)




Build Log:
[...truncated 32077 lines...]
ERROR: The following test(s) have failed:
  - org.apache.solr.handler.component.TestDistributedStatsComponentCardinality.test (:solr:core)
    Test output: /home/jenkins/jenkins-slave/workspace/Solr/Solr-NightlyTests-main/solr/core/build/test-results/test/outputs/OUTPUT-org.apache.solr.handler.component.TestDistributedStatsComponentCardinality.txt
    Reproduce with: gradlew :solr:core:test --tests "org.apache.solr.handler.component.TestDistributedStatsComponentCardinality.test" -Ptests.jvms=4 -Ptests.haltonfailure=false "-Ptests.jvmargs=-XX:TieredStopAtLevel=1 -XX:ReservedCodeCacheSize=120m" -Ptests.seed=4201426ED22C7A53 -Ptests.multiplier=2 -Ptests.nightly=true -Ptests.badapples=false -Ptests.file.encoding=ISO-8859-1 -Ptests.linedocsfile=/home/jenkins/jenkins-slave/workspace/Solr/Solr-NightlyTests-main/test-data/enwiki.random.lines.txt


Deprecated Gradle features were used in this build, making it incompatible with Gradle 8.0.

You can use '--warning-mode all' to show the individual deprecation warnings and determine if they come from your own scripts or plugins.

See https://docs.gradle.org/7.2/userguide/command_line_interface.html#sec:command_line_warnings

BUILD SUCCESSFUL in 1h 43m 10s
126 actionable tasks: 102 executed, 24 up-to-date
Build step 'Invoke Gradle script' changed build result to SUCCESS
Archiving artifacts
hudson.FilePath$ValidateAntFileMask$1Cancel
	at hudson.FilePath$ValidateAntFileMask$1.isCaseSensitive(FilePath.java:3209)
	at org.apache.tools.ant.DirectoryScanner.lambda$isIncluded$3(DirectoryScanner.java:1374)
	at java.base/java.util.stream.MatchOps$1MatchSink.accept(MatchOps.java:90)
	at java.base/java.util.Spliterators$ArraySpliterator.tryAdvance(Spliterators.java:958)
	at java.base/java.util.stream.ReferencePipeline.forEachWithCancel(ReferencePipeline.java:127)
	at java.base/java.util.stream.AbstractPipeline.copyIntoWithCancel(AbstractPipeline.java:502)
	at java.base/java.util.stream.AbstractPipeline.copyInto(AbstractPipeline.java:488)
	at java.base/java.util.stream.AbstractPipeline.wrapAndCopyInto(AbstractPipeline.java:474)
	at java.base/java.util.stream.MatchOps$MatchOp.evaluateSequential(MatchOps.java:230)
	at java.base/java.util.stream.MatchOps$MatchOp.evaluateSequential(MatchOps.java:196)
	at java.base/java.util.stream.AbstractPipeline.evaluate(AbstractPipeline.java:234)
	at java.base/java.util.stream.ReferencePipeline.anyMatch(ReferencePipeline.java:528)
	at org.apache.tools.ant.DirectoryScanner.isIncluded(DirectoryScanner.java:1374)
	at org.apache.tools.ant.DirectoryScanner.scandir(DirectoryScanner.java:1241)
	at org.apache.tools.ant.DirectoryScanner.scandir(DirectoryScanner.java:1267)
	at org.apache.tools.ant.DirectoryScanner.scandir(DirectoryScanner.java:1267)
	at org.apache.tools.ant.DirectoryScanner.scandir(DirectoryScanner.java:1267)
	at org.apache.tools.ant.DirectoryScanner.scandir(DirectoryScanner.java:1267)
	at org.apache.tools.ant.DirectoryScanner.scandir(DirectoryScanner.java:1267)
	at org.apache.tools.ant.DirectoryScanner.scandir(DirectoryScanner.java:1267)
	at org.apache.tools.ant.DirectoryScanner.scandir(DirectoryScanner.java:1267)
	at org.apache.tools.ant.DirectoryScanner.scandir(DirectoryScanner.java:1267)
	at org.apache.tools.ant.DirectoryScanner.scandir(DirectoryScanner.java:1267)
	at org.apache.tools.ant.DirectoryScanner.scandir(DirectoryScanner.java:1194)
	at org.apache.tools.ant.DirectoryScanner.scandir(DirectoryScanner.java:1156)
	at org.apache.tools.ant.DirectoryScanner.checkIncludePatterns(DirectoryScanner.java:954)
	at org.apache.tools.ant.DirectoryScanner.scan(DirectoryScanner.java:912)
	at hudson.FilePath$ValidateAntFileMask.hasMatch(FilePath.java:3222)
Caused: java.lang.InterruptedException: no matches found within 10000
	at hudson.FilePath$ValidateAntFileMask.hasMatch(FilePath.java:3227)
	at hudson.FilePath$ValidateAntFileMask.invoke(FilePath.java:3105)
	at hudson.FilePath$ValidateAntFileMask.invoke(FilePath.java:3083)
	at hudson.FilePath$FileCallableWrapper.call(FilePath.java:3487)
Also:   hudson.remoting.Channel$CallSiteStackTrace: Remote call to lucene-solr-2
		at hudson.remoting.Channel.attachCallSiteStackTrace(Channel.java:1784)
		at hudson.remoting.UserRequest$ExceptionResponse.retrieve(UserRequest.java:356)
		at hudson.remoting.Channel.call(Channel.java:1000)
		at hudson.FilePath.act(FilePath.java:1194)
		at hudson.FilePath.act(FilePath.java:1183)
		at hudson.FilePath.validateAntFileMask(FilePath.java:3080)
		at hudson.tasks.ArtifactArchiver.perform(ArtifactArchiver.java:269)
		at hudson.tasks.BuildStepCompatibilityLayer.perform(BuildStepCompatibilityLayer.java:79)
		at hudson.tasks.BuildStepMonitor$1.perform(BuildStepMonitor.java:20)
		at hudson.model.AbstractBuild$AbstractBuildExecution.perform(AbstractBuild.java:814)
		at hudson.model.AbstractBuild$AbstractBuildExecution.performAllBuildSteps(AbstractBuild.java:763)
		at hudson.model.Build$BuildExecution.post2(Build.java:179)
		at hudson.model.AbstractBuild$AbstractBuildExecution.post(AbstractBuild.java:707)
		at hudson.model.Run.execute(Run.java:1921)
		at hudson.model.FreeStyleBuild.run(FreeStyleBuild.java:44)
		at hudson.model.ResourceController.execute(ResourceController.java:101)
		at hudson.model.Executor.run(Executor.java:442)
Caused: hudson.FilePath$TunneledInterruptedException
	at hudson.FilePath$FileCallableWrapper.call(FilePath.java:3489)
	at hudson.remoting.UserRequest.perform(UserRequest.java:211)
	at hudson.remoting.UserRequest.perform(UserRequest.java:54)
	at hudson.remoting.Request$2.run(Request.java:376)
	at hudson.remoting.InterceptingExecutorService.lambda$wrap$0(InterceptingExecutorService.java:78)
	at java.base/java.util.concurrent.FutureTask.run(FutureTask.java:264)
	at java.base/java.util.concurrent.ThreadPoolExecutor.runWorker(ThreadPoolExecutor.java:1128)
	at java.base/java.util.concurrent.ThreadPoolExecutor$Worker.run(ThreadPoolExecutor.java:628)
	at java.base/java.lang.Thread.run(Thread.java:829)
Caused: java.lang.InterruptedException: java.lang.InterruptedException: no matches found within 10000
	at hudson.FilePath.act(FilePath.java:1196)
	at hudson.FilePath.act(FilePath.java:1183)
	at hudson.FilePath.validateAntFileMask(FilePath.java:3080)
	at hudson.tasks.ArtifactArchiver.perform(ArtifactArchiver.java:269)
	at hudson.tasks.BuildStepCompatibilityLayer.perform(BuildStepCompatibilityLayer.java:79)
	at hudson.tasks.BuildStepMonitor$1.perform(BuildStepMonitor.java:20)
	at hudson.model.AbstractBuild$AbstractBuildExecution.perform(AbstractBuild.java:814)
	at hudson.model.AbstractBuild$AbstractBuildExecution.performAllBuildSteps(AbstractBuild.java:763)
	at hudson.model.Build$BuildExecution.post2(Build.java:179)
	at hudson.model.AbstractBuild$AbstractBuildExecution.post(AbstractBuild.java:707)
	at hudson.model.Run.execute(Run.java:1921)
	at hudson.model.FreeStyleBuild.run(FreeStyleBuild.java:44)
	at hudson.model.ResourceController.execute(ResourceController.java:101)
	at hudson.model.Executor.run(Executor.java:442)
No artifacts found that match the file pattern "**/*.events,heapdumps/**,**/hs_err_pid*". Configuration error?
Recording test results
[Checks API] No suitable checks publisher found.
Build step 'Publish JUnit test result report' changed build result to UNSTABLE
Email was triggered for: Unstable (Test Failures)
Sending email for trigger: Unstable (Test Failures)