You are viewing a plain text version of this content. The canonical link for it is here.
Posted to builds@solr.apache.org by Policeman Jenkins Server <je...@thetaphi.de> on 2021/05/08 09:30:03 UTC

[JENKINS] Lucene-Solr-8.x-Linux (64bit/jdk-15) - Build # 6557 - Unstable!

Build: https://jenkins.thetaphi.de/job/Lucene-Solr-8.x-Linux/6557/
Java: 64bit/jdk-15 -XX:-UseCompressedOops -XX:+UseParallelGC

1 tests failed.
FAILED:  org.apache.solr.cloud.api.collections.ShardSplitTest.testSplitStaticIndexReplicationLink

Error Message:
Timeout waiting to see state for collection=testSplitStaticIndexReplication_link :DocCollection(testSplitStaticIndexReplication_link//collections/testSplitStaticIndexReplication_link/state.json/12 {/collections/testSplitStaticIndexReplication_link/state.json/[50]: [core_node2:6:D:L, core_node6:6:A:L, core_node8:2:A, core_node5:6:D:L]})={   "pullReplicas":"0",   "replicationFactor":"1",   "shards":{     "shard1_1":{       "range":"0-7fffffff",       "state":"active",       "replicas":{"core_node6":{           "core":"testSplitStaticIndexReplication_link_shard1_1_replica_n4",           "node_name":"127.0.0.1:41167_fv",           "base_url":"http://127.0.0.1:41167/fv",           "state":"active",           "type":"NRT",           "leader":"true"}},       "stateTimestamp":"1620464756111478353"},     "shard1_0":{       "range":"80000000-ffffffff",       "state":"active",       "replicas":{         "core_node5":{           "core":"testSplitStaticIndexReplication_link_shard1_0_replica_n3",           "node_name":"127.0.0.1:41167_fv",           "base_url":"http://127.0.0.1:41167/fv",           "state":"down",           "type":"NRT",           "leader":"true"},         "core_node8":{           "core":"testSplitStaticIndexReplication_link_shard1_0_replica_n7",           "node_name":"127.0.0.1:39015_fv",           "base_url":"http://127.0.0.1:39015/fv",           "state":"active",           "type":"NRT"}},       "stateTimestamp":"1620464756111492019"},     "shard1":{       "range":"80000000-7fffffff",       "state":"inactive",       "replicas":{"core_node2":{           "core":"testSplitStaticIndexReplication_link_shard1_replica_n1",           "node_name":"127.0.0.1:41167_fv",           "base_url":"http://127.0.0.1:41167/fv",           "state":"down",           "type":"NRT",           "leader":"true"}},       "stateTimestamp":"1620464756111437114"}},   "router":{"name":"compositeId"},   "maxShardsPerNode":"5",   "autoAddReplicas":"false",   "nrtReplicas":"1",   "tlogReplicas":"0",   "perReplicaState":"true"}

Stack Trace:
java.util.concurrent.TimeoutException: Timeout waiting to see state for collection=testSplitStaticIndexReplication_link :DocCollection(testSplitStaticIndexReplication_link//collections/testSplitStaticIndexReplication_link/state.json/12 {/collections/testSplitStaticIndexReplication_link/state.json/[50]: [core_node2:6:D:L, core_node6:6:A:L, core_node8:2:A, core_node5:6:D:L]})={
  "pullReplicas":"0",
  "replicationFactor":"1",
  "shards":{
    "shard1_1":{
      "range":"0-7fffffff",
      "state":"active",
      "replicas":{"core_node6":{
          "core":"testSplitStaticIndexReplication_link_shard1_1_replica_n4",
          "node_name":"127.0.0.1:41167_fv",
          "base_url":"http://127.0.0.1:41167/fv",
          "state":"active",
          "type":"NRT",
          "leader":"true"}},
      "stateTimestamp":"1620464756111478353"},
    "shard1_0":{
      "range":"80000000-ffffffff",
      "state":"active",
      "replicas":{
        "core_node5":{
          "core":"testSplitStaticIndexReplication_link_shard1_0_replica_n3",
          "node_name":"127.0.0.1:41167_fv",
          "base_url":"http://127.0.0.1:41167/fv",
          "state":"down",
          "type":"NRT",
          "leader":"true"},
        "core_node8":{
          "core":"testSplitStaticIndexReplication_link_shard1_0_replica_n7",
          "node_name":"127.0.0.1:39015_fv",
          "base_url":"http://127.0.0.1:39015/fv",
          "state":"active",
          "type":"NRT"}},
      "stateTimestamp":"1620464756111492019"},
    "shard1":{
      "range":"80000000-7fffffff",
      "state":"inactive",
      "replicas":{"core_node2":{
          "core":"testSplitStaticIndexReplication_link_shard1_replica_n1",
          "node_name":"127.0.0.1:41167_fv",
          "base_url":"http://127.0.0.1:41167/fv",
          "state":"down",
          "type":"NRT",
          "leader":"true"}},
      "stateTimestamp":"1620464756111437114"}},
  "router":{"name":"compositeId"},
  "maxShardsPerNode":"5",
  "autoAddReplicas":"false",
  "nrtReplicas":"1",
  "tlogReplicas":"0",
  "perReplicaState":"true"}
	at __randomizedtesting.SeedInfo.seed([9F4027ABE87A0D04:6478D9452DE6A408]:0)
	at org.apache.solr.common.cloud.ZkStateReader.waitForState(ZkStateReader.java:1849)
	at org.apache.solr.client.solrj.impl.BaseCloudSolrClient.waitForState(BaseCloudSolrClient.java:414)
	at org.apache.solr.cloud.api.collections.ShardSplitTest.doSplitStaticIndexReplication(ShardSplitTest.java:220)
	at org.apache.solr.cloud.api.collections.ShardSplitTest.testSplitStaticIndexReplicationLink(ShardSplitTest.java:131)
	at java.base/jdk.internal.reflect.NativeMethodAccessorImpl.invoke0(Native Method)
	at java.base/jdk.internal.reflect.NativeMethodAccessorImpl.invoke(NativeMethodAccessorImpl.java:64)
	at java.base/jdk.internal.reflect.DelegatingMethodAccessorImpl.invoke(DelegatingMethodAccessorImpl.java:43)
	at java.base/java.lang.reflect.Method.invoke(Method.java:564)
	at com.carrotsearch.randomizedtesting.RandomizedRunner.invoke(RandomizedRunner.java:1750)
	at com.carrotsearch.randomizedtesting.RandomizedRunner$8.evaluate(RandomizedRunner.java:938)
	at com.carrotsearch.randomizedtesting.RandomizedRunner$9.evaluate(RandomizedRunner.java:974)
	at com.carrotsearch.randomizedtesting.RandomizedRunner$10.evaluate(RandomizedRunner.java:988)
	at org.apache.solr.BaseDistributedSearchTestCase$ShardsRepeatRule$ShardsFixedStatement.callStatement(BaseDistributedSearchTestCase.java:1090)
	at org.apache.solr.BaseDistributedSearchTestCase$ShardsRepeatRule$ShardsStatement.evaluate(BaseDistributedSearchTestCase.java:1061)
	at com.carrotsearch.randomizedtesting.rules.SystemPropertiesRestoreRule$1.evaluate(SystemPropertiesRestoreRule.java:57)
	at org.junit.rules.RunRules.evaluate(RunRules.java:20)
	at org.apache.lucene.util.TestRuleSetupTeardownChained$1.evaluate(TestRuleSetupTeardownChained.java:49)
	at org.apache.lucene.util.AbstractBeforeAfterRule$1.evaluate(AbstractBeforeAfterRule.java:45)
	at org.apache.lucene.util.TestRuleThreadAndTestName$1.evaluate(TestRuleThreadAndTestName.java:48)
	at org.apache.lucene.util.TestRuleIgnoreAfterMaxFailures$1.evaluate(TestRuleIgnoreAfterMaxFailures.java:64)
	at org.apache.lucene.util.TestRuleMarkFailure$1.evaluate(TestRuleMarkFailure.java:47)
	at org.junit.rules.RunRules.evaluate(RunRules.java:20)
	at com.carrotsearch.randomizedtesting.rules.StatementAdapter.evaluate(StatementAdapter.java:36)
	at com.carrotsearch.randomizedtesting.ThreadLeakControl$StatementRunner.run(ThreadLeakControl.java:368)
	at com.carrotsearch.randomizedtesting.ThreadLeakControl.forkTimeoutingTask(ThreadLeakControl.java:817)
	at com.carrotsearch.randomizedtesting.ThreadLeakControl$3.evaluate(ThreadLeakControl.java:468)
	at com.carrotsearch.randomizedtesting.RandomizedRunner.runSingleTest(RandomizedRunner.java:947)
	at com.carrotsearch.randomizedtesting.RandomizedRunner$5.evaluate(RandomizedRunner.java:832)
	at com.carrotsearch.randomizedtesting.RandomizedRunner$6.evaluate(RandomizedRunner.java:883)
	at com.carrotsearch.randomizedtesting.RandomizedRunner$7.evaluate(RandomizedRunner.java:894)
	at com.carrotsearch.randomizedtesting.rules.StatementAdapter.evaluate(StatementAdapter.java:36)
	at com.carrotsearch.randomizedtesting.rules.SystemPropertiesRestoreRule$1.evaluate(SystemPropertiesRestoreRule.java:57)
	at org.junit.rules.RunRules.evaluate(RunRules.java:20)
	at org.apache.lucene.util.AbstractBeforeAfterRule$1.evaluate(AbstractBeforeAfterRule.java:45)
	at com.carrotsearch.randomizedtesting.rules.StatementAdapter.evaluate(StatementAdapter.java:36)
	at org.apache.lucene.util.TestRuleStoreClassName$1.evaluate(TestRuleStoreClassName.java:41)
	at com.carrotsearch.randomizedtesting.rules.NoShadowingOrOverridesOnMethodsRule$1.evaluate(NoShadowingOrOverridesOnMethodsRule.java:40)
	at com.carrotsearch.randomizedtesting.rules.NoShadowingOrOverridesOnMethodsRule$1.evaluate(NoShadowingOrOverridesOnMethodsRule.java:40)
	at com.carrotsearch.randomizedtesting.rules.StatementAdapter.evaluate(StatementAdapter.java:36)
	at com.carrotsearch.randomizedtesting.rules.StatementAdapter.evaluate(StatementAdapter.java:36)
	at org.apache.lucene.util.TestRuleAssertionsRequired$1.evaluate(TestRuleAssertionsRequired.java:53)
	at org.apache.lucene.util.TestRuleMarkFailure$1.evaluate(TestRuleMarkFailure.java:47)
	at org.apache.lucene.util.TestRuleIgnoreAfterMaxFailures$1.evaluate(TestRuleIgnoreAfterMaxFailures.java:64)
	at org.apache.lucene.util.TestRuleIgnoreTestSuites$1.evaluate(TestRuleIgnoreTestSuites.java:54)
	at org.junit.rules.RunRules.evaluate(RunRules.java:20)
	at com.carrotsearch.randomizedtesting.rules.StatementAdapter.evaluate(StatementAdapter.java:36)
	at com.carrotsearch.randomizedtesting.ThreadLeakControl$StatementRunner.run(ThreadLeakControl.java:368)
	at java.base/java.lang.Thread.run(Thread.java:832)

[JENKINS] Lucene-Solr-8.x-Linux (64bit/jdk-16) - Build # 6558 - Failure!

Posted by Policeman Jenkins Server <je...@thetaphi.de>.
Build: https://jenkins.thetaphi.de/job/Lucene-Solr-8.x-Linux/6558/
Java: 64bit/jdk-16 -XX:-UseCompressedOops -XX:+UseG1GC

5 tests failed.
FAILED:  junit.framework.TestSuite.org.apache.solr.update.TestInPlaceUpdatesDistrib

Error Message:
Suite timeout exceeded (>= 7200000 msec).

Stack Trace:
java.lang.Exception: Suite timeout exceeded (>= 7200000 msec).
	at __randomizedtesting.SeedInfo.seed([6175E6EC18C4C81F]:0)


FAILED:  junit.framework.TestSuite.org.apache.solr.update.TestInPlaceUpdatesDistrib

Error Message:
Captured an uncaught exception in thread: Thread[id=24233, name=ScheduledTrigger-11683-thread-4, state=RUNNABLE, group=TGRP-TestInPlaceUpdatesDistrib]

Stack Trace:
com.carrotsearch.randomizedtesting.UncaughtExceptionError: Captured an uncaught exception in thread: Thread[id=24233, name=ScheduledTrigger-11683-thread-4, state=RUNNABLE, group=TGRP-TestInPlaceUpdatesDistrib]
Caused by: java.lang.OutOfMemoryError: Java heap space


FAILED:  junit.framework.TestSuite.org.apache.solr.update.TestInPlaceUpdatesDistrib

Error Message:
Captured an uncaught exception in thread: Thread[id=24226, name=OverseerStateUpdate-72114039499980805-127.0.0.1:42339_-n_0000000000, state=RUNNABLE, group=Overseer state updater.]

Stack Trace:
com.carrotsearch.randomizedtesting.UncaughtExceptionError: Captured an uncaught exception in thread: Thread[id=24226, name=OverseerStateUpdate-72114039499980805-127.0.0.1:42339_-n_0000000000, state=RUNNABLE, group=Overseer state updater.]
Caused by: java.lang.OutOfMemoryError: Java heap space


FAILED:  junit.framework.TestSuite.org.apache.solr.update.TestInPlaceUpdatesDistrib

Error Message:
Captured an uncaught exception in thread: Thread[id=24453, name=OverseerStateUpdate-72114039499980813-127.0.0.1:42945_-n_0000000001, state=RUNNABLE, group=Overseer state updater.]

Stack Trace:
com.carrotsearch.randomizedtesting.UncaughtExceptionError: Captured an uncaught exception in thread: Thread[id=24453, name=OverseerStateUpdate-72114039499980813-127.0.0.1:42945_-n_0000000001, state=RUNNABLE, group=Overseer state updater.]
Caused by: java.lang.OutOfMemoryError: Java heap space


FAILED:  org.apache.solr.update.TestInPlaceUpdatesDistrib.test

Error Message:
Test abandoned because suite timeout was reached.

Stack Trace:
java.lang.Exception: Test abandoned because suite timeout was reached.
	at __randomizedtesting.SeedInfo.seed([6175E6EC18C4C81F]:0)

[JENKINS] Lucene-Solr-8.x-Linux (64bit/jdk-16) - Build # 6558 - Failure!

Posted by Policeman Jenkins Server <je...@thetaphi.de>.
Build: https://jenkins.thetaphi.de/job/Lucene-Solr-8.x-Linux/6558/
Java: 64bit/jdk-16 -XX:-UseCompressedOops -XX:+UseG1GC

5 tests failed.
FAILED:  junit.framework.TestSuite.org.apache.solr.update.TestInPlaceUpdatesDistrib

Error Message:
Suite timeout exceeded (>= 7200000 msec).

Stack Trace:
java.lang.Exception: Suite timeout exceeded (>= 7200000 msec).
	at __randomizedtesting.SeedInfo.seed([6175E6EC18C4C81F]:0)


FAILED:  junit.framework.TestSuite.org.apache.solr.update.TestInPlaceUpdatesDistrib

Error Message:
Captured an uncaught exception in thread: Thread[id=24233, name=ScheduledTrigger-11683-thread-4, state=RUNNABLE, group=TGRP-TestInPlaceUpdatesDistrib]

Stack Trace:
com.carrotsearch.randomizedtesting.UncaughtExceptionError: Captured an uncaught exception in thread: Thread[id=24233, name=ScheduledTrigger-11683-thread-4, state=RUNNABLE, group=TGRP-TestInPlaceUpdatesDistrib]
Caused by: java.lang.OutOfMemoryError: Java heap space


FAILED:  junit.framework.TestSuite.org.apache.solr.update.TestInPlaceUpdatesDistrib

Error Message:
Captured an uncaught exception in thread: Thread[id=24226, name=OverseerStateUpdate-72114039499980805-127.0.0.1:42339_-n_0000000000, state=RUNNABLE, group=Overseer state updater.]

Stack Trace:
com.carrotsearch.randomizedtesting.UncaughtExceptionError: Captured an uncaught exception in thread: Thread[id=24226, name=OverseerStateUpdate-72114039499980805-127.0.0.1:42339_-n_0000000000, state=RUNNABLE, group=Overseer state updater.]
Caused by: java.lang.OutOfMemoryError: Java heap space


FAILED:  junit.framework.TestSuite.org.apache.solr.update.TestInPlaceUpdatesDistrib

Error Message:
Captured an uncaught exception in thread: Thread[id=24453, name=OverseerStateUpdate-72114039499980813-127.0.0.1:42945_-n_0000000001, state=RUNNABLE, group=Overseer state updater.]

Stack Trace:
com.carrotsearch.randomizedtesting.UncaughtExceptionError: Captured an uncaught exception in thread: Thread[id=24453, name=OverseerStateUpdate-72114039499980813-127.0.0.1:42945_-n_0000000001, state=RUNNABLE, group=Overseer state updater.]
Caused by: java.lang.OutOfMemoryError: Java heap space


FAILED:  org.apache.solr.update.TestInPlaceUpdatesDistrib.test

Error Message:
Test abandoned because suite timeout was reached.

Stack Trace:
java.lang.Exception: Test abandoned because suite timeout was reached.
	at __randomizedtesting.SeedInfo.seed([6175E6EC18C4C81F]:0)