You are viewing a plain text version of this content. The canonical link for it is here.
Posted to commits@rave.apache.org by Apache Jenkins Server <je...@builds.apache.org> on 2011/08/26 18:01:38 UTC

Build failed in Jenkins: rave-project-trunk #190

See <https://builds.apache.org/job/rave-project-trunk/190/changes>

Changes:

[mfranklin] Added TODO comments and fixed minor inconsistencies

------------------------------------------
Started by an SCM change
Building remotely on ubuntu3
Updating http://svn.apache.org/repos/asf/incubator/rave/trunk
U         rave-portal/src/main/java/org/apache/rave/portal/repository/impl/TranslatedH2Exception.java
U         rave-portal/src/main/java/org/apache/rave/portal/repository/impl/H2OpenJpaDialect.java
U         rave-portal/src/main/java/org/apache/rave/portal/repository/impl/JpaWidgetRepository.java
U         rave-portal/src/main/java/org/apache/rave/portal/service/impl/DefaultPageService.java
U         rave-portal/src/main/java/org/apache/rave/portal/web/controller/PageController.java
U         rave-portal/src/main/java/org/apache/rave/portal/web/controller/WidgetStoreController.java
At revision 1162148
[locks-and-latches] Checking to see if we really have the locks
[locks-and-latches] Have all the locks, build can start
Parsing POMs
Downloaded artifact http://repository.apache.org/snapshots//org/apache/rave/rave-master/0.2-incubating-SNAPSHOT/maven-metadata.xml
[trunk] $ /home/hudson/tools/java/latest1.6/bin/java -cp /home/jenkins/jenkins-slave/maven3-agent.jar:/home/hudson/tools/maven/latest3/boot/plexus-classworlds-2.4.jar org.jvnet.hudson.maven3.agent.Maven3Main /home/hudson/tools/maven/latest3 /x1/jenkins/jenkins-slave/slave.jar /home/jenkins/jenkins-slave/maven3-interceptor.jar 44112
<===[JENKINS REMOTING CAPACITY]===>   channel started
Executing Maven:  -B -f <https://builds.apache.org/job/rave-project-trunk/ws/trunk/pom.xml> clean install
[INFO] Scanning for projects...
[INFO] ------------------------------------------------------------------------
[INFO] Reactor Build Order:
[INFO] 
[INFO] Apache Rave :: rave-project
[INFO] Apache Rave :: rave-commons
[INFO] Apache Rave :: rave-shindig
[INFO] Apache Rave :: rave-portal
[INFO]                                                                         
[INFO] ------------------------------------------------------------------------
[INFO] Building Apache Rave :: rave-project 0.3-incubating-SNAPSHOT
[INFO] ------------------------------------------------------------------------
[INFO] 
[INFO] --- maven-clean-plugin:2.4.1:clean (default-clean) @ rave-project ---
[INFO] Deleting <https://builds.apache.org/job/rave-project-trunk/ws/trunk/target>
[INFO] 
[INFO] --- maven-remote-resources-plugin:1.2.1:process (default) @ rave-project ---
[INFO] 
[INFO] --- maven-site-plugin:3.0:attach-descriptor (attach-descriptor) @ rave-project ---
[INFO] 
[INFO] --- maven-install-plugin:2.3.1:install (default-install) @ rave-project ---
[INFO] Installing <https://builds.apache.org/job/rave-project-trunk/ws/trunk/pom.xml> to /home/jenkins/.m2/repository/org/apache/rave/rave-project/0.3-incubating-SNAPSHOT/rave-project-0.3-incubating-SNAPSHOT.pom
projectSucceeded org.apache.rave:rave-project:0.3-incubating-SNAPSHOT
[JENKINS] Archiving <https://builds.apache.org/job/rave-project-trunk/ws/trunk/pom.xml> to /home/hudson/hudson/jobs/rave-project-trunk/modules/org.apache.rave$rave-project/builds/2011-08-26_16-01-28/archive/org.apache.rave/rave-project/0.3-incubating-SNAPSHOT/rave-project-0.3-incubating-SNAPSHOT.pom
[INFO]                                                                         
[INFO] ------------------------------------------------------------------------
[INFO] Building Apache Rave :: rave-commons 0.3-incubating-SNAPSHOT
[INFO] ------------------------------------------------------------------------
Downloading: http://repo1.maven.org/maven2/commons-logging/commons-logging/maven-metadata.xml
Downloading: http://repository.apache.org/snapshots/commons-logging/commons-logging/maven-metadata.xml
Downloaded: http://repository.apache.org/snapshots/commons-logging/commons-logging/maven-metadata.xml (362 B at 5.0 KB/sec)
Downloaded: http://repo1.maven.org/maven2/commons-logging/commons-logging/maven-metadata.xml (518 B at 0.8 KB/sec)
Downloading: http://repository.apache.org/snapshots/commons-logging/commons-logging/1.1.2-SNAPSHOT/maven-metadata.xml
Downloaded: http://repository.apache.org/snapshots/commons-logging/commons-logging/1.1.2-SNAPSHOT/maven-metadata.xml (2 KB at 40.7 KB/sec)
projectFailed org.apache.rave:rave-commons:0.3-incubating-SNAPSHOT
[JENKINS] Archiving <https://builds.apache.org/job/rave-project-trunk/ws/trunk/rave-commons/pom.xml> to /home/hudson/hudson/jobs/rave-project-trunk/modules/org.apache.rave$rave-commons/builds/2011-08-26_16-01-28/archive/org.apache.rave/rave-commons/0.3-incubating-SNAPSHOT/rave-commons-0.3-incubating-SNAPSHOT.pom
sessionEnded
[INFO] ------------------------------------------------------------------------
[INFO] Reactor Summary:
[INFO] 
[INFO] Apache Rave :: rave-project ....................... SUCCESS [3.629s]
[INFO] Apache Rave :: rave-commons ....................... FAILURE [1.496s]
[INFO] Apache Rave :: rave-shindig ....................... SKIPPED
[INFO] Apache Rave :: rave-portal ........................ SKIPPED
[INFO] ------------------------------------------------------------------------
[INFO] BUILD FAILURE
[INFO] ------------------------------------------------------------------------
[INFO] Total time: 6.227s
[INFO] Finished at: Fri Aug 26 16:01:38 UTC 2011
[INFO] Final Memory: 12M/175M
[INFO] ------------------------------------------------------------------------
mavenExecutionResult exceptions not empty
message : Failed to execute goal on project rave-commons: Could not resolve dependencies for project org.apache.rave:rave-commons:jar:0.3-incubating-SNAPSHOT: Failed to collect dependencies for [org.slf4j:slf4j-api:jar:1.6.1 (compile), org.springframework:spring-context:jar:3.0.5.RELEASE (compile), org.springframework:spring-orm:jar:3.0.5.RELEASE (compile), org.springframework.security:spring-security-web:jar:3.0.5.RELEASE (compile), org.apache.openjpa:openjpa:jar:2.1.1 (compile), com.h2database:h2:jar:1.3.154 (compile), junit:junit:jar:4.7 (test), org.easymock:easymock:jar:3.0 (test), javax.servlet:servlet-api:jar:2.5 (provided), javax.servlet.jsp:jsp-api:jar:2.1 (provided), javax.el:el-api:jar:1.0 (provided), commons-logging:commons-logging:jar:[1,) (provided)]
cause : Could not resolve dependencies for project org.apache.rave:rave-commons:jar:0.3-incubating-SNAPSHOT: Failed to collect dependencies for [org.slf4j:slf4j-api:jar:1.6.1 (compile), org.springframework:spring-context:jar:3.0.5.RELEASE (compile), org.springframework:spring-orm:jar:3.0.5.RELEASE (compile), org.springframework.security:spring-security-web:jar:3.0.5.RELEASE (compile), org.apache.openjpa:openjpa:jar:2.1.1 (compile), com.h2database:h2:jar:1.3.154 (compile), junit:junit:jar:4.7 (test), org.easymock:easymock:jar:3.0 (test), javax.servlet:servlet-api:jar:2.5 (provided), javax.servlet.jsp:jsp-api:jar:2.1 (provided), javax.el:el-api:jar:1.0 (provided), commons-logging:commons-logging:jar:[1,) (provided)]
Stack trace : 
org.apache.maven.lifecycle.LifecycleExecutionException: Failed to execute goal on project rave-commons: Could not resolve dependencies for project org.apache.rave:rave-commons:jar:0.3-incubating-SNAPSHOT: Failed to collect dependencies for [org.slf4j:slf4j-api:jar:1.6.1 (compile), org.springframework:spring-context:jar:3.0.5.RELEASE (compile), org.springframework:spring-orm:jar:3.0.5.RELEASE (compile), org.springframework.security:spring-security-web:jar:3.0.5.RELEASE (compile), org.apache.openjpa:openjpa:jar:2.1.1 (compile), com.h2database:h2:jar:1.3.154 (compile), junit:junit:jar:4.7 (test), org.easymock:easymock:jar:3.0 (test), javax.servlet:servlet-api:jar:2.5 (provided), javax.servlet.jsp:jsp-api:jar:2.1 (provided), javax.el:el-api:jar:1.0 (provided), commons-logging:commons-logging:jar:[1,) (provided)]
	at org.apache.maven.lifecycle.internal.LifecycleDependencyResolver.getDependencies(LifecycleDependencyResolver.java:190)
	at org.apache.maven.lifecycle.internal.LifecycleDependencyResolver.resolveProjectDependencies(LifecycleDependencyResolver.java:104)
	at org.apache.maven.lifecycle.internal.MojoExecutor.ensureDependenciesAreResolved(MojoExecutor.java:258)
	at org.apache.maven.lifecycle.internal.MojoExecutor.execute(MojoExecutor.java:201)
	at org.apache.maven.lifecycle.internal.MojoExecutor.execute(MojoExecutor.java:153)
	at org.apache.maven.lifecycle.internal.MojoExecutor.execute(MojoExecutor.java:145)
	at org.apache.maven.lifecycle.internal.LifecycleModuleBuilder.buildProject(LifecycleModuleBuilder.java:84)
	at org.apache.maven.lifecycle.internal.LifecycleModuleBuilder.buildProject(LifecycleModuleBuilder.java:59)
	at org.apache.maven.lifecycle.internal.LifecycleStarter.singleThreadedBuild(LifecycleStarter.java:183)
	at org.apache.maven.lifecycle.internal.LifecycleStarter.execute(LifecycleStarter.java:161)
	at org.apache.maven.DefaultMaven.doExecute(DefaultMaven.java:319)
	at org.apache.maven.DefaultMaven.execute(DefaultMaven.java:156)
	at org.jvnet.hudson.maven3.launcher.Maven3Launcher.main(Maven3Launcher.java:79)
	at sun.reflect.NativeMethodAccessorImpl.invoke0(Native Method)
	at sun.reflect.NativeMethodAccessorImpl.invoke(NativeMethodAccessorImpl.java:39)
	at sun.reflect.DelegatingMethodAccessorImpl.invoke(DelegatingMethodAccessorImpl.java:25)
	at java.lang.reflect.Method.invoke(Method.java:597)
	at org.codehaus.plexus.classworlds.launcher.Launcher.launchStandard(Launcher.java:329)
	at org.codehaus.plexus.classworlds.launcher.Launcher.launch(Launcher.java:239)
	at org.jvnet.hudson.maven3.agent.Maven3Main.launch(Maven3Main.java:158)
	at hudson.maven.Maven3Builder.call(Maven3Builder.java:121)
	at hudson.maven.Maven3Builder.call(Maven3Builder.java:73)
	at hudson.remoting.UserRequest.perform(UserRequest.java:118)
	at hudson.remoting.UserRequest.perform(UserRequest.java:48)
	at hudson.remoting.Request$2.run(Request.java:287)
	at java.util.concurrent.Executors$RunnableAdapter.call(Executors.java:441)
	at java.util.concurrent.FutureTask$Sync.innerRun(FutureTask.java:303)
	at java.util.concurrent.FutureTask.run(FutureTask.java:138)
	at java.util.concurrent.ThreadPoolExecutor$Worker.runTask(ThreadPoolExecutor.java:886)
	at java.util.concurrent.ThreadPoolExecutor$Worker.run(ThreadPoolExecutor.java:908)
	at java.lang.Thread.run(Thread.java:619)
Caused by: org.apache.maven.project.DependencyResolutionException: Could not resolve dependencies for project org.apache.rave:rave-commons:jar:0.3-incubating-SNAPSHOT: Failed to collect dependencies for [org.slf4j:slf4j-api:jar:1.6.1 (compile), org.springframework:spring-context:jar:3.0.5.RELEASE (compile), org.springframework:spring-orm:jar:3.0.5.RELEASE (compile), org.springframework.security:spring-security-web:jar:3.0.5.RELEASE (compile), org.apache.openjpa:openjpa:jar:2.1.1 (compile), com.h2database:h2:jar:1.3.154 (compile), junit:junit:jar:4.7 (test), org.easymock:easymock:jar:3.0 (test), javax.servlet:servlet-api:jar:2.5 (provided), javax.servlet.jsp:jsp-api:jar:2.1 (provided), javax.el:el-api:jar:1.0 (provided), commons-logging:commons-logging:jar:[1,) (provided)]
	at org.apache.maven.project.DefaultProjectDependenciesResolver.resolve(DefaultProjectDependenciesResolver.java:127)
	at org.apache.maven.lifecycle.internal.LifecycleDependencyResolver.getDependencies(LifecycleDependencyResolver.java:165)
	... 30 more
Caused by: org.sonatype.aether.collection.DependencyCollectionException: Failed to collect dependencies for [org.slf4j:slf4j-api:jar:1.6.1 (compile), org.springframework:spring-context:jar:3.0.5.RELEASE (compile), org.springframework:spring-orm:jar:3.0.5.RELEASE (compile), org.springframework.security:spring-security-web:jar:3.0.5.RELEASE (compile), org.apache.openjpa:openjpa:jar:2.1.1 (compile), com.h2database:h2:jar:1.3.154 (compile), junit:junit:jar:4.7 (test), org.easymock:easymock:jar:3.0 (test), javax.servlet:servlet-api:jar:2.5 (provided), javax.servlet.jsp:jsp-api:jar:2.1 (provided), javax.el:el-api:jar:1.0 (provided), commons-logging:commons-logging:jar:[1,) (provided)]
	at org.sonatype.aether.impl.internal.DefaultDependencyCollector.collectDependencies(DefaultDependencyCollector.java:251)
	at org.sonatype.aether.impl.internal.DefaultRepositorySystem.collectDependencies(DefaultRepositorySystem.java:318)
	at org.apache.maven.project.DefaultProjectDependenciesResolver.resolve(DefaultProjectDependenciesResolver.java:119)
	... 31 more
Caused by: org.sonatype.aether.resolution.ArtifactDescriptorException: Failed to read artifact descriptor for commons-logging:commons-logging:jar:1.1.2-SNAPSHOT
	at org.apache.maven.repository.internal.DefaultArtifactDescriptorReader.loadPom(DefaultArtifactDescriptorReader.java:317)
	at org.apache.maven.repository.internal.DefaultArtifactDescriptorReader.readArtifactDescriptor(DefaultArtifactDescriptorReader.java:173)
	at org.sonatype.aether.impl.internal.DefaultDependencyCollector.process(DefaultDependencyCollector.java:419)
	at org.sonatype.aether.impl.internal.DefaultDependencyCollector.collectDependencies(DefaultDependencyCollector.java:233)
	... 33 more
Caused by: org.apache.maven.model.resolution.UnresolvableModelException: Could not find artifact org.apache.commons:commons-parent:pom:15
	at org.apache.maven.repository.internal.DefaultModelResolver.resolveModel(DefaultModelResolver.java:119)
	at org.apache.maven.model.building.DefaultModelBuilder.readParentExternally(DefaultModelBuilder.java:819)
	at org.apache.maven.model.building.DefaultModelBuilder.readParent(DefaultModelBuilder.java:670)
	at org.apache.maven.model.building.DefaultModelBuilder.build(DefaultModelBuilder.java:308)
	at org.apache.maven.model.building.DefaultModelBuilder.build(DefaultModelBuilder.java:232)
	at org.apache.maven.repository.internal.DefaultArtifactDescriptorReader.loadPom(DefaultArtifactDescriptorReader.java:308)
	... 36 more
Caused by: org.sonatype.aether.resolution.ArtifactResolutionException: Could not find artifact org.apache.commons:commons-parent:pom:15
	at org.sonatype.aether.impl.internal.DefaultArtifactResolver.resolveArtifacts(DefaultArtifactResolver.java:526)
	at org.sonatype.aether.impl.internal.DefaultArtifactResolver.resolveArtifact(DefaultArtifactResolver.java:214)
	at org.apache.maven.repository.internal.DefaultModelResolver.resolveModel(DefaultModelResolver.java:115)
	... 41 more
Caused by: org.sonatype.aether.transfer.ArtifactNotFoundException: Could not find artifact org.apache.commons:commons-parent:pom:15
	at org.sonatype.aether.impl.internal.DefaultArtifactResolver.resolveArtifacts(DefaultArtifactResolver.java:517)
	... 43 more
Sending e-mails to: rave-commits@incubator.apache.org
channel stopped
[locks-and-latches] Releasing all the locks
[locks-and-latches] All the locks released


Jenkins build is back to normal : rave-project-trunk #192

Posted by Apache Jenkins Server <je...@builds.apache.org>.
See <https://builds.apache.org/job/rave-project-trunk/192/>



Build failed in Jenkins: rave-project-trunk #191

Posted by Apache Jenkins Server <je...@builds.apache.org>.
See <https://builds.apache.org/job/rave-project-trunk/191/changes>

Changes:

[mfranklin] Removed extraneous model classes (Supports RAVE-13)

------------------------------------------
Started by an SCM change
Building remotely on ubuntu3
Updating http://svn.apache.org/repos/asf/incubator/rave/trunk
D         rave-shindig/src/main/java/org/apache/shindig/social/opensocial/jpa/PhotoDb.java
D         rave-shindig/src/main/java/org/apache/shindig/social/opensocial/jpa/GroupDb.java
D         rave-shindig/src/main/java/org/apache/shindig/social/opensocial/jpa/GroupPropertyDb.java
D         rave-shindig/src/main/java/org/apache/shindig/social/opensocial/jpa/UrlDb.java
D         rave-shindig/src/main/java/org/apache/shindig/social/opensocial/jpa/ImDb.java
D         rave-shindig/src/main/java/org/apache/shindig/social/opensocial/jpa/AddressDb.java
D         rave-shindig/src/main/java/org/apache/shindig/social/opensocial/jpa/EmailDb.java
D         rave-shindig/src/main/java/org/apache/shindig/social/opensocial/jpa/PersonOrganizationDb.java
D         rave-shindig/src/main/java/org/apache/shindig/social/opensocial/jpa/AccountDb.java
D         rave-shindig/src/main/java/org/apache/shindig/social/opensocial/jpa/BodyTypeDb.java
D         rave-shindig/src/main/java/org/apache/shindig/social/opensocial/jpa/OrganizationDb.java
D         rave-shindig/src/main/java/org/apache/shindig/social/opensocial/jpa/PersonDb.java
D         rave-shindig/src/main/java/org/apache/shindig/social/opensocial/jpa/FriendDb.java
D         rave-shindig/src/main/java/org/apache/shindig/social/opensocial/jpa/PhoneDb.java
D         rave-shindig/src/main/java/org/apache/shindig/social/opensocial/jpa/OrganizationAddressDb.java
D         rave-shindig/src/main/java/org/apache/shindig/social/opensocial/jpa/PersonPropertyDb.java
D         rave-shindig/src/main/java/org/apache/shindig/social/opensocial/jpa/FriendPropertyDb.java
D         rave-shindig/src/main/java/org/apache/shindig/social/opensocial/jpa/PersonAddressDb.java
D         rave-shindig/src/main/java/org/apache/shindig/social/opensocial/jpa/NameDb.java
D         rave-shindig/src/main/java/org/apache/shindig/social/opensocial/jpa/PersonAccountDb.java
U         rave-shindig/src/main/java/org/apache/shindig/social/opensocial/jpa/MediaItemDb.java
At revision 1162273
[locks-and-latches] Checking to see if we really have the locks
[locks-and-latches] Have all the locks, build can start
Parsing POMs
[trunk] $ /home/hudson/tools/java/latest1.6/bin/java -cp /home/jenkins/jenkins-slave/maven3-agent.jar:/home/hudson/tools/maven/latest3/boot/plexus-classworlds-2.4.jar org.jvnet.hudson.maven3.agent.Maven3Main /home/hudson/tools/maven/latest3 /x1/jenkins/jenkins-slave/slave.jar /home/jenkins/jenkins-slave/maven3-interceptor.jar 57592
<===[JENKINS REMOTING CAPACITY]===>   channel started
Executing Maven:  -B -f <https://builds.apache.org/job/rave-project-trunk/ws/trunk/pom.xml> clean install
[INFO] Scanning for projects...
[INFO] ------------------------------------------------------------------------
[INFO] Reactor Build Order:
[INFO] 
[INFO] Apache Rave :: rave-project
[INFO] Apache Rave :: rave-commons
[INFO] Apache Rave :: rave-shindig
[INFO] Apache Rave :: rave-portal
[INFO]                                                                         
[INFO] ------------------------------------------------------------------------
[INFO] Building Apache Rave :: rave-project 0.3-incubating-SNAPSHOT
[INFO] ------------------------------------------------------------------------
[INFO] 
[INFO] --- maven-clean-plugin:2.4.1:clean (default-clean) @ rave-project ---
[INFO] Deleting <https://builds.apache.org/job/rave-project-trunk/ws/trunk/target>
[INFO] 
[INFO] --- maven-remote-resources-plugin:1.2.1:process (default) @ rave-project ---
[INFO] 
[INFO] --- maven-site-plugin:3.0:attach-descriptor (attach-descriptor) @ rave-project ---
[INFO] [INFO] Installing <https://builds.apache.org/job/rave-project-trunk/ws/trunk/pom.xml> to /home/jenkins/.m2/repository/org/apache/rave/rave-project/0.3-incubating-SNAPSHOT/rave-project-0.3-incubating-SNAPSHOT.pom

[INFO] --- maven-install-plugin:2.3.1:install (default-install) @ rave-project ---
projectSucceeded org.apache.rave:rave-project:0.3-incubating-SNAPSHOT
[JENKINS] Archiving <https://builds.apache.org/job/rave-project-trunk/ws/trunk/pom.xml> to /home/hudson/hudson/jobs/rave-project-trunk/modules/org.apache.rave$rave-project/builds/2011-08-26_22-17-00/archive/org.apache.rave/rave-project/0.3-incubating-SNAPSHOT/rave-project-0.3-incubating-SNAPSHOT.pom
[INFO]                                                                         
[INFO] ------------------------------------------------------------------------
[INFO] Building Apache Rave :: rave-commons 0.3-incubating-SNAPSHOT
[INFO] ------------------------------------------------------------------------
projectFailed org.apache.rave:rave-commons:0.3-incubating-SNAPSHOT
[JENKINS] Archiving <https://builds.apache.org/job/rave-project-trunk/ws/trunk/rave-commons/pom.xml> to /home/hudson/hudson/jobs/rave-project-trunk/modules/org.apache.rave$rave-commons/builds/2011-08-26_22-17-00/archive/org.apache.rave/rave-commons/0.3-incubating-SNAPSHOT/rave-commons-0.3-incubating-SNAPSHOT.pom
sessionEnded
[INFO] ------------------------------------------------------------------------
[INFO] Reactor Summary:
[INFO] 
[INFO] Apache Rave :: rave-project ....................... SUCCESS [3.126s]
[INFO] Apache Rave :: rave-commons ....................... FAILURE [0.259s]
[INFO] Apache Rave :: rave-shindig ....................... SKIPPED
[INFO] Apache Rave :: rave-portal ........................ SKIPPED
[INFO] ------------------------------------------------------------------------
[INFO] BUILD FAILURE
[INFO] ------------------------------------------------------------------------
[INFO] Total time: 4.472s
[INFO] Finished at: Fri Aug 26 22:17:08 UTC 2011
[INFO] Final Memory: 11M/96M
[INFO] ------------------------------------------------------------------------
mavenExecutionResult exceptions not empty
message : Failed to execute goal on project rave-commons: Could not resolve dependencies for project org.apache.rave:rave-commons:jar:0.3-incubating-SNAPSHOT: Failed to collect dependencies for [org.slf4j:slf4j-api:jar:1.6.1 (compile), org.springframework:spring-context:jar:3.0.5.RELEASE (compile), org.springframework:spring-orm:jar:3.0.5.RELEASE (compile), org.springframework.security:spring-security-web:jar:3.0.5.RELEASE (compile), org.apache.openjpa:openjpa:jar:2.1.1 (compile), com.h2database:h2:jar:1.3.154 (compile), junit:junit:jar:4.7 (test), org.easymock:easymock:jar:3.0 (test), javax.servlet:servlet-api:jar:2.5 (provided), javax.servlet.jsp:jsp-api:jar:2.1 (provided), javax.el:el-api:jar:1.0 (provided), commons-logging:commons-logging:jar:[1,) (provided)]
cause : Could not resolve dependencies for project org.apache.rave:rave-commons:jar:0.3-incubating-SNAPSHOT: Failed to collect dependencies for [org.slf4j:slf4j-api:jar:1.6.1 (compile), org.springframework:spring-context:jar:3.0.5.RELEASE (compile), org.springframework:spring-orm:jar:3.0.5.RELEASE (compile), org.springframework.security:spring-security-web:jar:3.0.5.RELEASE (compile), org.apache.openjpa:openjpa:jar:2.1.1 (compile), com.h2database:h2:jar:1.3.154 (compile), junit:junit:jar:4.7 (test), org.easymock:easymock:jar:3.0 (test), javax.servlet:servlet-api:jar:2.5 (provided), javax.servlet.jsp:jsp-api:jar:2.1 (provided), javax.el:el-api:jar:1.0 (provided), commons-logging:commons-logging:jar:[1,) (provided)]
Stack trace : 
org.apache.maven.lifecycle.LifecycleExecutionException: Failed to execute goal on project rave-commons: Could not resolve dependencies for project org.apache.rave:rave-commons:jar:0.3-incubating-SNAPSHOT: Failed to collect dependencies for [org.slf4j:slf4j-api:jar:1.6.1 (compile), org.springframework:spring-context:jar:3.0.5.RELEASE (compile), org.springframework:spring-orm:jar:3.0.5.RELEASE (compile), org.springframework.security:spring-security-web:jar:3.0.5.RELEASE (compile), org.apache.openjpa:openjpa:jar:2.1.1 (compile), com.h2database:h2:jar:1.3.154 (compile), junit:junit:jar:4.7 (test), org.easymock:easymock:jar:3.0 (test), javax.servlet:servlet-api:jar:2.5 (provided), javax.servlet.jsp:jsp-api:jar:2.1 (provided), javax.el:el-api:jar:1.0 (provided), commons-logging:commons-logging:jar:[1,) (provided)]
	at org.apache.maven.lifecycle.internal.LifecycleDependencyResolver.getDependencies(LifecycleDependencyResolver.java:190)
	at org.apache.maven.lifecycle.internal.LifecycleDependencyResolver.resolveProjectDependencies(LifecycleDependencyResolver.java:104)
	at org.apache.maven.lifecycle.internal.MojoExecutor.ensureDependenciesAreResolved(MojoExecutor.java:258)
	at org.apache.maven.lifecycle.internal.MojoExecutor.execute(MojoExecutor.java:201)
	at org.apache.maven.lifecycle.internal.MojoExecutor.execute(MojoExecutor.java:153)
	at org.apache.maven.lifecycle.internal.MojoExecutor.execute(MojoExecutor.java:145)
	at org.apache.maven.lifecycle.internal.LifecycleModuleBuilder.buildProject(LifecycleModuleBuilder.java:84)
	at org.apache.maven.lifecycle.internal.LifecycleModuleBuilder.buildProject(LifecycleModuleBuilder.java:59)
	at org.apache.maven.lifecycle.internal.LifecycleStarter.singleThreadedBuild(LifecycleStarter.java:183)
	at org.apache.maven.lifecycle.internal.LifecycleStarter.execute(LifecycleStarter.java:161)
	at org.apache.maven.DefaultMaven.doExecute(DefaultMaven.java:319)
	at org.apache.maven.DefaultMaven.execute(DefaultMaven.java:156)
	at org.jvnet.hudson.maven3.launcher.Maven3Launcher.main(Maven3Launcher.java:79)
	at sun.reflect.NativeMethodAccessorImpl.invoke0(Native Method)
	at sun.reflect.NativeMethodAccessorImpl.invoke(NativeMethodAccessorImpl.java:39)
	at sun.reflect.DelegatingMethodAccessorImpl.invoke(DelegatingMethodAccessorImpl.java:25)
	at java.lang.reflect.Method.invoke(Method.java:597)
	at org.codehaus.plexus.classworlds.launcher.Launcher.launchStandard(Launcher.java:329)
	at org.codehaus.plexus.classworlds.launcher.Launcher.launch(Launcher.java:239)
	at org.jvnet.hudson.maven3.agent.Maven3Main.launch(Maven3Main.java:158)
	at hudson.maven.Maven3Builder.call(Maven3Builder.java:121)
	at hudson.maven.Maven3Builder.call(Maven3Builder.java:73)
	at hudson.remoting.UserRequest.perform(UserRequest.java:118)
	at hudson.remoting.UserRequest.perform(UserRequest.java:48)
	at hudson.remoting.Request$2.run(Request.java:287)
	at java.util.concurrent.Executors$RunnableAdapter.call(Executors.java:441)
	at java.util.concurrent.FutureTask$Sync.innerRun(FutureTask.java:303)
	at java.util.concurrent.FutureTask.run(FutureTask.java:138)
	at java.util.concurrent.ThreadPoolExecutor$Worker.runTask(ThreadPoolExecutor.java:886)
	at java.util.concurrent.ThreadPoolExecutor$Worker.run(ThreadPoolExecutor.java:908)
	at java.lang.Thread.run(Thread.java:619)
Caused by: org.apache.maven.project.DependencyResolutionException: Could not resolve dependencies for project org.apache.rave:rave-commons:jar:0.3-incubating-SNAPSHOT: Failed to collect dependencies for [org.slf4j:slf4j-api:jar:1.6.1 (compile), org.springframework:spring-context:jar:3.0.5.RELEASE (compile), org.springframework:spring-orm:jar:3.0.5.RELEASE (compile), org.springframework.security:spring-security-web:jar:3.0.5.RELEASE (compile), org.apache.openjpa:openjpa:jar:2.1.1 (compile), com.h2database:h2:jar:1.3.154 (compile), junit:junit:jar:4.7 (test), org.easymock:easymock:jar:3.0 (test), javax.servlet:servlet-api:jar:2.5 (provided), javax.servlet.jsp:jsp-api:jar:2.1 (provided), javax.el:el-api:jar:1.0 (provided), commons-logging:commons-logging:jar:[1,) (provided)]
	at org.apache.maven.project.DefaultProjectDependenciesResolver.resolve(DefaultProjectDependenciesResolver.java:127)
	at org.apache.maven.lifecycle.internal.LifecycleDependencyResolver.getDependencies(LifecycleDependencyResolver.java:165)
	... 30 more
Caused by: org.sonatype.aether.collection.DependencyCollectionException: Failed to collect dependencies for [org.slf4j:slf4j-api:jar:1.6.1 (compile), org.springframework:spring-context:jar:3.0.5.RELEASE (compile), org.springframework:spring-orm:jar:3.0.5.RELEASE (compile), org.springframework.security:spring-security-web:jar:3.0.5.RELEASE (compile), org.apache.openjpa:openjpa:jar:2.1.1 (compile), com.h2database:h2:jar:1.3.154 (compile), junit:junit:jar:4.7 (test), org.easymock:easymock:jar:3.0 (test), javax.servlet:servlet-api:jar:2.5 (provided), javax.servlet.jsp:jsp-api:jar:2.1 (provided), javax.el:el-api:jar:1.0 (provided), commons-logging:commons-logging:jar:[1,) (provided)]
	at org.sonatype.aether.impl.internal.DefaultDependencyCollector.collectDependencies(DefaultDependencyCollector.java:251)
	at org.sonatype.aether.impl.internal.DefaultRepositorySystem.collectDependencies(DefaultRepositorySystem.java:318)
	at org.apache.maven.project.DefaultProjectDependenciesResolver.resolve(DefaultProjectDependenciesResolver.java:119)
	... 31 more
Caused by: org.sonatype.aether.resolution.ArtifactDescriptorException: Failed to read artifact descriptor for commons-logging:commons-logging:jar:1.1.2-SNAPSHOT
	at org.apache.maven.repository.internal.DefaultArtifactDescriptorReader.loadPom(DefaultArtifactDescriptorReader.java:317)
	at org.apache.maven.repository.internal.DefaultArtifactDescriptorReader.readArtifactDescriptor(DefaultArtifactDescriptorReader.java:173)
	at org.sonatype.aether.impl.internal.DefaultDependencyCollector.process(DefaultDependencyCollector.java:419)
	at org.sonatype.aether.impl.internal.DefaultDependencyCollector.collectDependencies(DefaultDependencyCollector.java:233)
	... 33 more
Caused by: org.apache.maven.model.resolution.UnresolvableModelException: Could not find artifact org.apache.commons:commons-parent:pom:15
	at org.apache.maven.repository.internal.DefaultModelResolver.resolveModel(DefaultModelResolver.java:119)
	at org.apache.maven.model.building.DefaultModelBuilder.readParentExternally(DefaultModelBuilder.java:819)
	at org.apache.maven.model.building.DefaultModelBuilder.readParent(DefaultModelBuilder.java:670)
	at org.apache.maven.model.building.DefaultModelBuilder.build(DefaultModelBuilder.java:308)
	at org.apache.maven.model.building.DefaultModelBuilder.build(DefaultModelBuilder.java:232)
	at org.apache.maven.repository.internal.DefaultArtifactDescriptorReader.loadPom(DefaultArtifactDescriptorReader.java:308)
	... 36 more
Caused by: org.sonatype.aether.resolution.ArtifactResolutionException: Could not find artifact org.apache.commons:commons-parent:pom:15
	at org.sonatype.aether.impl.internal.DefaultArtifactResolver.resolveArtifacts(DefaultArtifactResolver.java:526)
	at org.sonatype.aether.impl.internal.DefaultArtifactResolver.resolveArtifact(DefaultArtifactResolver.java:214)
	at org.apache.maven.repository.internal.DefaultModelResolver.resolveModel(DefaultModelResolver.java:115)
	... 41 more
Caused by: org.sonatype.aether.transfer.ArtifactNotFoundException: Could not find artifact org.apache.commons:commons-parent:pom:15
	at org.sonatype.aether.impl.internal.DefaultArtifactResolver.resolveArtifacts(DefaultArtifactResolver.java:517)
	... 43 more
Sending e-mails to: rave-commits@incubator.apache.org
channel stopped
[locks-and-latches] Releasing all the locks
[locks-and-latches] All the locks released


RE: Build failed in Jenkins: rave-project-trunk #190

Posted by "Franklin, Matthew B." <mf...@mitre.org>.
This is working fine on my local machine.  Looks like it might be a glitch on the build server as it can't find the parent pom for apache commons.

>-----Original Message-----
>From: Apache Jenkins Server [mailto:jenkins@builds.apache.org]
>Sent: Friday, August 26, 2011 12:02 PM
>To: rave-commits@incubator.apache.org
>Subject: Build failed in Jenkins: rave-project-trunk #190
>
>See <https://builds.apache.org/job/rave-project-trunk/190/changes>
>
>Changes:
>
>[mfranklin] Added TODO comments and fixed minor inconsistencies
>
>------------------------------------------
>Started by an SCM change
>Building remotely on ubuntu3
>Updating http://svn.apache.org/repos/asf/incubator/rave/trunk
>U         rave-
>portal/src/main/java/org/apache/rave/portal/repository/impl/TranslatedH2E
>xception.java
>U         rave-
>portal/src/main/java/org/apache/rave/portal/repository/impl/H2OpenJpaDial
>ect.java
>U         rave-
>portal/src/main/java/org/apache/rave/portal/repository/impl/JpaWidgetRep
>ository.java
>U         rave-
>portal/src/main/java/org/apache/rave/portal/service/impl/DefaultPageServic
>e.java
>U         rave-
>portal/src/main/java/org/apache/rave/portal/web/controller/PageController.
>java
>U         rave-
>portal/src/main/java/org/apache/rave/portal/web/controller/WidgetStoreCo
>ntroller.java
>At revision 1162148
>[locks-and-latches] Checking to see if we really have the locks
>[locks-and-latches] Have all the locks, build can start
>Parsing POMs
>Downloaded artifact
>http://repository.apache.org/snapshots//org/apache/rave/rave-master/0.2-
>incubating-SNAPSHOT/maven-metadata.xml
>[trunk] $ /home/hudson/tools/java/latest1.6/bin/java -cp
>/home/jenkins/jenkins-slave/maven3-
>agent.jar:/home/hudson/tools/maven/latest3/boot/plexus-classworlds-
>2.4.jar org.jvnet.hudson.maven3.agent.Maven3Main
>/home/hudson/tools/maven/latest3 /x1/jenkins/jenkins-slave/slave.jar
>/home/jenkins/jenkins-slave/maven3-interceptor.jar 44112
><===[JENKINS REMOTING CAPACITY]===>   channel started
>Executing Maven:  -B -f <https://builds.apache.org/job/rave-project-
>trunk/ws/trunk/pom.xml> clean install
>[INFO] Scanning for projects...
>[INFO] ------------------------------------------------------------------------
>[INFO] Reactor Build Order:
>[INFO]
>[INFO] Apache Rave :: rave-project
>[INFO] Apache Rave :: rave-commons
>[INFO] Apache Rave :: rave-shindig
>[INFO] Apache Rave :: rave-portal
>[INFO]
>[INFO] ------------------------------------------------------------------------
>[INFO] Building Apache Rave :: rave-project 0.3-incubating-SNAPSHOT
>[INFO] ------------------------------------------------------------------------
>[INFO]
>[INFO] --- maven-clean-plugin:2.4.1:clean (default-clean) @ rave-project ---
>[INFO] Deleting <https://builds.apache.org/job/rave-project-
>trunk/ws/trunk/target>
>[INFO]
>[INFO] --- maven-remote-resources-plugin:1.2.1:process (default) @ rave-
>project ---
>[INFO]
>[INFO] --- maven-site-plugin:3.0:attach-descriptor (attach-descriptor) @ rave-
>project ---
>[INFO]
>[INFO] --- maven-install-plugin:2.3.1:install (default-install) @ rave-project ---
>[INFO] Installing <https://builds.apache.org/job/rave-project-
>trunk/ws/trunk/pom.xml> to
>/home/jenkins/.m2/repository/org/apache/rave/rave-project/0.3-
>incubating-SNAPSHOT/rave-project-0.3-incubating-SNAPSHOT.pom
>projectSucceeded org.apache.rave:rave-project:0.3-incubating-SNAPSHOT
>[JENKINS] Archiving <https://builds.apache.org/job/rave-project-
>trunk/ws/trunk/pom.xml> to /home/hudson/hudson/jobs/rave-project-
>trunk/modules/org.apache.rave$rave-project/builds/2011-08-26_16-01-
>28/archive/org.apache.rave/rave-project/0.3-incubating-SNAPSHOT/rave-
>project-0.3-incubating-SNAPSHOT.pom
>[INFO]
>[INFO] ------------------------------------------------------------------------
>[INFO] Building Apache Rave :: rave-commons 0.3-incubating-SNAPSHOT
>[INFO] ------------------------------------------------------------------------
>Downloading: http://repo1.maven.org/maven2/commons-logging/commons-
>logging/maven-metadata.xml
>Downloading: http://repository.apache.org/snapshots/commons-
>logging/commons-logging/maven-metadata.xml
>Downloaded: http://repository.apache.org/snapshots/commons-
>logging/commons-logging/maven-metadata.xml (362 B at 5.0 KB/sec)
>Downloaded: http://repo1.maven.org/maven2/commons-logging/commons-
>logging/maven-metadata.xml (518 B at 0.8 KB/sec)
>Downloading: http://repository.apache.org/snapshots/commons-
>logging/commons-logging/1.1.2-SNAPSHOT/maven-metadata.xml
>Downloaded: http://repository.apache.org/snapshots/commons-
>logging/commons-logging/1.1.2-SNAPSHOT/maven-metadata.xml (2 KB at
>40.7 KB/sec)
>projectFailed org.apache.rave:rave-commons:0.3-incubating-SNAPSHOT
>[JENKINS] Archiving <https://builds.apache.org/job/rave-project-
>trunk/ws/trunk/rave-commons/pom.xml> to
>/home/hudson/hudson/jobs/rave-project-
>trunk/modules/org.apache.rave$rave-commons/builds/2011-08-26_16-01-
>28/archive/org.apache.rave/rave-commons/0.3-incubating-SNAPSHOT/rave-
>commons-0.3-incubating-SNAPSHOT.pom
>sessionEnded
>[INFO] ------------------------------------------------------------------------
>[INFO] Reactor Summary:
>[INFO]
>[INFO] Apache Rave :: rave-project ....................... SUCCESS [3.629s]
>[INFO] Apache Rave :: rave-commons ....................... FAILURE [1.496s]
>[INFO] Apache Rave :: rave-shindig ....................... SKIPPED
>[INFO] Apache Rave :: rave-portal ........................ SKIPPED
>[INFO] ------------------------------------------------------------------------
>[INFO] BUILD FAILURE
>[INFO] ------------------------------------------------------------------------
>[INFO] Total time: 6.227s
>[INFO] Finished at: Fri Aug 26 16:01:38 UTC 2011
>[INFO] Final Memory: 12M/175M
>[INFO] ------------------------------------------------------------------------
>mavenExecutionResult exceptions not empty
>message : Failed to execute goal on project rave-commons: Could not resolve
>dependencies for project org.apache.rave:rave-commons:jar:0.3-incubating-
>SNAPSHOT: Failed to collect dependencies for [org.slf4j:slf4j-api:jar:1.6.1
>(compile), org.springframework:spring-context:jar:3.0.5.RELEASE (compile),
>org.springframework:spring-orm:jar:3.0.5.RELEASE (compile),
>org.springframework.security:spring-security-web:jar:3.0.5.RELEASE
>(compile), org.apache.openjpa:openjpa:jar:2.1.1 (compile),
>com.h2database:h2:jar:1.3.154 (compile), junit:junit:jar:4.7 (test),
>org.easymock:easymock:jar:3.0 (test), javax.servlet:servlet-api:jar:2.5
>(provided), javax.servlet.jsp:jsp-api:jar:2.1 (provided), javax.el:el-api:jar:1.0
>(provided), commons-logging:commons-logging:jar:[1,) (provided)]
>cause : Could not resolve dependencies for project org.apache.rave:rave-
>commons:jar:0.3-incubating-SNAPSHOT: Failed to collect dependencies for
>[org.slf4j:slf4j-api:jar:1.6.1 (compile), org.springframework:spring-
>context:jar:3.0.5.RELEASE (compile), org.springframework:spring-
>orm:jar:3.0.5.RELEASE (compile), org.springframework.security:spring-
>security-web:jar:3.0.5.RELEASE (compile),
>org.apache.openjpa:openjpa:jar:2.1.1 (compile),
>com.h2database:h2:jar:1.3.154 (compile), junit:junit:jar:4.7 (test),
>org.easymock:easymock:jar:3.0 (test), javax.servlet:servlet-api:jar:2.5
>(provided), javax.servlet.jsp:jsp-api:jar:2.1 (provided), javax.el:el-api:jar:1.0
>(provided), commons-logging:commons-logging:jar:[1,) (provided)]
>Stack trace :
>org.apache.maven.lifecycle.LifecycleExecutionException: Failed to execute
>goal on project rave-commons: Could not resolve dependencies for project
>org.apache.rave:rave-commons:jar:0.3-incubating-SNAPSHOT: Failed to
>collect dependencies for [org.slf4j:slf4j-api:jar:1.6.1 (compile),
>org.springframework:spring-context:jar:3.0.5.RELEASE (compile),
>org.springframework:spring-orm:jar:3.0.5.RELEASE (compile),
>org.springframework.security:spring-security-web:jar:3.0.5.RELEASE
>(compile), org.apache.openjpa:openjpa:jar:2.1.1 (compile),
>com.h2database:h2:jar:1.3.154 (compile), junit:junit:jar:4.7 (test),
>org.easymock:easymock:jar:3.0 (test), javax.servlet:servlet-api:jar:2.5
>(provided), javax.servlet.jsp:jsp-api:jar:2.1 (provided), javax.el:el-api:jar:1.0
>(provided), commons-logging:commons-logging:jar:[1,) (provided)]
>       at
>org.apache.maven.lifecycle.internal.LifecycleDependencyResolver.getDepen
>dencies(LifecycleDependencyResolver.java:190)
>       at
>org.apache.maven.lifecycle.internal.LifecycleDependencyResolver.resolvePro
>jectDependencies(LifecycleDependencyResolver.java:104)
>       at
>org.apache.maven.lifecycle.internal.MojoExecutor.ensureDependenciesAreR
>esolved(MojoExecutor.java:258)
>       at
>org.apache.maven.lifecycle.internal.MojoExecutor.execute(MojoExecutor.ja
>va:201)
>       at
>org.apache.maven.lifecycle.internal.MojoExecutor.execute(MojoExecutor.ja
>va:153)
>       at
>org.apache.maven.lifecycle.internal.MojoExecutor.execute(MojoExecutor.ja
>va:145)
>       at
>org.apache.maven.lifecycle.internal.LifecycleModuleBuilder.buildProject(Lifec
>ycleModuleBuilder.java:84)
>       at
>org.apache.maven.lifecycle.internal.LifecycleModuleBuilder.buildProject(Lifec
>ycleModuleBuilder.java:59)
>       at
>org.apache.maven.lifecycle.internal.LifecycleStarter.singleThreadedBuild(Life
>cycleStarter.java:183)
>       at
>org.apache.maven.lifecycle.internal.LifecycleStarter.execute(LifecycleStarter.
>java:161)
>       at
>org.apache.maven.DefaultMaven.doExecute(DefaultMaven.java:319)
>       at org.apache.maven.DefaultMaven.execute(DefaultMaven.java:156)
>       at
>org.jvnet.hudson.maven3.launcher.Maven3Launcher.main(Maven3Launcher.
>java:79)
>       at sun.reflect.NativeMethodAccessorImpl.invoke0(Native Method)
>       at
>sun.reflect.NativeMethodAccessorImpl.invoke(NativeMethodAccessorImpl.j
>ava:39)
>       at
>sun.reflect.DelegatingMethodAccessorImpl.invoke(DelegatingMethodAccess
>orImpl.java:25)
>       at java.lang.reflect.Method.invoke(Method.java:597)
>       at
>org.codehaus.plexus.classworlds.launcher.Launcher.launchStandard(Launche
>r.java:329)
>       at
>org.codehaus.plexus.classworlds.launcher.Launcher.launch(Launcher.java:239
>)
>       at
>org.jvnet.hudson.maven3.agent.Maven3Main.launch(Maven3Main.java:158)
>       at hudson.maven.Maven3Builder.call(Maven3Builder.java:121)
>       at hudson.maven.Maven3Builder.call(Maven3Builder.java:73)
>       at hudson.remoting.UserRequest.perform(UserRequest.java:118)
>       at hudson.remoting.UserRequest.perform(UserRequest.java:48)
>       at hudson.remoting.Request$2.run(Request.java:287)
>       at
>java.util.concurrent.Executors$RunnableAdapter.call(Executors.java:441)
>       at
>java.util.concurrent.FutureTask$Sync.innerRun(FutureTask.java:303)
>       at java.util.concurrent.FutureTask.run(FutureTask.java:138)
>       at
>java.util.concurrent.ThreadPoolExecutor$Worker.runTask(ThreadPoolExecuto
>r.java:886)
>       at
>java.util.concurrent.ThreadPoolExecutor$Worker.run(ThreadPoolExecutor.jav
>a:908)
>       at java.lang.Thread.run(Thread.java:619)
>Caused by: org.apache.maven.project.DependencyResolutionException:
>Could not resolve dependencies for project org.apache.rave:rave-
>commons:jar:0.3-incubating-SNAPSHOT: Failed to collect dependencies for
>[org.slf4j:slf4j-api:jar:1.6.1 (compile), org.springframework:spring-
>context:jar:3.0.5.RELEASE (compile), org.springframework:spring-
>orm:jar:3.0.5.RELEASE (compile), org.springframework.security:spring-
>security-web:jar:3.0.5.RELEASE (compile),
>org.apache.openjpa:openjpa:jar:2.1.1 (compile),
>com.h2database:h2:jar:1.3.154 (compile), junit:junit:jar:4.7 (test),
>org.easymock:easymock:jar:3.0 (test), javax.servlet:servlet-api:jar:2.5
>(provided), javax.servlet.jsp:jsp-api:jar:2.1 (provided), javax.el:el-api:jar:1.0
>(provided), commons-logging:commons-logging:jar:[1,) (provided)]
>       at
>org.apache.maven.project.DefaultProjectDependenciesResolver.resolve(Def
>aultProjectDependenciesResolver.java:127)
>       at
>org.apache.maven.lifecycle.internal.LifecycleDependencyResolver.getDepen
>dencies(LifecycleDependencyResolver.java:165)
>       ... 30 more
>Caused by: org.sonatype.aether.collection.DependencyCollectionException:
>Failed to collect dependencies for [org.slf4j:slf4j-api:jar:1.6.1 (compile),
>org.springframework:spring-context:jar:3.0.5.RELEASE (compile),
>org.springframework:spring-orm:jar:3.0.5.RELEASE (compile),
>org.springframework.security:spring-security-web:jar:3.0.5.RELEASE
>(compile), org.apache.openjpa:openjpa:jar:2.1.1 (compile),
>com.h2database:h2:jar:1.3.154 (compile), junit:junit:jar:4.7 (test),
>org.easymock:easymock:jar:3.0 (test), javax.servlet:servlet-api:jar:2.5
>(provided), javax.servlet.jsp:jsp-api:jar:2.1 (provided), javax.el:el-api:jar:1.0
>(provided), commons-logging:commons-logging:jar:[1,) (provided)]
>       at
>org.sonatype.aether.impl.internal.DefaultDependencyCollector.collectDepen
>dencies(DefaultDependencyCollector.java:251)
>       at
>org.sonatype.aether.impl.internal.DefaultRepositorySystem.collectDependen
>cies(DefaultRepositorySystem.java:318)
>       at
>org.apache.maven.project.DefaultProjectDependenciesResolver.resolve(Def
>aultProjectDependenciesResolver.java:119)
>       ... 31 more
>Caused by: org.sonatype.aether.resolution.ArtifactDescriptorException:
>Failed to read artifact descriptor for commons-logging:commons-
>logging:jar:1.1.2-SNAPSHOT
>       at
>org.apache.maven.repository.internal.DefaultArtifactDescriptorReader.loadP
>om(DefaultArtifactDescriptorReader.java:317)
>       at
>org.apache.maven.repository.internal.DefaultArtifactDescriptorReader.readA
>rtifactDescriptor(DefaultArtifactDescriptorReader.java:173)
>       at
>org.sonatype.aether.impl.internal.DefaultDependencyCollector.process(Defa
>ultDependencyCollector.java:419)
>       at
>org.sonatype.aether.impl.internal.DefaultDependencyCollector.collectDepen
>dencies(DefaultDependencyCollector.java:233)
>       ... 33 more
>Caused by:
>org.apache.maven.model.resolution.UnresolvableModelException: Could not
>find artifact org.apache.commons:commons-parent:pom:15
>       at
>org.apache.maven.repository.internal.DefaultModelResolver.resolveModel(
>DefaultModelResolver.java:119)
>       at
>org.apache.maven.model.building.DefaultModelBuilder.readParentExternally
>(DefaultModelBuilder.java:819)
>       at
>org.apache.maven.model.building.DefaultModelBuilder.readParent(Default
>ModelBuilder.java:670)
>       at
>org.apache.maven.model.building.DefaultModelBuilder.build(DefaultModelB
>uilder.java:308)
>       at
>org.apache.maven.model.building.DefaultModelBuilder.build(DefaultModelB
>uilder.java:232)
>       at
>org.apache.maven.repository.internal.DefaultArtifactDescriptorReader.loadP
>om(DefaultArtifactDescriptorReader.java:308)
>       ... 36 more
>Caused by: org.sonatype.aether.resolution.ArtifactResolutionException:
>Could not find artifact org.apache.commons:commons-parent:pom:15
>       at
>org.sonatype.aether.impl.internal.DefaultArtifactResolver.resolveArtifacts(De
>faultArtifactResolver.java:526)
>       at
>org.sonatype.aether.impl.internal.DefaultArtifactResolver.resolveArtifact(Def
>aultArtifactResolver.java:214)
>       at
>org.apache.maven.repository.internal.DefaultModelResolver.resolveModel(
>DefaultModelResolver.java:115)
>       ... 41 more
>Caused by: org.sonatype.aether.transfer.ArtifactNotFoundException: Could
>not find artifact org.apache.commons:commons-parent:pom:15
>       at
>org.sonatype.aether.impl.internal.DefaultArtifactResolver.resolveArtifacts(De
>faultArtifactResolver.java:517)
>       ... 43 more
>Sending e-mails to: rave-commits@incubator.apache.org
>channel stopped
>[locks-and-latches] Releasing all the locks
>[locks-and-latches] All the locks released