You are viewing a plain text version of this content. The canonical link for it is here.
Posted to dev@lucene.apache.org by Charlie Cron <hu...@gmail.com> on 2012/10/28 02:34:29 UTC

Build failed in Jenkins: fast-io-beasting #6067

See <http://sierranevada.servebeer.com/job/fast-io-beasting/6067/>

------------------------------------------
[...truncated 13470 lines...]
[junit4:junit4]   2> 7222453 T48 oascc.SolrZkClient.makePath makePath: /overseer_elect/leader
[junit4:junit4]   2> 7222457 T48 oasc.Overseer.start Overseer (id=88564332466470914-127.0.0.1:7000_solr-n_0000000000) starting
[junit4:junit4]   2> 7222458 T84 oazs.PrepRequestProcessor.pRequest Got user-level KeeperException when processing sessionid:0x13aa4ca886f0002 type:create cxid:0x1a zxid:0xfffffffffffffffe txntype:unknown reqpath:n/a Error Path:/solr/overseer Error:KeeperErrorCode = NodeExists for /solr/overseer
[junit4:junit4]   2> 7222460 T84 oazs.PrepRequestProcessor.pRequest Got user-level KeeperException when processing sessionid:0x13aa4ca886f0002 type:create cxid:0x1b zxid:0xfffffffffffffffe txntype:unknown reqpath:n/a Error Path:/solr/overseer Error:KeeperErrorCode = NodeExists for /solr/overseer
[junit4:junit4]   2> 7222461 T84 oazs.PrepRequestProcessor.pRequest Got user-level KeeperException when processing sessionid:0x13aa4ca886f0002 type:create cxid:0x1c zxid:0xfffffffffffffffe txntype:unknown reqpath:n/a Error Path:/solr/overseer Error:KeeperErrorCode = NodeExists for /solr/overseer
[junit4:junit4]   2> 7222466 T84 oazs.PrepRequestProcessor.pRequest Got user-level KeeperException when processing sessionid:0x13aa4ca886f0002 type:create cxid:0x1d zxid:0xfffffffffffffffe txntype:unknown reqpath:n/a Error Path:/solr/overseer Error:KeeperErrorCode = NodeExists for /solr/overseer
[junit4:junit4]   2> 7222467 T92 oasc.OverseerCollectionProcessor.run Process current queue of collection creations
[junit4:junit4]   2> 7222468 T48 oascc.SolrZkClient.makePath makePath: /clusterstate.json
[junit4:junit4]   2> 7222472 T48 oascc.ZkStateReader.createClusterStateWatchersAndUpdate Updating cluster state from ZooKeeper... 
[junit4:junit4]   2> 7222474 T91 oasc.Overseer$ClusterStateUpdater.run Starting to work on the main queue
[junit4:junit4]   2> 7222478 T48 oasc.CoreContainer.create Creating SolrCore 'collection1' using instanceDir: <http://sierranevada.servebeer.com/job/fast-io-beasting/ws/solr/build/solr-core/test-files/solr/collection1>
[junit4:junit4]   2> 7222478 T48 oasc.ZkController.createCollectionZkNode Check for collection zkNode:collection1
[junit4:junit4]   2> 7222479 T48 oasc.ZkController.createCollectionZkNode Collection zkNode exists
[junit4:junit4]   2> 7222479 T48 oasc.ZkController.readConfigName Load collection config from:/collections/collection1
[junit4:junit4]   2> 7222481 T48 oasc.SolrResourceLoader.<init> new SolrResourceLoader for directory: '<http://sierranevada.servebeer.com/job/fast-io-beasting/ws/solr/build/solr-core/test-files/solr/collection1/'>
[junit4:junit4]   2> 7222481 T48 oasc.SolrResourceLoader.replaceClassLoader Adding '<http://sierranevada.servebeer.com/job/fast-io-beasting/ws/solr/build/solr-core/test-files/solr/collection1/lib/classes/'> to classloader
[junit4:junit4]   2> 7222482 T48 oasc.SolrResourceLoader.replaceClassLoader Adding '<http://sierranevada.servebeer.com/job/fast-io-beasting/ws/solr/build/solr-core/test-files/solr/collection1/lib/README'> to classloader
[junit4:junit4]   2> 7222506 T48 oasc.SolrConfig.<init> Using Lucene MatchVersion: LUCENE_41
[junit4:junit4]   2> 7222527 T48 oasc.SolrConfig.<init> Loaded SolrConfig: solrconfig.xml
[junit4:junit4]   2> 7222529 T48 oass.IndexSchema.readSchema Reading Solr Schema
[junit4:junit4]   2> 7222531 T48 oass.IndexSchema.readSchema Schema name=test
[junit4:junit4]   2> 7222718 T48 oass.OpenExchangeRatesOrgProvider.init Initialized with rates=open-exchange-rates.json, refreshInterval=1440.
[junit4:junit4]   2> 7222722 T48 oass.IndexSchema.readSchema default search field in schema is text
[junit4:junit4]   2> 7222723 T48 oass.IndexSchema.readSchema unique key field: id
[junit4:junit4]   2> 7222725 T48 oasc.CoreContainer.create SEVERE Unable to create core: collection1 java.lang.RuntimeException: java.io.IOException: Error opening /configs/conf1/stopwords.txt
[junit4:junit4]   2> 	at org.apache.solr.schema.IndexSchema.<init>(IndexSchema.java:116)
[junit4:junit4]   2> 	at org.apache.solr.core.CoreContainer.getSchemaFromZk(CoreContainer.java:1434)
[junit4:junit4]   2> 	at org.apache.solr.core.CoreContainer.create(CoreContainer.java:825)
[junit4:junit4]   2> 	at org.apache.solr.core.CoreContainer.load(CoreContainer.java:529)
[junit4:junit4]   2> 	at org.apache.solr.core.CoreContainer.load(CoreContainer.java:351)
[junit4:junit4]   2> 	at org.apache.solr.core.CoreContainer$Initializer.initialize(CoreContainer.java:303)
[junit4:junit4]   2> 	at org.apache.solr.cloud.LeaderElectionIntegrationTest.setupContainer(LeaderElectionIntegrationTest.java:152)
[junit4:junit4]   2> 	at org.apache.solr.cloud.LeaderElectionIntegrationTest.setUp(LeaderElectionIntegrationTest.java:100)
[junit4:junit4]   2> 	at sun.reflect.NativeMethodAccessorImpl.invoke0(Native Method)
[junit4:junit4]   2> 	at sun.reflect.NativeMethodAccessorImpl.invoke(NativeMethodAccessorImpl.java:39)
[junit4:junit4]   2> 	at sun.reflect.DelegatingMethodAccessorImpl.invoke(DelegatingMethodAccessorImpl.java:25)
[junit4:junit4]   2> 	at java.lang.reflect.Method.invoke(Method.java:597)
[junit4:junit4]   2> 	at com.carrotsearch.randomizedtesting.RandomizedRunner.invoke(RandomizedRunner.java:1559)
[junit4:junit4]   2> 	at com.carrotsearch.randomizedtesting.RandomizedRunner.access$600(RandomizedRunner.java:79)
[junit4:junit4]   2> 	at com.carrotsearch.randomizedtesting.RandomizedRunner$7.evaluate(RandomizedRunner.java:771)
[junit4:junit4]   2> 	at com.carrotsearch.randomizedtesting.RandomizedRunner$8.evaluate(RandomizedRunner.java:787)
[junit4:junit4]   2> 	at com.carrotsearch.randomizedtesting.rules.SystemPropertiesRestoreRule$1.evaluate(SystemPropertiesRestoreRule.java:53)
[junit4:junit4]   2> 	at org.apache.lucene.util.TestRuleSetupTeardownChained$1.evaluate(TestRuleSetupTeardownChained.java:50)
[junit4:junit4]   2> 	at org.apache.lucene.util.TestRuleFieldCacheSanity$1.evaluate(TestRuleFieldCacheSanity.java:51)
[junit4:junit4]   2> 	at org.apache.lucene.util.AbstractBeforeAfterRule$1.evaluate(AbstractBeforeAfterRule.java:45)
[junit4:junit4]   2> 	at com.carrotsearch.randomizedtesting.rules.SystemPropertiesInvariantRule$1.evaluate(SystemPropertiesInvariantRule.java:55)
[junit4:junit4]   2> 	at org.apache.lucene.util.TestRuleThreadAndTestName$1.evaluate(TestRuleThreadAndTestName.java:48)
[junit4:junit4]   2> 	at org.apache.lucene.util.TestRuleIgnoreAfterMaxFailures$1.evaluate(TestRuleIgnoreAfterMaxFailures.java:70)
[junit4:junit4]   2> 	at org.apache.lucene.util.TestRuleMarkFailure$1.evaluate(TestRuleMarkFailure.java:48)
[junit4:junit4]   2> 	at com.carrotsearch.randomizedtesting.rules.StatementAdapter.evaluate(StatementAdapter.java:36)
[junit4:junit4]   2> 	at com.carrotsearch.randomizedtesting.ThreadLeakControl$StatementRunner.run(ThreadLeakControl.java:358)
[junit4:junit4]   2> 	at com.carrotsearch.randomizedtesting.ThreadLeakControl.forkTimeoutingTask(ThreadLeakControl.java:782)
[junit4:junit4]   2> 	at com.carrotsearch.randomizedtesting.ThreadLeakControl$3.evaluate(ThreadLeakControl.java:442)
[junit4:junit4]   2> 	at com.carrotsearch.randomizedtesting.RandomizedRunner.runSingleTest(RandomizedRunner.java:746)
[junit4:junit4]   2> 	at com.carrotsearch.randomizedtesting.RandomizedRunner$3.evaluate(RandomizedRunner.java:648)
[junit4:junit4]   2> 	at com.carrotsearch.randomizedtesting.RandomizedRunner$4.evaluate(RandomizedRunner.java:682)
[junit4:junit4]   2> 	at com.carrotsearch.randomizedtesting.RandomizedRunner$5.evaluate(RandomizedRunner.java:693)
[junit4:junit4]   2> 	at com.carrotsearch.randomizedtesting.rules.StatementAdapter.evaluate(StatementAdapter.java:36)
[junit4:junit4]   2> 	at com.carrotsearch.randomizedtesting.rules.SystemPropertiesRestoreRule$1.evaluate(SystemPropertiesRestoreRule.java:53)
[junit4:junit4]   2> 	at org.apache.lucene.util.AbstractBeforeAfterRule$1.evaluate(AbstractBeforeAfterRule.java:45)
[junit4:junit4]   2> 	at org.apache.lucene.util.TestRuleStoreClassName$1.evaluate(TestRuleStoreClassName.java:42)
[junit4:junit4]   2> 	at com.carrotsearch.randomizedtesting.rules.SystemPropertiesInvariantRule$1.evaluate(SystemPropertiesInvariantRule.java:55)
[junit4:junit4]   2> 	at com.carrotsearch.randomizedtesting.rules.NoShadowingOrOverridesOnMethodsRule$1.evaluate(NoShadowingOrOverridesOnMethodsRule.java:39)
[junit4:junit4]   2> 	at com.carrotsearch.randomizedtesting.rules.NoShadowingOrOverridesOnMethodsRule$1.evaluate(NoShadowingOrOverridesOnMethodsRule.java:39)
[junit4:junit4]   2> 	at com.carrotsearch.randomizedtesting.rules.StatementAdapter.evaluate(StatementAdapter.java:36)
[junit4:junit4]   2> 	at org.apache.lucene.util.TestRuleAssertionsRequired$1.evaluate(TestRuleAssertionsRequired.java:43)
[junit4:junit4]   2> 	at org.apache.lucene.util.TestRuleMarkFailure$1.evaluate(TestRuleMarkFailure.java:48)
[junit4:junit4]   2> 	at org.apache.lucene.util.TestRuleIgnoreAfterMaxFailures$1.evaluate(TestRuleIgnoreAfterMaxFailures.java:70)
[junit4:junit4]   2> 	at org.apache.lucene.util.TestRuleIgnoreTestSuites$1.evaluate(TestRuleIgnoreTestSuites.java:55)
[junit4:junit4]   2> 	at com.carrotsearch.randomizedtesting.rules.StatementAdapter.evaluate(StatementAdapter.java:36)
[junit4:junit4]   2> 	at com.carrotsearch.randomizedtesting.ThreadLeakControl$StatementRunner.run(ThreadLeakControl.java:358)
[junit4:junit4]   2> 	at java.lang.Thread.run(Thread.java:662)
[junit4:junit4]   2> Caused by: java.io.IOException: Error opening /configs/conf1/stopwords.txt
[junit4:junit4]   2> 	at org.apache.solr.cloud.ZkSolrResourceLoader.openResource(ZkSolrResourceLoader.java:82)
[junit4:junit4]   2> 	at org.apache.lucene.analysis.util.AbstractAnalysisFactory.getLines(AbstractAnalysisFactory.java:163)
[junit4:junit4]   2> 	at org.apache.lucene.analysis.util.AbstractAnalysisFactory.getWordSet(AbstractAnalysisFactory.java:151)
[junit4:junit4]   2> 	at org.apache.lucene.analysis.core.StopFilterFactory.inform(StopFilterFactory.java:58)
[junit4:junit4]   2> 	at org.apache.solr.core.SolrResourceLoader.inform(SolrResourceLoader.java:611)
[junit4:junit4]   2> 	at org.apache.solr.schema.IndexSchema.<init>(IndexSchema.java:114)
[junit4:junit4]   2> 	... 46 more
[junit4:junit4]   2> Caused by: java.lang.InterruptedException
[junit4:junit4]   2> 	at java.lang.Object.wait(Native Method)
[junit4:junit4]   2> 	at java.lang.Object.wait(Object.java:485)
[junit4:junit4]   2> 	at org.apache.zookeeper.ClientCnxn.submitRequest(ClientCnxn.java:1345)
[junit4:junit4]   2> 	at org.apache.zookeeper.ZooKeeper.exists(ZooKeeper.java:810)
[junit4:junit4]   2> 	at org.apache.solr.common.cloud.SolrZkClient$4.execute(SolrZkClient.java:193)
[junit4:junit4]   2> 	at org.apache.solr.common.cloud.SolrZkClient$4.execute(SolrZkClient.java:190)
[junit4:junit4]   2> 	at org.apache.solr.common.cloud.ZkCmdExecutor.retryOperation(ZkCmdExecutor.java:63)
[junit4:junit4]   2> 	at org.apache.solr.common.cloud.SolrZkClient.exists(SolrZkClient.java:190)
[junit4:junit4]   2> 	at org.apache.solr.cloud.ZkController.pathExists(ZkController.java:493)
[junit4:junit4]   2> 	at org.apache.solr.cloud.ZkSolrResourceLoader.openResource(ZkSolrResourceLoader.java:77)
[junit4:junit4]   2> 	... 51 more
[junit4:junit4]   2> 
[junit4:junit4]   2> 7222726 T48 oasc.SolrException.log SEVERE null:java.lang.RuntimeException: java.io.IOException: Error opening /configs/conf1/stopwords.txt
[junit4:junit4]   2> 		at org.apache.solr.schema.IndexSchema.<init>(IndexSchema.java:116)
[junit4:junit4]   2> 		at org.apache.solr.core.CoreContainer.getSchemaFromZk(CoreContainer.java:1434)
[junit4:junit4]   2> 		at org.apache.solr.core.CoreContainer.create(CoreContainer.java:825)
[junit4:junit4]   2> 		at org.apache.solr.core.CoreContainer.load(CoreContainer.java:529)
[junit4:junit4]   2> 		at org.apache.solr.core.CoreContainer.load(CoreContainer.java:351)
[junit4:junit4]   2> 		at org.apache.solr.core.CoreContainer$Initializer.initialize(CoreContainer.java:303)
[junit4:junit4]   2> 		at org.apache.solr.cloud.LeaderElectionIntegrationTest.setupContainer(LeaderElectionIntegrationTest.java:152)
[junit4:junit4]   2> 		at org.apache.solr.cloud.LeaderElectionIntegrationTest.setUp(LeaderElectionIntegrationTest.java:100)
[junit4:junit4]   2> 		at sun.reflect.NativeMethodAccessorImpl.invoke0(Native Method)
[junit4:junit4]   2> 		at sun.reflect.NativeMethodAccessorImpl.invoke(NativeMethodAccessorImpl.java:39)
[junit4:junit4]   2> 		at sun.reflect.DelegatingMethodAccessorImpl.invoke(DelegatingMethodAccessorImpl.java:25)
[junit4:junit4]   2> 		at java.lang.reflect.Method.invoke(Method.java:597)
[junit4:junit4]   2> 		at com.carrotsearch.randomizedtesting.RandomizedRunner.invoke(RandomizedRunner.java:1559)
[junit4:junit4]   2> 		at com.carrotsearch.randomizedtesting.RandomizedRunner.access$600(RandomizedRunner.java:79)
[junit4:junit4]   2> 		at com.carrotsearch.randomizedtesting.RandomizedRunner$7.evaluate(RandomizedRunner.java:771)
[junit4:junit4]   2> 		at com.carrotsearch.randomizedtesting.RandomizedRunner$8.evaluate(RandomizedRunner.java:787)
[junit4:junit4]   2> 		at com.carrotsearch.randomizedtesting.rules.SystemPropertiesRestoreRule$1.evaluate(SystemPropertiesRestoreRule.java:53)
[junit4:junit4]   2> 		at org.apache.lucene.util.TestRuleSetupTeardownChained$1.evaluate(TestRuleSetupTeardownChained.java:50)
[junit4:junit4]   2> 		at org.apache.lucene.util.TestRuleFieldCacheSanity$1.evaluate(TestRuleFieldCacheSanity.java:51)
[junit4:junit4]   2> 		at org.apache.lucene.util.AbstractBeforeAfterRule$1.evaluate(AbstractBeforeAfterRule.java:45)
[junit4:junit4]   2> 		at com.carrotsearch.randomizedtesting.rules.SystemPropertiesInvariantRule$1.evaluate(SystemPropertiesInvariantRule.java:55)
[junit4:junit4]   2> 		at org.apache.lucene.util.TestRuleThreadAndTestName$1.evaluate(TestRuleThreadAndTestName.java:48)
[junit4:junit4]   2> 		at org.apache.lucene.util.TestRuleIgnoreAfterMaxFailures$1.evaluate(TestRuleIgnoreAfterMaxFailures.java:70)
[junit4:junit4]   2> 		at org.apache.lucene.util.TestRuleMarkFailure$1.evaluate(TestRuleMarkFailure.java:48)
[junit4:junit4]   2> 		at com.carrotsearch.randomizedtesting.rules.StatementAdapter.evaluate(StatementAdapter.java:36)
[junit4:junit4]   2> 		at com.carrotsearch.randomizedtesting.ThreadLeakControl$StatementRunner.run(ThreadLeakControl.java:358)
[junit4:junit4]   2> 		at com.carrotsearch.randomizedtesting.ThreadLeakControl.forkTimeoutingTask(ThreadLeakControl.java:782)
[junit4:junit4]   2> 		at com.carrotsearch.randomizedtesting.ThreadLeakControl$3.evaluate(ThreadLeakControl.java:442)
[junit4:junit4]   2> 		at com.carrotsearch.randomizedtesting.RandomizedRunner.runSingleTest(RandomizedRunner.java:746)
[junit4:junit4]   2> 		at com.carrotsearch.randomizedtesting.RandomizedRunner$3.evaluate(RandomizedRunner.java:648)
[junit4:junit4]   2> 		at com.carrotsearch.randomizedtesting.RandomizedRunner$4.evaluate(RandomizedRunner.java:682)
[junit4:junit4]   2> 		at com.carrotsearch.randomizedtesting.RandomizedRunner$5.evaluate(RandomizedRunner.java:693)
[junit4:junit4]   2> 		at com.carrotsearch.randomizedtesting.rules.StatementAdapter.evaluate(StatementAdapter.java:36)
[junit4:junit4]   2> 		at com.carrotsearch.randomizedtesting.rules.SystemPropertiesRestoreRule$1.evaluate(SystemPropertiesRestoreRule.java:53)
[junit4:junit4]   2> 		at org.apache.lucene.util.AbstractBeforeAfterRule$1.evaluate(AbstractBeforeAfterRule.java:45)
[junit4:junit4]   2> 		at org.apache.lucene.util.TestRuleStoreClassName$1.evaluate(TestRuleStoreClassName.java:42)
[junit4:junit4]   2> 		at com.carrotsearch.randomizedtesting.rules.SystemPropertiesInvariantRule$1.evaluate(SystemPropertiesInvariantRule.java:55)
[junit4:junit4]   2> 		at com.carrotsearch.randomizedtesting.rules.NoShadowingOrOverridesOnMethodsRule$1.evaluate(NoShadowingOrOverridesOnMethodsRule.java:39)
[junit4:junit4]   2> 		at com.carrotsearch.randomizedtesting.rules.NoShadowingOrOverridesOnMethodsRule$1.evaluate(NoShadowingOrOverridesOnMethodsRule.java:39)
[junit4:junit4]   2> 		at com.carrotsearch.randomizedtesting.rules.StatementAdapter.evaluate(StatementAdapter.java:36)
[junit4:junit4]   2> 		at org.apache.lucene.util.TestRuleAssertionsRequired$1.evaluate(TestRuleAssertionsRequired.java:43)
[junit4:junit4]   2> 		at org.apache.lucene.util.TestRuleMarkFailure$1.evaluate(TestRuleMarkFailure.java:48)
[junit4:junit4]   2> 		at org.apache.lucene.util.TestRuleIgnoreAfterMaxFailures$1.evaluate(TestRuleIgnoreAfterMaxFailures.java:70)
[junit4:junit4]   2> 		at org.apache.lucene.util.TestRuleIgnoreTestSuites$1.evaluate(TestRuleIgnoreTestSuites.java:55)
[junit4:junit4]   2> 		at com.carrotsearch.randomizedtesting.rules.StatementAdapter.evaluate(StatementAdapter.java:36)
[junit4:junit4]   2> 		at com.carrotsearch.randomizedtesting.ThreadLeakControl$StatementRunner.run(ThreadLeakControl.java:358)
[junit4:junit4]   2> 		at java.lang.Thread.run(Thread.java:662)
[junit4:junit4]   2> 	Caused by: java.io.IOException: Error opening /configs/conf1/stopwords.txt
[junit4:junit4]   2> 		at org.apache.solr.cloud.ZkSolrResourceLoader.openResource(ZkSolrResourceLoader.java:82)
[junit4:junit4]   2> 		at org.apache.lucene.analysis.util.AbstractAnalysisFactory.getLines(AbstractAnalysisFactory.java:163)
[junit4:junit4]   2> 		at org.apache.lucene.analysis.util.AbstractAnalysisFactory.getWordSet(AbstractAnalysisFactory.java:151)
[junit4:junit4]   2> 		at org.apache.lucene.analysis.core.StopFilterFactory.inform(StopFilterFactory.java:58)
[junit4:junit4]   2> 		at org.apache.solr.core.SolrResourceLoader.inform(SolrResourceLoader.java:611)
[junit4:junit4]   2> 		at org.apache.solr.schema.IndexSchema.<init>(IndexSchema.java:114)
[junit4:junit4]   2> 		... 46 more
[junit4:junit4]   2> 	Caused by: java.lang.InterruptedException
[junit4:junit4]   2> 		at java.lang.Object.wait(Native Method)
[junit4:junit4]   2> 		at java.lang.Object.wait(Object.java:485)
[junit4:junit4]   2> 		at org.apache.zookeeper.ClientCnxn.submitRequest(ClientCnxn.java:1345)
[junit4:junit4]   2> 		at org.apache.zookeeper.ZooKeeper.exists(ZooKeeper.java:810)
[junit4:junit4]   2> 		at org.apache.solr.common.cloud.SolrZkClient$4.execute(SolrZkClient.java:193)
[junit4:junit4]   2> 		at org.apache.solr.common.cloud.SolrZkClient$4.execute(SolrZkClient.java:190)
[junit4:junit4]   2> 		at org.apache.solr.common.cloud.ZkCmdExecutor.retryOperation(ZkCmdExecutor.java:63)
[junit4:junit4]   2> 		at org.apache.solr.common.cloud.SolrZkClient.exists(SolrZkClient.java:190)
[junit4:junit4]   2> 		at org.apache.solr.cloud.ZkController.pathExists(ZkController.java:493)
[junit4:junit4]   2> 		at org.apache.solr.cloud.ZkSolrResourceLoader.openResource(ZkSolrResourceLoader.java:77)
[junit4:junit4]   2> 		... 51 more
[junit4:junit4]   2> 	
[junit4:junit4]   2> 7222727 T48 oasc.LeaderElectionIntegrationTest.setUp SEVERE !!!Could not start container:7000 The exception thrown was: class java.lang.AssertionError Container 7000 has no cores!
[junit4:junit4]   2> 7222728 T83 oazs.SyncRequestProcessor.run SyncRequestProcessor exited!
[junit4:junit4]   2> 7222729 T84 oazs.PrepRequestProcessor.run PrepRequestProcessor exited loop!
[junit4:junit4]   2> 7222729 T48 oazs.FinalRequestProcessor.shutdown shutdown of request processor complete
[junit4:junit4]   2> 7222773 T48 oazs.NIOServerCnxn.closeSock Closed socket connection for client /127.0.0.1:47108 which had sessionid 0x13aa4ca886f0002
[junit4:junit4]   2> 7222774 T81 oazs.NIOServerCnxn$Factory.run NIOServerCnxn factory exited run method
[junit4:junit4]   2> 7222774 T89 oaz.ClientCnxn$SendThread.run Unable to read additional data from server sessionid 0x13aa4ca886f0002, likely server has closed socket, closing socket connection and attempting reconnect
[junit4:junit4]   2> 7222775 T48 oazs.FinalRequestProcessor.shutdown shutdown of request processor complete
[junit4:junit4]   2> 7222776 T48 oas.SolrTestCaseJ4.tearDown ###Ending testSimpleSliceLeaderElection
[junit4:junit4]   2> 7222876 T90 oascc.ConnectionManager.process Watcher org.apache.solr.common.cloud.ConnectionManager@2628de85 name:ZooKeeperConnection Watcher:127.0.0.1:38774/solr got event WatchedEvent state:Disconnected type:None path:null path:null type:None
[junit4:junit4]   2> 7222876 T90 oascc.ConnectionManager.process zkClient has disconnected
[junit4:junit4]   2> 7223136 T47 ccr.ThreadLeakControl.tryToInterruptAll SEVERE There are still zombie threads that couldn't be terminated:
[junit4:junit4]   2> 	   1) Thread[id=48, name=SUITE-LeaderElectionIntegrationTest-seed#[734A46D52F0BDDA5]-worker, state=TIMED_WAITING, group=TGRP-LeaderElectionIntegrationTest]
[junit4:junit4]   2> 	        at java.lang.Thread.sleep(Native Method)
[junit4:junit4]   2> 	        at org.apache.solr.cloud.LeaderElectionIntegrationTest.afterClass(LeaderElectionIntegrationTest.java:317)
[junit4:junit4]   2> 	        at sun.reflect.NativeMethodAccessorImpl.invoke0(Native Method)
[junit4:junit4]   2> 	        at sun.reflect.NativeMethodAccessorImpl.invoke(NativeMethodAccessorImpl.java:39)
[junit4:junit4]   2> 	        at sun.reflect.DelegatingMethodAccessorImpl.invoke(DelegatingMethodAccessorImpl.java:25)
[junit4:junit4]   2> 	        at java.lang.reflect.Method.invoke(Method.java:597)
[junit4:junit4]   2> 	        at com.carrotsearch.randomizedtesting.RandomizedRunner.invoke(RandomizedRunner.java:1559)
[junit4:junit4]   2> 	        at com.carrotsearch.randomizedtesting.RandomizedRunner.access$600(RandomizedRunner.java:79)
[junit4:junit4]   2> 	        at com.carrotsearch.randomizedtesting.RandomizedRunner$5.evaluate(RandomizedRunner.java:700)
[junit4:junit4]   2> 	        at com.carrotsearch.randomizedtesting.rules.StatementAdapter.evaluate(StatementAdapter.java:36)
[junit4:junit4]   2> 	        at com.carrotsearch.randomizedtesting.rules.SystemPropertiesRestoreRule$1.evaluate(SystemPropertiesRestoreRule.java:53)
[junit4:junit4]   2> 	        at org.apache.lucene.util.AbstractBeforeAfterRule$1.evaluate(AbstractBeforeAfterRule.java:45)
[junit4:junit4]   2> 	        at org.apache.lucene.util.TestRuleStoreClassName$1.evaluate(TestRuleStoreClassName.java:42)
[junit4:junit4]   2> 	        at com.carrotsearch.randomizedtesting.rules.SystemPropertiesInvariantRule$1.evaluate(SystemPropertiesInvariantRule.java:55)
[junit4:junit4]   2> 	        at com.carrotsearch.randomizedtesting.rules.NoShadowingOrOverridesOnMethodsRule$1.evaluate(NoShadowingOrOverridesOnMethodsRule.java:39)
[junit4:junit4]   2> 	        at com.carrotsearch.randomizedtesting.rules.NoShadowingOrOverridesOnMethodsRule$1.evaluate(NoShadowingOrOverridesOnMethodsRule.java:39)
[junit4:junit4]   2> 	        at com.carrotsearch.randomizedtesting.rules.StatementAdapter.evaluate(StatementAdapter.java:36)
[junit4:junit4]   2> 	        at org.apache.lucene.util.TestRuleAssertionsRequired$1.evaluate(TestRuleAssertionsRequired.java:43)
[junit4:junit4]   2> 	        at org.apache.lucene.util.TestRuleMarkFailure$1.evaluate(TestRuleMarkFailure.java:48)
[junit4:junit4]   2> 	        at org.apache.lucene.util.TestRuleIgnoreAfterMaxFailures$1.evaluate(TestRuleIgnoreAfterMaxFailures.java:70)
[junit4:junit4]   2> 	        at org.apache.lucene.util.TestRuleIgnoreTestSuites$1.evaluate(TestRuleIgnoreTestSuites.java:55)
[junit4:junit4]   2> 	        at com.carrotsearch.randomizedtesting.rules.StatementAdapter.evaluate(StatementAdapter.java:36)
[junit4:junit4]   2> 	        at com.carrotsearch.randomizedtesting.ThreadLeakControl$StatementRunner.run(ThreadLeakControl.java:358)
[junit4:junit4]   2> 	        at java.lang.Thread.run(Thread.java:662)
[junit4:junit4]   2> NOTE: test params are: codec=Lucene3x, sim=RandomSimilarityProvider(queryNorm=true,coord=no): {}, locale=fr_LU, timezone=America/Cambridge_Bay
[junit4:junit4]   2> NOTE: Linux 3.2.0-24-generic amd64/Sun Microsystems Inc. 1.6.0_27 (64-bit)/cpus=8,threads=9,free=197257984,total=280100864
[junit4:junit4]   2> NOTE: All tests run in this JVM: [MinimalSchemaTest, TestBM25SimilarityFactory, TestNumberUtils, ConvertedLegacyTest, FileUtilsTest, TestWriterPerf, TestXIncludeConfig, SoftAutoCommitTest, HighlighterConfigTest, TestSolr4Spatial, LeaderElectionIntegrationTest]
[junit4:junit4]   2> NOTE: reproduce with: ant test  -Dtestcase=LeaderElectionIntegrationTest -Dtests.seed=734A46D52F0BDDA5 -Dtests.slow=true -Dtests.locale=fr_LU -Dtests.timezone=America/Cambridge_Bay -Dtests.file.encoding=UTF-8
[junit4:junit4] ERROR   0.00s J6 | LeaderElectionIntegrationTest (suite) <<<
[junit4:junit4]    > Throwable #1: java.lang.Exception: Suite timeout exceeded (>= 7200000 msec).
[junit4:junit4]    > 	at __randomizedtesting.SeedInfo.seed([734A46D52F0BDDA5]:0)
[junit4:junit4] Completed on J6 in 7223.20s, 1 test, 2 errors <<< FAILURES!
[junit4:junit4] 
[junit4:junit4] Suite: org.apache.solr.cloud.TestMultiCoreConfBootstrap
[junit4:junit4] Completed on J6 in 0.01s, 1 test, 1 skipped
[junit4:junit4] 
[junit4:junit4] Suite: org.apache.solr.internal.csv.CSVParserTest
[junit4:junit4] Completed on J6 in 0.02s, 23 tests
[junit4:junit4] 
[junit4:junit4] Suite: org.apache.solr.schema.PolyFieldTest
[junit4:junit4] Completed on J6 in 0.01s, 4 tests, 4 skipped
[junit4:junit4] 
[junit4:junit4] Suite: org.apache.solr.search.TestRealTimeGet
[junit4:junit4] Completed on J6 in 0.01s, 4 tests, 4 skipped
[junit4:junit4] 
[junit4:junit4] Suite: org.apache.solr.handler.component.TermsComponentTest
[junit4:junit4] Completed on J6 in 0.02s, 13 tests, 13 skipped
[junit4:junit4] 
[junit4:junit4] 
[junit4:junit4] Tests with failures:
[junit4:junit4]   - org.apache.solr.cloud.LeaderElectionIntegrationTest.testLeaderElectionAfterClientTimeout
[junit4:junit4]   - org.apache.solr.cloud.LeaderElectionIntegrationTest (suite)
[junit4:junit4] 
[junit4:junit4] 
[junit4:junit4] JVM J0:     1.10 ..   156.85 =   155.76s
[junit4:junit4] JVM J1:     1.10 ..   140.71 =   139.61s
[junit4:junit4] JVM J2:     0.86 ..   116.24 =   115.38s
[junit4:junit4] JVM J3:     1.10 ..   112.74 =   111.64s
[junit4:junit4] JVM J4:     1.10 ..   142.85 =   141.76s
[junit4:junit4] JVM J5:     0.87 ..   124.40 =   123.53s
[junit4:junit4] JVM J6:     1.10 ..  7263.13 =  7262.03s
[junit4:junit4] JVM J7:     0.86 ..   113.30 =   112.44s
[junit4:junit4] Execution time total: 2 hours 1 minute 3 seconds
[junit4:junit4] Tests summary: 233 suites, 964 tests, 1 suite-level error, 1 error, 29 ignored (2 assumptions)

BUILD FAILED
<http://sierranevada.servebeer.com/job/fast-io-beasting/ws/build.xml>:39: The following error occurred while executing this line:
<http://sierranevada.servebeer.com/job/fast-io-beasting/ws/solr/build.xml>:178: The following error occurred while executing this line:
<http://sierranevada.servebeer.com/job/fast-io-beasting/ws/lucene/module-build.xml>:61: The following error occurred while executing this line:
<http://sierranevada.servebeer.com/job/fast-io-beasting/ws/lucene/common-build.xml>:1159: The following error occurred while executing this line:
<http://sierranevada.servebeer.com/job/fast-io-beasting/ws/lucene/common-build.xml>:827: There were test failures: 233 suites, 964 tests, 1 suite-level error, 1 error, 29 ignored (2 assumptions)

Total time: 125 minutes 54 seconds
Build step 'Invoke Ant' marked build as failure

---------------------------------------------------------------------
To unsubscribe, e-mail: dev-unsubscribe@lucene.apache.org
For additional commands, e-mail: dev-help@lucene.apache.org


Jenkins build is back to normal : fast-io-beasting #6069

Posted by Charlie Cron <hu...@gmail.com>.
See <http://sierranevada.servebeer.com/job/fast-io-beasting/6069/>


---------------------------------------------------------------------
To unsubscribe, e-mail: dev-unsubscribe@lucene.apache.org
For additional commands, e-mail: dev-help@lucene.apache.org


Build failed in Jenkins: fast-io-beasting #6068

Posted by Charlie Cron <hu...@gmail.com>.
See <http://sierranevada.servebeer.com/job/fast-io-beasting/6068/>

------------------------------------------
[...truncated 14561 lines...]
[junit4:junit4]   2> 7220160 T203 oaz.ClientCnxn$SendThread.run WARNING Session 0x13aa4d0ac120006 for server localhost.localdomain/127.0.0.1:54249, unexpected error, closing socket connection and attempting reconnect java.nio.channels.ClosedByInterruptException
[junit4:junit4]   2> 	at java.nio.channels.spi.AbstractInterruptibleChannel.end(AbstractInterruptibleChannel.java:184)
[junit4:junit4]   2> 	at sun.nio.ch.SocketChannelImpl.read(SocketChannelImpl.java:270)
[junit4:junit4]   2> 	at org.apache.zookeeper.ClientCnxn$SendThread.doIO(ClientCnxn.java:856)
[junit4:junit4]   2> 	at org.apache.zookeeper.ClientCnxn$SendThread.run(ClientCnxn.java:1154)
[junit4:junit4]   2> 
[junit4:junit4]   2> 7220160 T181 oazs.NIOServerCnxn.closeSock Closed socket connection for client /127.0.0.1:52590 which had sessionid 0x13aa4d0ac120003
[junit4:junit4]   2> 7220160 T181 oazs.NIOServerCnxn$Factory.run NIOServerCnxn factory exited run method
[junit4:junit4]   2> 7220161 T194 oaz.ClientCnxn$SendThread.run WARNING Session 0x13aa4d0ac120003 for server localhost.localdomain/127.0.0.1:54249, unexpected error, closing socket connection and attempting reconnect java.nio.channels.ClosedByInterruptException
[junit4:junit4]   2> 	at java.nio.channels.spi.AbstractInterruptibleChannel.end(AbstractInterruptibleChannel.java:184)
[junit4:junit4]   2> 	at sun.nio.ch.SocketChannelImpl.read(SocketChannelImpl.java:270)
[junit4:junit4]   2> 	at org.apache.zookeeper.ClientCnxn$SendThread.doIO(ClientCnxn.java:856)
[junit4:junit4]   2> 	at org.apache.zookeeper.ClientCnxn$SendThread.run(ClientCnxn.java:1154)
[junit4:junit4]   2> 
[junit4:junit4]   2> 7220162 T139 oasu.DirectUpdateHandler2.close closing DirectUpdateHandler2{commits=0,autocommits=0,soft autocommits=0,optimizes=0,rollbacks=0,expungeDeletes=0,docsPending=0,adds=0,deletesById=0,deletesByQuery=0,errors=0,cumulative_adds=0,cumulative_deletesById=0,cumulative_deletesByQuery=0,cumulative_errors=0}
[junit4:junit4]   2> 7220162 T139 oasc.SolrCore.decrefSolrCoreState Closing SolrCoreState
[junit4:junit4]   2> 7220163 T139 oasu.DefaultSolrCoreState.closeIndexWriter SolrCoreState ref count has reached 0 - closing IndexWriter
[junit4:junit4]   2> 7220163 T139 oasu.DefaultSolrCoreState.closeIndexWriter closing IndexWriter with IndexWriterCloser
[junit4:junit4]   2> 7220163 T139 oasc.SolrCore.closeSearcher [collection1] Closing main searcher on request.
[junit4:junit4]   2> 7220655 T197 oaz.ClientCnxn$SendThread.startConnect WARNING Unexpected exception java.lang.InterruptedException: sleep interrupted
[junit4:junit4]   2> 	at java.lang.Thread.sleep(Native Method)
[junit4:junit4]   2> 	at org.apache.zookeeper.ClientCnxn$SendThread.startConnect(ClientCnxn.java:1038)
[junit4:junit4]   2> 	at org.apache.zookeeper.ClientCnxn$SendThread.run(ClientCnxn.java:1101)
[junit4:junit4]   2> 
[junit4:junit4]   2> 7220656 T194 oaz.ClientCnxn$SendThread.startConnect WARNING Unexpected exception java.lang.InterruptedException: sleep interrupted
[junit4:junit4]   2> 	at java.lang.Thread.sleep(Native Method)
[junit4:junit4]   2> 	at org.apache.zookeeper.ClientCnxn$SendThread.startConnect(ClientCnxn.java:1038)
[junit4:junit4]   2> 	at org.apache.zookeeper.ClientCnxn$SendThread.run(ClientCnxn.java:1101)
[junit4:junit4]   2> 
[junit4:junit4]   2> 7220656 T203 oaz.ClientCnxn$SendThread.startConnect WARNING Unexpected exception java.lang.InterruptedException: sleep interrupted
[junit4:junit4]   2> 	at java.lang.Thread.sleep(Native Method)
[junit4:junit4]   2> 	at org.apache.zookeeper.ClientCnxn$SendThread.startConnect(ClientCnxn.java:1045)
[junit4:junit4]   2> 	at org.apache.zookeeper.ClientCnxn$SendThread.run(ClientCnxn.java:1101)
[junit4:junit4]   2> 
[junit4:junit4]   2> 7220656 T203 oaz.ClientCnxn$SendThread.startConnect Opening socket connection to server localhost.localdomain/127.0.0.1:54249
[junit4:junit4]   2> 7220655 T139 oaz.ZooKeeper.close Session: 0x13aa4d0ac120004 closed
[junit4:junit4]   2> 7220655 T189 oaz.ClientCnxn$SendThread.startConnect WARNING Unexpected exception java.lang.InterruptedException: sleep interrupted
[junit4:junit4]   2> 	at java.lang.Thread.sleep(Native Method)
[junit4:junit4]   2> 	at org.apache.zookeeper.ClientCnxn$SendThread.startConnect(ClientCnxn.java:1045)
[junit4:junit4]   2> 	at org.apache.zookeeper.ClientCnxn$SendThread.run(ClientCnxn.java:1101)
[junit4:junit4]   2> 
[junit4:junit4]   2> 7220655 T206 oaz.ClientCnxn$SendThread.startConnect WARNING Unexpected exception java.lang.InterruptedException: sleep interrupted
[junit4:junit4]   2> 	at java.lang.Thread.sleep(Native Method)
[junit4:junit4]   2> 	at org.apache.zookeeper.ClientCnxn$SendThread.startConnect(ClientCnxn.java:1045)
[junit4:junit4]   2> 	at org.apache.zookeeper.ClientCnxn$SendThread.run(ClientCnxn.java:1101)
[junit4:junit4]   2> 
[junit4:junit4]   2> 7220656 T200 oaz.ClientCnxn$SendThread.startConnect WARNING Unexpected exception java.lang.InterruptedException: sleep interrupted
[junit4:junit4]   2> 	at java.lang.Thread.sleep(Native Method)
[junit4:junit4]   2> 	at org.apache.zookeeper.ClientCnxn$SendThread.startConnect(ClientCnxn.java:1038)
[junit4:junit4]   2> 	at org.apache.zookeeper.ClientCnxn$SendThread.run(ClientCnxn.java:1101)
[junit4:junit4]   2> 
[junit4:junit4]   2> 7220658 T206 oaz.ClientCnxn$SendThread.startConnect Opening socket connection to server localhost.localdomain/127.0.0.1:54249
[junit4:junit4]   2> 7220657 T189 oaz.ClientCnxn$SendThread.startConnect Opening socket connection to server localhost.localdomain/127.0.0.1:54249
[junit4:junit4]   2> 7220657 T203 oaz.ClientCnxn$SendThread.run WARNING Session 0x13aa4d0ac120006 for server null, unexpected error, closing socket connection and attempting reconnect java.net.ConnectException: Connection refused
[junit4:junit4]   2> 	at sun.nio.ch.SocketChannelImpl.checkConnect(Native Method)
[junit4:junit4]   2> 	at sun.nio.ch.SocketChannelImpl.finishConnect(SocketChannelImpl.java:567)
[junit4:junit4]   2> 	at org.apache.zookeeper.ClientCnxn$SendThread.run(ClientCnxn.java:1143)
[junit4:junit4]   2> 
[junit4:junit4]   2> 7220659 T189 oaz.ClientCnxn$SendThread.run WARNING Session 0x13aa4d0ac120002 for server null, unexpected error, closing socket connection and attempting reconnect java.net.ConnectException: Connection refused
[junit4:junit4]   2> 	at sun.nio.ch.SocketChannelImpl.checkConnect(Native Method)
[junit4:junit4]   2> 	at sun.nio.ch.SocketChannelImpl.finishConnect(SocketChannelImpl.java:567)
[junit4:junit4]   2> 	at org.apache.zookeeper.ClientCnxn$SendThread.run(ClientCnxn.java:1143)
[junit4:junit4]   2> 
[junit4:junit4]   2> 7220660 T139 oasc.CoreContainer.shutdown Shutting down CoreContainer instance=695186834
[junit4:junit4]   2> 7220659 T206 oaz.ClientCnxn$SendThread.run WARNING Session 0x13aa4d0ac120007 for server null, unexpected error, closing socket connection and attempting reconnect java.net.ConnectException: Connection refused
[junit4:junit4]   2> 	at sun.nio.ch.SocketChannelImpl.checkConnect(Native Method)
[junit4:junit4]   2> 	at sun.nio.ch.SocketChannelImpl.finishConnect(SocketChannelImpl.java:567)
[junit4:junit4]   2> 	at org.apache.zookeeper.ClientCnxn$SendThread.run(ClientCnxn.java:1143)
[junit4:junit4]   2> 
[junit4:junit4]   2> 7220661 T139 oasc.SolrCore.close [collection1]  CLOSING SolrCore org.apache.solr.core.SolrCore@694f23ae
[junit4:junit4]   2> 7220666 T139 oasu.DirectUpdateHandler2.close closing DirectUpdateHandler2{commits=0,autocommits=0,soft autocommits=0,optimizes=0,rollbacks=0,expungeDeletes=0,docsPending=0,adds=0,deletesById=0,deletesByQuery=0,errors=0,cumulative_adds=0,cumulative_deletesById=0,cumulative_deletesByQuery=0,cumulative_errors=0}
[junit4:junit4]   2> 7220667 T139 oasc.SolrCore.decrefSolrCoreState Closing SolrCoreState
[junit4:junit4]   2> 7220667 T139 oasu.DefaultSolrCoreState.closeIndexWriter SolrCoreState ref count has reached 0 - closing IndexWriter
[junit4:junit4]   2> 7220667 T139 oasu.DefaultSolrCoreState.closeIndexWriter closing IndexWriter with IndexWriterCloser
[junit4:junit4]   2> 7220668 T139 oasc.SolrCore.closeSearcher [collection1] Closing main searcher on request.
[junit4:junit4]   2> 7221166 T197 oaz.ClientCnxn$SendThread.startConnect WARNING Unexpected exception java.lang.InterruptedException: sleep interrupted
[junit4:junit4]   2> 	at java.lang.Thread.sleep(Native Method)
[junit4:junit4]   2> 	at org.apache.zookeeper.ClientCnxn$SendThread.startConnect(ClientCnxn.java:1045)
[junit4:junit4]   2> 	at org.apache.zookeeper.ClientCnxn$SendThread.run(ClientCnxn.java:1101)
[junit4:junit4]   2> 
[junit4:junit4]   2> 7221166 T139 oaz.ZooKeeper.close Session: 0x13aa4d0ac120005 closed
[junit4:junit4]   2> 7221167 T197 oaz.ClientCnxn$SendThread.startConnect Opening socket connection to server localhost.localdomain/127.0.0.1:54249
[junit4:junit4]   2> 7221167 T139 oasc.CoreContainer.shutdown Shutting down CoreContainer instance=1779889231
[junit4:junit4]   2> 7221166 T189 oaz.ClientCnxn$SendThread.startConnect WARNING Unexpected exception java.lang.InterruptedException: sleep interrupted
[junit4:junit4]   2> 	at java.lang.Thread.sleep(Native Method)
[junit4:junit4]   2> 	at org.apache.zookeeper.ClientCnxn$SendThread.startConnect(ClientCnxn.java:1045)
[junit4:junit4]   2> 	at org.apache.zookeeper.ClientCnxn$SendThread.run(ClientCnxn.java:1101)
[junit4:junit4]   2> 
[junit4:junit4]   2> 7221167 T139 oasc.SolrCore.close [collection1]  CLOSING SolrCore org.apache.solr.core.SolrCore@5d641f43
[junit4:junit4]   2> 7221166 T203 oaz.ClientCnxn$SendThread.startConnect WARNING Unexpected exception java.lang.InterruptedException: sleep interrupted
[junit4:junit4]   2> 	at java.lang.Thread.sleep(Native Method)
[junit4:junit4]   2> 	at org.apache.zookeeper.ClientCnxn$SendThread.startConnect(ClientCnxn.java:1045)
[junit4:junit4]   2> 	at org.apache.zookeeper.ClientCnxn$SendThread.run(ClientCnxn.java:1101)
[junit4:junit4]   2> 
[junit4:junit4]   2> 7221166 T200 oaz.ClientCnxn$SendThread.startConnect WARNING Unexpected exception java.lang.InterruptedException: sleep interrupted
[junit4:junit4]   2> 	at java.lang.Thread.sleep(Native Method)
[junit4:junit4]   2> 	at org.apache.zookeeper.ClientCnxn$SendThread.startConnect(ClientCnxn.java:1045)
[junit4:junit4]   2> 	at org.apache.zookeeper.ClientCnxn$SendThread.run(ClientCnxn.java:1101)
[junit4:junit4]   2> 
[junit4:junit4]   2> 7221166 T194 oaz.ClientCnxn$SendThread.startConnect WARNING Unexpected exception java.lang.InterruptedException: sleep interrupted
[junit4:junit4]   2> 	at java.lang.Thread.sleep(Native Method)
[junit4:junit4]   2> 	at org.apache.zookeeper.ClientCnxn$SendThread.startConnect(ClientCnxn.java:1045)
[junit4:junit4]   2> 	at org.apache.zookeeper.ClientCnxn$SendThread.run(ClientCnxn.java:1101)
[junit4:junit4]   2> 
[junit4:junit4]   2> 7221169 T200 oaz.ClientCnxn$SendThread.startConnect Opening socket connection to server localhost.localdomain/127.0.0.1:54249
[junit4:junit4]   2> 7221166 T206 oaz.ClientCnxn$SendThread.startConnect WARNING Unexpected exception java.lang.InterruptedException: sleep interrupted
[junit4:junit4]   2> 	at java.lang.Thread.sleep(Native Method)
[junit4:junit4]   2> 	at org.apache.zookeeper.ClientCnxn$SendThread.startConnect(ClientCnxn.java:1038)
[junit4:junit4]   2> 	at org.apache.zookeeper.ClientCnxn$SendThread.run(ClientCnxn.java:1101)
[junit4:junit4]   2> 
[junit4:junit4]   2> 7221169 T194 oaz.ClientCnxn$SendThread.startConnect Opening socket connection to server localhost.localdomain/127.0.0.1:54249
[junit4:junit4]   2> 7221168 T203 oaz.ClientCnxn$SendThread.startConnect Opening socket connection to server localhost.localdomain/127.0.0.1:54249
[junit4:junit4]   2> 7221170 T194 oaz.ClientCnxn$SendThread.run WARNING Session 0x13aa4d0ac120003 for server null, unexpected error, closing socket connection and attempting reconnect java.net.ConnectException: Connection refused
[junit4:junit4]   2> 	at sun.nio.ch.SocketChannelImpl.checkConnect(Native Method)
[junit4:junit4]   2> 	at sun.nio.ch.SocketChannelImpl.finishConnect(SocketChannelImpl.java:567)
[junit4:junit4]   2> 	at org.apache.zookeeper.ClientCnxn$SendThread.run(ClientCnxn.java:1143)
[junit4:junit4]   2> 
[junit4:junit4]   2> 7221171 T203 oaz.ClientCnxn$SendThread.run WARNING Session 0x13aa4d0ac120006 for server null, unexpected error, closing socket connection and attempting reconnect java.net.ConnectException: Connection refused
[junit4:junit4]   2> 	at sun.nio.ch.SocketChannelImpl.checkConnect(Native Method)
[junit4:junit4]   2> 	at sun.nio.ch.SocketChannelImpl.finishConnect(SocketChannelImpl.java:567)
[junit4:junit4]   2> 	at org.apache.zookeeper.ClientCnxn$SendThread.run(ClientCnxn.java:1143)
[junit4:junit4]   2> 
[junit4:junit4]   2> 7221171 T189 oaz.ClientCnxn$SendThread.startConnect Opening socket connection to server localhost.localdomain/127.0.0.1:54249
[junit4:junit4]   2> 7221172 T189 oaz.ClientCnxn$SendThread.run WARNING Session 0x13aa4d0ac120002 for server null, unexpected error, closing socket connection and attempting reconnect java.net.ConnectException: Connection refused
[junit4:junit4]   2> 	at sun.nio.ch.SocketChannelImpl.checkConnect(Native Method)
[junit4:junit4]   2> 	at sun.nio.ch.SocketChannelImpl.finishConnect(SocketChannelImpl.java:567)
[junit4:junit4]   2> 	at org.apache.zookeeper.ClientCnxn$SendThread.run(ClientCnxn.java:1143)
[junit4:junit4]   2> 
[junit4:junit4]   2> 7221173 T139 oasu.DirectUpdateHandler2.close closing DirectUpdateHandler2{commits=0,autocommits=0,soft autocommits=0,optimizes=0,rollbacks=0,expungeDeletes=0,docsPending=0,adds=0,deletesById=0,deletesByQuery=0,errors=0,cumulative_adds=0,cumulative_deletesById=0,cumulative_deletesByQuery=0,cumulative_errors=0}
[junit4:junit4]   2> 7221174 T139 oasc.SolrCore.decrefSolrCoreState Closing SolrCoreState
[junit4:junit4]   2> 7221174 T139 oasu.DefaultSolrCoreState.closeIndexWriter SolrCoreState ref count has reached 0 - closing IndexWriter
[junit4:junit4]   2> 7221174 T139 oasu.DefaultSolrCoreState.closeIndexWriter closing IndexWriter with IndexWriterCloser
[junit4:junit4]   2> 7221174 T139 oasc.SolrCore.closeSearcher [collection1] Closing main searcher on request.
[junit4:junit4]   2> 7221273 T139 oaz.ZooKeeper.close Session: 0x13aa4d0ac120002 closed
[junit4:junit4]   2> 7221273 T139 oasc.CoreContainer.shutdown Shutting down CoreContainer instance=997627950
[junit4:junit4]   2> 7221273 T139 oasc.SolrCore.close [collection1]  CLOSING SolrCore org.apache.solr.core.SolrCore@49ccd159
[junit4:junit4]   2> 7221278 T139 oasu.DirectUpdateHandler2.close closing DirectUpdateHandler2{commits=0,autocommits=0,soft autocommits=0,optimizes=0,rollbacks=0,expungeDeletes=0,docsPending=0,adds=0,deletesById=0,deletesByQuery=0,errors=0,cumulative_adds=0,cumulative_deletesById=0,cumulative_deletesByQuery=0,cumulative_errors=0}
[junit4:junit4]   2> 7221278 T139 oasc.SolrCore.decrefSolrCoreState Closing SolrCoreState
[junit4:junit4]   2> 7221278 T139 oasu.DefaultSolrCoreState.closeIndexWriter SolrCoreState ref count has reached 0 - closing IndexWriter
[junit4:junit4]   2> 7221279 T139 oasu.DefaultSolrCoreState.closeIndexWriter closing IndexWriter with IndexWriterCloser
[junit4:junit4]   2> 7221279 T139 oasc.SolrCore.closeSearcher [collection1] Closing main searcher on request.
[junit4:junit4]   2> 7221672 T194 oaz.ClientCnxn$SendThread.startConnect WARNING Unexpected exception java.lang.InterruptedException: sleep interrupted
[junit4:junit4]   2> 	at java.lang.Thread.sleep(Native Method)
[junit4:junit4]   2> 	at org.apache.zookeeper.ClientCnxn$SendThread.startConnect(ClientCnxn.java:1038)
[junit4:junit4]   2> 	at org.apache.zookeeper.ClientCnxn$SendThread.run(ClientCnxn.java:1101)
[junit4:junit4]   2> 
[junit4:junit4]   2> 7221672 T139 oaz.ZooKeeper.close Session: 0x13aa4d0ac120003 closed
[junit4:junit4]   2> 7221672 T203 oaz.ClientCnxn$SendThread.startConnect WARNING Unexpected exception java.lang.InterruptedException: sleep interrupted
[junit4:junit4]   2> 	at java.lang.Thread.sleep(Native Method)
[junit4:junit4]   2> 	at org.apache.zookeeper.ClientCnxn$SendThread.startConnect(ClientCnxn.java:1038)
[junit4:junit4]   2> 	at org.apache.zookeeper.ClientCnxn$SendThread.run(ClientCnxn.java:1101)
[junit4:junit4]   2> 
[junit4:junit4]   2> 7221673 T139 oasc.CoreContainer.shutdown Shutting down CoreContainer instance=2075041004
[junit4:junit4]   2> 7221672 T206 oaz.ClientCnxn$SendThread.startConnect WARNING Unexpected exception java.lang.InterruptedException: sleep interrupted
[junit4:junit4]   2> 	at java.lang.Thread.sleep(Native Method)
[junit4:junit4]   2> 	at org.apache.zookeeper.ClientCnxn$SendThread.startConnect(ClientCnxn.java:1045)
[junit4:junit4]   2> 	at org.apache.zookeeper.ClientCnxn$SendThread.run(ClientCnxn.java:1101)
[junit4:junit4]   2> 
[junit4:junit4]   2> 7221674 T206 oaz.ClientCnxn$SendThread.startConnect Opening socket connection to server localhost.localdomain/127.0.0.1:54249
[junit4:junit4]   2> 7221674 T139 oasc.SolrCore.close [collection1]  CLOSING SolrCore org.apache.solr.core.SolrCore@56e626ff
[junit4:junit4]   2> 7221674 T206 oaz.ClientCnxn$SendThread.run WARNING Session 0x13aa4d0ac120007 for server null, unexpected error, closing socket connection and attempting reconnect java.net.ConnectException: Connection refused
[junit4:junit4]   2> 	at sun.nio.ch.SocketChannelImpl.checkConnect(Native Method)
[junit4:junit4]   2> 	at sun.nio.ch.SocketChannelImpl.finishConnect(SocketChannelImpl.java:567)
[junit4:junit4]   2> 	at org.apache.zookeeper.ClientCnxn$SendThread.run(ClientCnxn.java:1143)
[junit4:junit4]   2> 
[junit4:junit4]   2> 7221679 T139 oasu.DirectUpdateHandler2.close closing DirectUpdateHandler2{commits=0,autocommits=0,soft autocommits=0,optimizes=0,rollbacks=0,expungeDeletes=0,docsPending=0,adds=0,deletesById=0,deletesByQuery=0,errors=0,cumulative_adds=0,cumulative_deletesById=0,cumulative_deletesByQuery=0,cumulative_errors=0}
[junit4:junit4]   2> 7221680 T139 oasc.SolrCore.decrefSolrCoreState Closing SolrCoreState
[junit4:junit4]   2> 7221680 T139 oasu.DefaultSolrCoreState.closeIndexWriter SolrCoreState ref count has reached 0 - closing IndexWriter
[junit4:junit4]   2> 7221681 T139 oasu.DefaultSolrCoreState.closeIndexWriter closing IndexWriter with IndexWriterCloser
[junit4:junit4]   2> 7221681 T139 oasc.SolrCore.closeSearcher [collection1] Closing main searcher on request.
[junit4:junit4]   2> 7222177 T194 oaz.ClientCnxn$SendThread.startConnect WARNING Unexpected exception java.lang.InterruptedException: sleep interrupted
[junit4:junit4]   2> 	at java.lang.Thread.sleep(Native Method)
[junit4:junit4]   2> 	at org.apache.zookeeper.ClientCnxn$SendThread.startConnect(ClientCnxn.java:1045)
[junit4:junit4]   2> 	at org.apache.zookeeper.ClientCnxn$SendThread.run(ClientCnxn.java:1101)
[junit4:junit4]   2> 
[junit4:junit4]   2> 7222177 T139 oaz.ZooKeeper.close Session: 0x13aa4d0ac120006 closed
[junit4:junit4]   2> 7222177 T206 oaz.ClientCnxn$SendThread.startConnect WARNING Unexpected exception java.lang.InterruptedException: sleep interrupted
[junit4:junit4]   2> 	at java.lang.Thread.sleep(Native Method)
[junit4:junit4]   2> 	at org.apache.zookeeper.ClientCnxn$SendThread.startConnect(ClientCnxn.java:1045)
[junit4:junit4]   2> 	at org.apache.zookeeper.ClientCnxn$SendThread.run(ClientCnxn.java:1101)
[junit4:junit4]   2> 
[junit4:junit4]   2> 7222177 T203 oaz.ClientCnxn$SendThread.startConnect WARNING Unexpected exception java.lang.InterruptedException: sleep interrupted
[junit4:junit4]   2> 	at java.lang.Thread.sleep(Native Method)
[junit4:junit4]   2> 	at org.apache.zookeeper.ClientCnxn$SendThread.startConnect(ClientCnxn.java:1045)
[junit4:junit4]   2> 	at org.apache.zookeeper.ClientCnxn$SendThread.run(ClientCnxn.java:1101)
[junit4:junit4]   2> 
[junit4:junit4]   2> 7222178 T206 oaz.ClientCnxn$SendThread.startConnect Opening socket connection to server localhost.localdomain/127.0.0.1:54249
[junit4:junit4]   2> 7222178 T203 oaz.ClientCnxn$SendThread.startConnect Opening socket connection to server localhost.localdomain/127.0.0.1:54249
[junit4:junit4]   2> 7222177 T194 oaz.ClientCnxn$SendThread.startConnect Opening socket connection to server localhost.localdomain/127.0.0.1:54249
[junit4:junit4]   2> 7222179 T206 oaz.ClientCnxn$SendThread.run WARNING Session 0x13aa4d0ac120007 for server null, unexpected error, closing socket connection and attempting reconnect java.net.ConnectException: Connection refused
[junit4:junit4]   2> 	at sun.nio.ch.SocketChannelImpl.checkConnect(Native Method)
[junit4:junit4]   2> 	at sun.nio.ch.SocketChannelImpl.finishConnect(SocketChannelImpl.java:567)
[junit4:junit4]   2> 	at org.apache.zookeeper.ClientCnxn$SendThread.run(ClientCnxn.java:1143)
[junit4:junit4]   2> 
[junit4:junit4]   2> 7222179 T139 oasc.CoreContainer.shutdown Shutting down CoreContainer instance=355336294
[junit4:junit4]   2> 7222180 T139 oasc.SolrCore.close [collection1]  CLOSING SolrCore org.apache.solr.core.SolrCore@32ddb49a
[junit4:junit4]   2> 7222188 T139 oasu.DirectUpdateHandler2.close closing DirectUpdateHandler2{commits=0,autocommits=0,soft autocommits=0,optimizes=0,rollbacks=0,expungeDeletes=0,docsPending=0,adds=0,deletesById=0,deletesByQuery=0,errors=0,cumulative_adds=0,cumulative_deletesById=0,cumulative_deletesByQuery=0,cumulative_errors=0}
[junit4:junit4]   2> 7222189 T139 oasc.SolrCore.decrefSolrCoreState Closing SolrCoreState
[junit4:junit4]   2> 7222189 T139 oasu.DefaultSolrCoreState.closeIndexWriter SolrCoreState ref count has reached 0 - closing IndexWriter
[junit4:junit4]   2> 7222190 T139 oasu.DefaultSolrCoreState.closeIndexWriter closing IndexWriter with IndexWriterCloser
[junit4:junit4]   2> 7222190 T139 oasc.SolrCore.closeSearcher [collection1] Closing main searcher on request.
[junit4:junit4]   2> 7222200 T209 oaz.ClientCnxn$SendThread.startConnect Opening socket connection to server localhost.localdomain/127.0.0.1:54249
[junit4:junit4]   2> 7222201 T209 oaz.ClientCnxn$SendThread.run WARNING Session 0x0 for server null, unexpected error, closing socket connection and attempting reconnect java.net.ConnectException: Connection refused
[junit4:junit4]   2> 	at sun.nio.ch.SocketChannelImpl.checkConnect(Native Method)
[junit4:junit4]   2> 	at sun.nio.ch.SocketChannelImpl.finishConnect(SocketChannelImpl.java:567)
[junit4:junit4]   2> 	at org.apache.zookeeper.ClientCnxn$SendThread.run(ClientCnxn.java:1143)
[junit4:junit4]   2> 
[junit4:junit4]   2> 7222279 T139 oaz.ZooKeeper.close Session: 0x13aa4d0ac120007 closed
[junit4:junit4]   2> 7222280 T183 oazs.SyncRequestProcessor.run SyncRequestProcessor exited!
[junit4:junit4]   2> 7222281 T139 oazs.FinalRequestProcessor.shutdown shutdown of request processor complete
[junit4:junit4]   2> 7222323 T139 oazs.FinalRequestProcessor.shutdown shutdown of request processor complete
[junit4:junit4]   2> 7222324 T139 oas.SolrTestCaseJ4.tearDown ###Ending testSimpleSliceLeaderElection
[junit4:junit4]   2> 7222678 T139 oas.SolrTestCaseJ4.deleteCore ###deleteCore
[junit4:junit4]   2> 7222691 T138 ccr.ThreadLeakControl.tryToInterruptAll All leaked threads terminated.
[junit4:junit4]   2> NOTE: test params are: codec=Lucene41: {}, sim=DefaultSimilarity, locale=et_EE, timezone=Europe/Dublin
[junit4:junit4]   2> NOTE: Linux 3.2.0-24-generic amd64/Sun Microsystems Inc. 1.6.0_27 (64-bit)/cpus=8,threads=3,free=233180312,total=331415552
[junit4:junit4]   2> NOTE: All tests run in this JVM: [FieldMutatingUpdateProcessorTest, CSVRequestHandlerTest, ClusterStateUpdateTest, TestXIncludeConfig, SearchHandlerTest, IndexSchemaRuntimeFieldTest, TestNumberUtils, TestSolr4Spatial, TestRemoteStreaming, TestHashPartitioner, JSONWriterTest, HighlighterConfigTest, MinimalSchemaTest, TestPluginEnable, TestStressLucene, SpellCheckComponentTest, LeaderElectionIntegrationTest]
[junit4:junit4]   2> NOTE: reproduce with: ant test  -Dtestcase=LeaderElectionIntegrationTest -Dtests.seed=80FE9951FF3257B6 -Dtests.slow=true -Dtests.locale=et_EE -Dtests.timezone=Europe/Dublin -Dtests.file.encoding=US-ASCII
[junit4:junit4] ERROR   0.00s J6 | LeaderElectionIntegrationTest (suite) <<<
[junit4:junit4]    > Throwable #1: java.lang.Exception: Suite timeout exceeded (>= 7200000 msec).
[junit4:junit4]    > 	at __randomizedtesting.SeedInfo.seed([80FE9951FF3257B6]:0)
[junit4:junit4] Completed on J6 in 7222.73s, 2 tests, 2 errors <<< FAILURES!
[junit4:junit4] 
[junit4:junit4] 
[junit4:junit4] Tests with failures:
[junit4:junit4]   - org.apache.solr.cloud.LeaderElectionIntegrationTest.testSimpleSliceLeaderElection
[junit4:junit4]   - org.apache.solr.cloud.LeaderElectionIntegrationTest (suite)
[junit4:junit4] 
[junit4:junit4] 
[junit4:junit4] JVM J0:     1.13 ..   160.12 =   158.99s
[junit4:junit4] JVM J1:     0.91 ..   113.75 =   112.85s
[junit4:junit4] JVM J2:     0.89 ..   113.83 =   112.93s
[junit4:junit4] JVM J3:     1.12 ..   148.71 =   147.59s
[junit4:junit4] JVM J4:     0.91 ..   119.73 =   118.82s
[junit4:junit4] JVM J5:     1.13 ..   124.92 =   123.79s
[junit4:junit4] JVM J6:     1.12 ..  7283.48 =  7282.37s
[junit4:junit4] JVM J7:     0.91 ..   122.54 =   121.62s
[junit4:junit4] Execution time total: 2 hours 1 minute 23 seconds
[junit4:junit4] Tests summary: 233 suites, 965 tests, 1 suite-level error, 1 error, 7 ignored (2 assumptions)

BUILD FAILED
<http://sierranevada.servebeer.com/job/fast-io-beasting/ws/build.xml>:39: The following error occurred while executing this line:
<http://sierranevada.servebeer.com/job/fast-io-beasting/ws/solr/build.xml>:178: The following error occurred while executing this line:
<http://sierranevada.servebeer.com/job/fast-io-beasting/ws/lucene/module-build.xml>:61: The following error occurred while executing this line:
<http://sierranevada.servebeer.com/job/fast-io-beasting/ws/lucene/common-build.xml>:1159: The following error occurred while executing this line:
<http://sierranevada.servebeer.com/job/fast-io-beasting/ws/lucene/common-build.xml>:827: There were test failures: 233 suites, 965 tests, 1 suite-level error, 1 error, 7 ignored (2 assumptions)

Total time: 126 minutes 42 seconds
Build step 'Invoke Ant' marked build as failure

---------------------------------------------------------------------
To unsubscribe, e-mail: dev-unsubscribe@lucene.apache.org
For additional commands, e-mail: dev-help@lucene.apache.org