You are viewing a plain text version of this content. The canonical link for it is here.
Posted to dev@lucene.apache.org by Policeman Jenkins Server <je...@thetaphi.de> on 2018/12/22 11:37:13 UTC

[JENKINS-EA] Lucene-Solr-7.6-Linux (64bit/jdk-12-ea+23) - Build # 134 - Unstable!

Build: https://jenkins.thetaphi.de/job/Lucene-Solr-7.6-Linux/134/
Java: 64bit/jdk-12-ea+23 -XX:-UseCompressedOops -XX:+UseSerialGC

1 tests failed.
FAILED:  org.apache.solr.cloud.HttpPartitionOnCommitTest.test

Error Message:
Timeout occured while waiting response from server at: http://127.0.0.1:36345

Stack Trace:
org.apache.solr.client.solrj.SolrServerException: Timeout occured while waiting response from server at: http://127.0.0.1:36345
	at __randomizedtesting.SeedInfo.seed([7B4AF667D3501236:F31EC9BD7DAC7FCE]:0)
	at org.apache.solr.client.solrj.impl.HttpSolrClient.executeMethod(HttpSolrClient.java:654)
	at org.apache.solr.client.solrj.impl.HttpSolrClient.request(HttpSolrClient.java:255)
	at org.apache.solr.client.solrj.impl.HttpSolrClient.request(HttpSolrClient.java:244)
	at org.apache.solr.client.solrj.SolrClient.request(SolrClient.java:1260)
	at org.apache.solr.cloud.BasicDistributedZkTest.createCollection(BasicDistributedZkTest.java:646)
	at org.apache.solr.cloud.AbstractFullDistribZkTestBase.createCollection(AbstractFullDistribZkTestBase.java:1611)
	at org.apache.solr.cloud.HttpPartitionOnCommitTest.multiShardTest(HttpPartitionOnCommitTest.java:65)
	at org.apache.solr.cloud.HttpPartitionOnCommitTest.test(HttpPartitionOnCommitTest.java:56)
	at java.base/jdk.internal.reflect.NativeMethodAccessorImpl.invoke0(Native Method)
	at java.base/jdk.internal.reflect.NativeMethodAccessorImpl.invoke(NativeMethodAccessorImpl.java:62)
	at java.base/jdk.internal.reflect.DelegatingMethodAccessorImpl.invoke(DelegatingMethodAccessorImpl.java:43)
	at java.base/java.lang.reflect.Method.invoke(Method.java:567)
	at com.carrotsearch.randomizedtesting.RandomizedRunner.invoke(RandomizedRunner.java:1742)
	at com.carrotsearch.randomizedtesting.RandomizedRunner$8.evaluate(RandomizedRunner.java:935)
	at com.carrotsearch.randomizedtesting.RandomizedRunner$9.evaluate(RandomizedRunner.java:971)
	at com.carrotsearch.randomizedtesting.RandomizedRunner$10.evaluate(RandomizedRunner.java:985)
	at org.apache.solr.BaseDistributedSearchTestCase$ShardsRepeatRule$ShardsFixedStatement.callStatement(BaseDistributedSearchTestCase.java:1010)
	at org.apache.solr.BaseDistributedSearchTestCase$ShardsRepeatRule$ShardsStatement.evaluate(BaseDistributedSearchTestCase.java:985)
	at com.carrotsearch.randomizedtesting.rules.SystemPropertiesRestoreRule$1.evaluate(SystemPropertiesRestoreRule.java:57)
	at org.apache.lucene.util.TestRuleSetupTeardownChained$1.evaluate(TestRuleSetupTeardownChained.java:49)
	at org.apache.lucene.util.AbstractBeforeAfterRule$1.evaluate(AbstractBeforeAfterRule.java:45)
	at org.apache.lucene.util.TestRuleThreadAndTestName$1.evaluate(TestRuleThreadAndTestName.java:48)
	at org.apache.lucene.util.TestRuleIgnoreAfterMaxFailures$1.evaluate(TestRuleIgnoreAfterMaxFailures.java:64)
	at org.apache.lucene.util.TestRuleMarkFailure$1.evaluate(TestRuleMarkFailure.java:47)
	at com.carrotsearch.randomizedtesting.rules.StatementAdapter.evaluate(StatementAdapter.java:36)
	at com.carrotsearch.randomizedtesting.ThreadLeakControl$StatementRunner.run(ThreadLeakControl.java:368)
	at com.carrotsearch.randomizedtesting.ThreadLeakControl.forkTimeoutingTask(ThreadLeakControl.java:817)
	at com.carrotsearch.randomizedtesting.ThreadLeakControl$3.evaluate(ThreadLeakControl.java:468)
	at com.carrotsearch.randomizedtesting.RandomizedRunner.runSingleTest(RandomizedRunner.java:944)
	at com.carrotsearch.randomizedtesting.RandomizedRunner$5.evaluate(RandomizedRunner.java:830)
	at com.carrotsearch.randomizedtesting.RandomizedRunner$6.evaluate(RandomizedRunner.java:880)
	at com.carrotsearch.randomizedtesting.RandomizedRunner$7.evaluate(RandomizedRunner.java:891)
	at com.carrotsearch.randomizedtesting.rules.StatementAdapter.evaluate(StatementAdapter.java:36)
	at com.carrotsearch.randomizedtesting.rules.SystemPropertiesRestoreRule$1.evaluate(SystemPropertiesRestoreRule.java:57)
	at org.apache.lucene.util.AbstractBeforeAfterRule$1.evaluate(AbstractBeforeAfterRule.java:45)
	at com.carrotsearch.randomizedtesting.rules.StatementAdapter.evaluate(StatementAdapter.java:36)
	at org.apache.lucene.util.TestRuleStoreClassName$1.evaluate(TestRuleStoreClassName.java:41)
	at com.carrotsearch.randomizedtesting.rules.NoShadowingOrOverridesOnMethodsRule$1.evaluate(NoShadowingOrOverridesOnMethodsRule.java:40)
	at com.carrotsearch.randomizedtesting.rules.NoShadowingOrOverridesOnMethodsRule$1.evaluate(NoShadowingOrOverridesOnMethodsRule.java:40)
	at com.carrotsearch.randomizedtesting.rules.StatementAdapter.evaluate(StatementAdapter.java:36)
	at com.carrotsearch.randomizedtesting.rules.StatementAdapter.evaluate(StatementAdapter.java:36)
	at org.apache.lucene.util.TestRuleAssertionsRequired$1.evaluate(TestRuleAssertionsRequired.java:53)
	at org.apache.lucene.util.TestRuleMarkFailure$1.evaluate(TestRuleMarkFailure.java:47)
	at org.apache.lucene.util.TestRuleIgnoreAfterMaxFailures$1.evaluate(TestRuleIgnoreAfterMaxFailures.java:64)
	at org.apache.lucene.util.TestRuleIgnoreTestSuites$1.evaluate(TestRuleIgnoreTestSuites.java:54)
	at com.carrotsearch.randomizedtesting.rules.StatementAdapter.evaluate(StatementAdapter.java:36)
	at com.carrotsearch.randomizedtesting.ThreadLeakControl$StatementRunner.run(ThreadLeakControl.java:368)
	at java.base/java.lang.Thread.run(Thread.java:835)
Caused by: java.net.SocketTimeoutException: Read timed out
	at java.base/java.net.SocketInputStream.socketRead0(Native Method)
	at java.base/java.net.SocketInputStream.socketRead(SocketInputStream.java:115)
	at java.base/java.net.SocketInputStream.read(SocketInputStream.java:168)
	at java.base/java.net.SocketInputStream.read(SocketInputStream.java:140)
	at org.apache.http.impl.io.SessionInputBufferImpl.streamRead(SessionInputBufferImpl.java:137)
	at org.apache.http.impl.io.SessionInputBufferImpl.fillBuffer(SessionInputBufferImpl.java:153)
	at org.apache.http.impl.io.SessionInputBufferImpl.readLine(SessionInputBufferImpl.java:282)
	at org.apache.http.impl.conn.DefaultHttpResponseParser.parseHead(DefaultHttpResponseParser.java:138)
	at org.apache.http.impl.conn.DefaultHttpResponseParser.parseHead(DefaultHttpResponseParser.java:56)
	at org.apache.http.impl.io.AbstractMessageParser.parse(AbstractMessageParser.java:259)
	at org.apache.http.impl.DefaultBHttpClientConnection.receiveResponseHeader(DefaultBHttpClientConnection.java:163)
	at org.apache.http.impl.conn.CPoolProxy.receiveResponseHeader(CPoolProxy.java:165)
	at org.apache.http.protocol.HttpRequestExecutor.doReceiveResponse(HttpRequestExecutor.java:273)
	at org.apache.http.protocol.HttpRequestExecutor.execute(HttpRequestExecutor.java:125)
	at org.apache.http.impl.execchain.MainClientExec.execute(MainClientExec.java:272)
	at org.apache.http.impl.execchain.ProtocolExec.execute(ProtocolExec.java:185)
	at org.apache.http.impl.execchain.RetryExec.execute(RetryExec.java:89)
	at org.apache.http.impl.execchain.RedirectExec.execute(RedirectExec.java:111)
	at org.apache.http.impl.client.InternalHttpClient.doExecute(InternalHttpClient.java:185)
	at org.apache.http.impl.client.CloseableHttpClient.execute(CloseableHttpClient.java:83)
	at org.apache.http.impl.client.CloseableHttpClient.execute(CloseableHttpClient.java:56)
	at org.apache.solr.client.solrj.impl.HttpSolrClient.executeMethod(HttpSolrClient.java:542)
	... 47 more




Build Log:
[...truncated 13915 lines...]
   [junit4] Suite: org.apache.solr.cloud.HttpPartitionOnCommitTest
   [junit4]   2> Creating dataDir: /home/jenkins/workspace/Lucene-Solr-7.6-Linux/solr/build/solr-core/test/J1/temp/solr.cloud.HttpPartitionOnCommitTest_7B4AF667D3501236-001/init-core-data-001
   [junit4]   2> 391198 INFO  (SUITE-HttpPartitionOnCommitTest-seed#[7B4AF667D3501236]-worker) [    ] o.a.s.SolrTestCaseJ4 Using TrieFields (NUMERIC_POINTS_SYSPROP=false) w/NUMERIC_DOCVALUES_SYSPROP=false
   [junit4]   2> 391198 INFO  (SUITE-HttpPartitionOnCommitTest-seed#[7B4AF667D3501236]-worker) [    ] o.a.s.SolrTestCaseJ4 Randomized ssl (false) and clientAuth (false) via: @org.apache.solr.SolrTestCaseJ4$SuppressSSL(bugUrl="https://issues.apache.org/jira/browse/SOLR-5776")
   [junit4]   2> 391198 INFO  (SUITE-HttpPartitionOnCommitTest-seed#[7B4AF667D3501236]-worker) [    ] o.a.s.SolrTestCaseJ4 SecureRandom sanity checks: test.solr.allowed.securerandom=null & java.security.egd=file:/dev/./urandom
   [junit4]   2> 391199 INFO  (SUITE-HttpPartitionOnCommitTest-seed#[7B4AF667D3501236]-worker) [    ] o.a.s.BaseDistributedSearchTestCase Setting hostContext system property: /
   [junit4]   2> 391200 INFO  (TEST-HttpPartitionOnCommitTest.test-seed#[7B4AF667D3501236]) [    ] o.a.s.c.ZkTestServer STARTING ZK TEST SERVER
   [junit4]   2> 391202 INFO  (Thread-1000) [    ] o.a.s.c.ZkTestServer client port:0.0.0.0/0.0.0.0:0
   [junit4]   2> 391202 INFO  (Thread-1000) [    ] o.a.s.c.ZkTestServer Starting server
   [junit4]   2> 391214 ERROR (Thread-1000) [    ] o.a.z.s.ZooKeeperServer ZKShutdownHandler is not registered, so ZooKeeper server won't take any action on ERROR or SHUTDOWN server state changes
   [junit4]   2> 391302 INFO  (TEST-HttpPartitionOnCommitTest.test-seed#[7B4AF667D3501236]) [    ] o.a.s.c.ZkTestServer start zk server on port:43933
   [junit4]   2> 391304 INFO  (zkConnectionManagerCallback-1331-thread-1) [    ] o.a.s.c.c.ConnectionManager zkClient has connected
   [junit4]   2> 391308 INFO  (zkConnectionManagerCallback-1333-thread-1) [    ] o.a.s.c.c.ConnectionManager zkClient has connected
   [junit4]   2> 391311 INFO  (TEST-HttpPartitionOnCommitTest.test-seed#[7B4AF667D3501236]) [    ] o.a.s.c.AbstractZkTestCase put /home/jenkins/workspace/Lucene-Solr-7.6-Linux/solr/core/src/test-files/solr/collection1/conf/solrconfig-tlog.xml to /configs/conf1/solrconfig.xml
   [junit4]   2> 391312 INFO  (TEST-HttpPartitionOnCommitTest.test-seed#[7B4AF667D3501236]) [    ] o.a.s.c.AbstractZkTestCase put /home/jenkins/workspace/Lucene-Solr-7.6-Linux/solr/core/src/test-files/solr/collection1/conf/schema.xml to /configs/conf1/schema.xml
   [junit4]   2> 391313 INFO  (TEST-HttpPartitionOnCommitTest.test-seed#[7B4AF667D3501236]) [    ] o.a.s.c.AbstractZkTestCase put /home/jenkins/workspace/Lucene-Solr-7.6-Linux/solr/core/src/test-files/solr/collection1/conf/solrconfig.snippet.randomindexconfig.xml to /configs/conf1/solrconfig.snippet.randomindexconfig.xml
   [junit4]   2> 391313 INFO  (TEST-HttpPartitionOnCommitTest.test-seed#[7B4AF667D3501236]) [    ] o.a.s.c.AbstractZkTestCase put /home/jenkins/workspace/Lucene-Solr-7.6-Linux/solr/core/src/test-files/solr/collection1/conf/stopwords.txt to /configs/conf1/stopwords.txt
   [junit4]   2> 391314 INFO  (TEST-HttpPartitionOnCommitTest.test-seed#[7B4AF667D3501236]) [    ] o.a.s.c.AbstractZkTestCase put /home/jenkins/workspace/Lucene-Solr-7.6-Linux/solr/core/src/test-files/solr/collection1/conf/protwords.txt to /configs/conf1/protwords.txt
   [junit4]   2> 391315 INFO  (TEST-HttpPartitionOnCommitTest.test-seed#[7B4AF667D3501236]) [    ] o.a.s.c.AbstractZkTestCase put /home/jenkins/workspace/Lucene-Solr-7.6-Linux/solr/core/src/test-files/solr/collection1/conf/currency.xml to /configs/conf1/currency.xml
   [junit4]   2> 391315 INFO  (TEST-HttpPartitionOnCommitTest.test-seed#[7B4AF667D3501236]) [    ] o.a.s.c.AbstractZkTestCase put /home/jenkins/workspace/Lucene-Solr-7.6-Linux/solr/core/src/test-files/solr/collection1/conf/enumsConfig.xml to /configs/conf1/enumsConfig.xml
   [junit4]   2> 391316 INFO  (TEST-HttpPartitionOnCommitTest.test-seed#[7B4AF667D3501236]) [    ] o.a.s.c.AbstractZkTestCase put /home/jenkins/workspace/Lucene-Solr-7.6-Linux/solr/core/src/test-files/solr/collection1/conf/open-exchange-rates.json to /configs/conf1/open-exchange-rates.json
   [junit4]   2> 391317 INFO  (TEST-HttpPartitionOnCommitTest.test-seed#[7B4AF667D3501236]) [    ] o.a.s.c.AbstractZkTestCase put /home/jenkins/workspace/Lucene-Solr-7.6-Linux/solr/core/src/test-files/solr/collection1/conf/mapping-ISOLatin1Accent.txt to /configs/conf1/mapping-ISOLatin1Accent.txt
   [junit4]   2> 391318 INFO  (TEST-HttpPartitionOnCommitTest.test-seed#[7B4AF667D3501236]) [    ] o.a.s.c.AbstractZkTestCase put /home/jenkins/workspace/Lucene-Solr-7.6-Linux/solr/core/src/test-files/solr/collection1/conf/old_synonyms.txt to /configs/conf1/old_synonyms.txt
   [junit4]   2> 391319 INFO  (TEST-HttpPartitionOnCommitTest.test-seed#[7B4AF667D3501236]) [    ] o.a.s.c.AbstractZkTestCase put /home/jenkins/workspace/Lucene-Solr-7.6-Linux/solr/core/src/test-files/solr/collection1/conf/synonyms.txt to /configs/conf1/synonyms.txt
   [junit4]   2> 391320 INFO  (TEST-HttpPartitionOnCommitTest.test-seed#[7B4AF667D3501236]) [    ] o.a.s.c.AbstractFullDistribZkTestBase Will use TLOG replicas unless explicitly asked otherwise
   [junit4]   2> 391484 INFO  (TEST-HttpPartitionOnCommitTest.test-seed#[7B4AF667D3501236]) [    ] o.e.j.s.Server jetty-9.4.11.v20180605; built: 2018-06-05T18:24:03.829Z; git: d5fc0523cfa96bfebfbda19606cad384d772f04c; jvm 12-ea+23
   [junit4]   2> 391490 INFO  (TEST-HttpPartitionOnCommitTest.test-seed#[7B4AF667D3501236]) [    ] o.e.j.s.session DefaultSessionIdManager workerName=node0
   [junit4]   2> 391491 INFO  (TEST-HttpPartitionOnCommitTest.test-seed#[7B4AF667D3501236]) [    ] o.e.j.s.session No SessionScavenger set, using defaults
   [junit4]   2> 391491 INFO  (TEST-HttpPartitionOnCommitTest.test-seed#[7B4AF667D3501236]) [    ] o.e.j.s.session node0 Scavenging every 660000ms
   [junit4]   2> 391491 INFO  (TEST-HttpPartitionOnCommitTest.test-seed#[7B4AF667D3501236]) [    ] o.e.j.s.h.ContextHandler Started o.e.j.s.ServletContextHandler@3e935dcd{/,null,AVAILABLE}
   [junit4]   2> 391493 INFO  (TEST-HttpPartitionOnCommitTest.test-seed#[7B4AF667D3501236]) [    ] o.e.j.s.AbstractConnector Started ServerConnector@51f878d0{HTTP/1.1,[http/1.1]}{127.0.0.1:40785}
   [junit4]   2> 391493 INFO  (TEST-HttpPartitionOnCommitTest.test-seed#[7B4AF667D3501236]) [    ] o.e.j.s.Server Started @391514ms
   [junit4]   2> 391493 INFO  (TEST-HttpPartitionOnCommitTest.test-seed#[7B4AF667D3501236]) [    ] o.a.s.c.s.e.JettySolrRunner Jetty properties: {hostContext=/, solr.data.dir=/home/jenkins/workspace/Lucene-Solr-7.6-Linux/solr/build/solr-core/test/J1/temp/solr.cloud.HttpPartitionOnCommitTest_7B4AF667D3501236-001/tempDir-001/control/data, hostPort=33487, coreRootDirectory=/home/jenkins/workspace/Lucene-Solr-7.6-Linux/solr/build/solr-core/test/J1/temp/solr.cloud.HttpPartitionOnCommitTest_7B4AF667D3501236-001/control-001/cores}
   [junit4]   2> 391493 ERROR (TEST-HttpPartitionOnCommitTest.test-seed#[7B4AF667D3501236]) [    ] o.a.s.u.StartupLoggingUtils Missing Java Option solr.log.dir. Logging may be missing or incomplete.
   [junit4]   2> 391493 INFO  (TEST-HttpPartitionOnCommitTest.test-seed#[7B4AF667D3501236]) [    ] o.a.s.s.SolrDispatchFilter Using logger factory org.apache.logging.slf4j.Log4jLoggerFactory
   [junit4]   2> 391494 INFO  (TEST-HttpPartitionOnCommitTest.test-seed#[7B4AF667D3501236]) [    ] o.a.s.s.SolrDispatchFilter  ___      _       Welcome to Apache Solr™ version 7.6.0
   [junit4]   2> 391494 INFO  (TEST-HttpPartitionOnCommitTest.test-seed#[7B4AF667D3501236]) [    ] o.a.s.s.SolrDispatchFilter / __| ___| |_ _   Starting in cloud mode on port null
   [junit4]   2> 391494 INFO  (TEST-HttpPartitionOnCommitTest.test-seed#[7B4AF667D3501236]) [    ] o.a.s.s.SolrDispatchFilter \__ \/ _ \ | '_|  Install dir: null
   [junit4]   2> 391494 INFO  (TEST-HttpPartitionOnCommitTest.test-seed#[7B4AF667D3501236]) [    ] o.a.s.s.SolrDispatchFilter |___/\___/_|_|    Start time: 2018-12-22T10:52:25.183239Z
   [junit4]   2> 391499 INFO  (zkConnectionManagerCallback-1335-thread-1) [    ] o.a.s.c.c.ConnectionManager zkClient has connected
   [junit4]   2> 391500 INFO  (TEST-HttpPartitionOnCommitTest.test-seed#[7B4AF667D3501236]) [    ] o.a.s.s.SolrDispatchFilter Loading solr.xml from SolrHome (not found in ZooKeeper)
   [junit4]   2> 391500 INFO  (TEST-HttpPartitionOnCommitTest.test-seed#[7B4AF667D3501236]) [    ] o.a.s.c.SolrXmlConfig Loading container configuration from /home/jenkins/workspace/Lucene-Solr-7.6-Linux/solr/build/solr-core/test/J1/temp/solr.cloud.HttpPartitionOnCommitTest_7B4AF667D3501236-001/control-001/solr.xml
   [junit4]   2> 391503 INFO  (TEST-HttpPartitionOnCommitTest.test-seed#[7B4AF667D3501236]) [    ] o.a.s.c.SolrXmlConfig Configuration parameter autoReplicaFailoverWorkLoopDelay is ignored
   [junit4]   2> 391503 INFO  (TEST-HttpPartitionOnCommitTest.test-seed#[7B4AF667D3501236]) [    ] o.a.s.c.SolrXmlConfig Configuration parameter autoReplicaFailoverBadNodeExpiration is ignored
   [junit4]   2> 391504 INFO  (TEST-HttpPartitionOnCommitTest.test-seed#[7B4AF667D3501236]) [    ] o.a.s.c.SolrXmlConfig MBean server found: com.sun.jmx.mbeanserver.JmxMBeanServer@797a720f, but no JMX reporters were configured - adding default JMX reporter.
   [junit4]   2> 391606 INFO  (TEST-HttpPartitionOnCommitTest.test-seed#[7B4AF667D3501236]) [    ] o.a.s.c.ZkContainer Zookeeper client=127.0.0.1:43933/solr
   [junit4]   2> 391608 INFO  (zkConnectionManagerCallback-1339-thread-1) [    ] o.a.s.c.c.ConnectionManager zkClient has connected
   [junit4]   2> 391610 INFO  (zkConnectionManagerCallback-1341-thread-1) [    ] o.a.s.c.c.ConnectionManager zkClient has connected
   [junit4]   2> 391669 INFO  (TEST-HttpPartitionOnCommitTest.test-seed#[7B4AF667D3501236]) [n:127.0.0.1:33487_    ] o.a.s.c.OverseerElectionContext I am going to be the leader 127.0.0.1:33487_
   [junit4]   2> 391669 INFO  (TEST-HttpPartitionOnCommitTest.test-seed#[7B4AF667D3501236]) [n:127.0.0.1:33487_    ] o.a.s.c.Overseer Overseer (id=72084675035987972-127.0.0.1:33487_-n_0000000000) starting
   [junit4]   2> 391674 INFO  (zkConnectionManagerCallback-1348-thread-1) [    ] o.a.s.c.c.ConnectionManager zkClient has connected
   [junit4]   2> 391675 INFO  (TEST-HttpPartitionOnCommitTest.test-seed#[7B4AF667D3501236]) [n:127.0.0.1:33487_    ] o.a.s.c.s.i.ZkClientClusterStateProvider Cluster at 127.0.0.1:43933/solr ready
   [junit4]   2> 391676 INFO  (OverseerStateUpdate-72084675035987972-127.0.0.1:33487_-n_0000000000) [n:127.0.0.1:33487_    ] o.a.s.c.Overseer Starting to work on the main queue : 127.0.0.1:33487_
   [junit4]   2> 391677 INFO  (TEST-HttpPartitionOnCommitTest.test-seed#[7B4AF667D3501236]) [n:127.0.0.1:33487_    ] o.a.s.c.ZkController Register node as live in ZooKeeper:/live_nodes/127.0.0.1:33487_
   [junit4]   2> 391678 INFO  (zkCallback-1340-thread-1) [    ] o.a.s.c.c.ZkStateReader Updated live nodes from ZooKeeper... (0) -> (1)
   [junit4]   2> 391678 INFO  (zkCallback-1347-thread-1) [    ] o.a.s.c.c.ZkStateReader Updated live nodes from ZooKeeper... (0) -> (1)
   [junit4]   2> 391702 INFO  (TEST-HttpPartitionOnCommitTest.test-seed#[7B4AF667D3501236]) [n:127.0.0.1:33487_    ] o.a.s.h.a.MetricsHistoryHandler No .system collection, keeping metrics history in memory.
   [junit4]   2> 391734 INFO  (TEST-HttpPartitionOnCommitTest.test-seed#[7B4AF667D3501236]) [n:127.0.0.1:33487_    ] o.a.s.m.r.SolrJmxReporter JMX monitoring for 'solr.node' (registry 'solr.node') enabled at server: com.sun.jmx.mbeanserver.JmxMBeanServer@797a720f
   [junit4]   2> 391756 INFO  (TEST-HttpPartitionOnCommitTest.test-seed#[7B4AF667D3501236]) [n:127.0.0.1:33487_    ] o.a.s.m.r.SolrJmxReporter JMX monitoring for 'solr.jvm' (registry 'solr.jvm') enabled at server: com.sun.jmx.mbeanserver.JmxMBeanServer@797a720f
   [junit4]   2> 391756 INFO  (TEST-HttpPartitionOnCommitTest.test-seed#[7B4AF667D3501236]) [n:127.0.0.1:33487_    ] o.a.s.m.r.SolrJmxReporter JMX monitoring for 'solr.jetty' (registry 'solr.jetty') enabled at server: com.sun.jmx.mbeanserver.JmxMBeanServer@797a720f
   [junit4]   2> 391759 INFO  (TEST-HttpPartitionOnCommitTest.test-seed#[7B4AF667D3501236]) [n:127.0.0.1:33487_    ] o.a.s.c.CorePropertiesLocator Found 0 core definitions underneath /home/jenkins/workspace/Lucene-Solr-7.6-Linux/solr/build/solr-core/test/J1/temp/solr.cloud.HttpPartitionOnCommitTest_7B4AF667D3501236-001/control-001/cores
   [junit4]   2> 391791 INFO  (zkConnectionManagerCallback-1354-thread-1) [    ] o.a.s.c.c.ConnectionManager zkClient has connected
   [junit4]   2> 391792 INFO  (TEST-HttpPartitionOnCommitTest.test-seed#[7B4AF667D3501236]) [    ] o.a.s.c.c.ZkStateReader Updated live nodes from ZooKeeper... (0) -> (1)
   [junit4]   2> 391792 INFO  (TEST-HttpPartitionOnCommitTest.test-seed#[7B4AF667D3501236]) [    ] o.a.s.c.s.i.ZkClientClusterStateProvider Cluster at 127.0.0.1:43933/solr ready
   [junit4]   2> 391793 INFO  (SocketProxy-Acceptor-33487) [    ] o.a.s.c.SocketProxy accepted Socket[addr=/127.0.0.1,port=40590,localport=33487], receiveBufferSize:531000
   [junit4]   2> 391794 INFO  (SocketProxy-Acceptor-33487) [    ] o.a.s.c.SocketProxy proxy connection Socket[addr=/127.0.0.1,port=40785,localport=45858], receiveBufferSize=530904
   [junit4]   2> 391796 INFO  (qtp1169094312-4446) [n:127.0.0.1:33487_    ] o.a.s.h.a.CollectionsHandler Invoked Collection Action :create with params collection.configName=conf1&name=control_collection&nrtReplicas=1&action=CREATE&numShards=1&createNodeSet=127.0.0.1:33487_&wt=javabin&version=2 and sendToOCPQueue=true
   [junit4]   2> 391798 INFO  (OverseerThreadFactory-1737-thread-1-processing-n:127.0.0.1:33487_) [n:127.0.0.1:33487_    ] o.a.s.c.a.c.CreateCollectionCmd Create collection control_collection
   [junit4]   2> 391902 INFO  (SocketProxy-Acceptor-33487) [    ] o.a.s.c.SocketProxy accepted Socket[addr=/127.0.0.1,port=40594,localport=33487], receiveBufferSize:531000
   [junit4]   2> 391902 INFO  (SocketProxy-Acceptor-33487) [    ] o.a.s.c.SocketProxy proxy connection Socket[addr=/127.0.0.1,port=40785,localport=45862], receiveBufferSize=530904
   [junit4]   2> 391905 INFO  (qtp1169094312-4441) [n:127.0.0.1:33487_    ] o.a.s.s.HttpSolrCall [admin] webapp=null path=/admin/metrics params={prefix=CONTAINER.fs.usableSpace,CONTAINER.fs.totalSpace,CORE.coreName&wt=javabin&version=2&group=solr.node,solr.core} status=0 QTime=0
   [junit4]   2> 391907 INFO  (SocketProxy-Acceptor-33487) [    ] o.a.s.c.SocketProxy accepted Socket[addr=/127.0.0.1,port=40598,localport=33487], receiveBufferSize:531000
   [junit4]   2> 391910 INFO  (SocketProxy-Acceptor-33487) [    ] o.a.s.c.SocketProxy proxy connection Socket[addr=/127.0.0.1,port=40785,localport=45866], receiveBufferSize=530904
   [junit4]   2> 391911 INFO  (qtp1169094312-4442) [n:127.0.0.1:33487_    x:control_collection_shard1_replica_n1] o.a.s.h.a.CoreAdminOperation core create command qt=/admin/cores&collection.configName=conf1&newCollection=true&name=control_collection_shard1_replica_n1&action=CREATE&numShards=1&collection=control_collection&shard=shard1&wt=javabin&version=2&replicaType=NRT
   [junit4]   2> 391911 INFO  (qtp1169094312-4442) [n:127.0.0.1:33487_    x:control_collection_shard1_replica_n1] o.a.s.c.TransientSolrCoreCacheDefault Allocating transient cache for 4 transient cores
   [junit4]   2> 392946 INFO  (qtp1169094312-4442) [n:127.0.0.1:33487_ c:control_collection s:shard1  x:control_collection_shard1_replica_n1] o.a.s.c.SolrConfig Using Lucene MatchVersion: 7.6.0
   [junit4]   2> 392956 INFO  (qtp1169094312-4442) [n:127.0.0.1:33487_ c:control_collection s:shard1  x:control_collection_shard1_replica_n1] o.a.s.s.IndexSchema [control_collection_shard1_replica_n1] Schema name=test
   [junit4]   2> 393020 INFO  (qtp1169094312-4442) [n:127.0.0.1:33487_ c:control_collection s:shard1  x:control_collection_shard1_replica_n1] o.a.s.s.IndexSchema Loaded schema test/1.0 with uniqueid field id
   [junit4]   2> 393031 INFO  (qtp1169094312-4442) [n:127.0.0.1:33487_ c:control_collection s:shard1  x:control_collection_shard1_replica_n1] o.a.s.c.CoreContainer Creating SolrCore 'control_collection_shard1_replica_n1' using configuration from collection control_collection, trusted=true
   [junit4]   2> 393032 INFO  (qtp1169094312-4442) [n:127.0.0.1:33487_ c:control_collection s:shard1  x:control_collection_shard1_replica_n1] o.a.s.m.r.SolrJmxReporter JMX monitoring for 'solr.core.control_collection.shard1.replica_n1' (registry 'solr.core.control_collection.shard1.replica_n1') enabled at server: com.sun.jmx.mbeanserver.JmxMBeanServer@797a720f
   [junit4]   2> 393032 INFO  (qtp1169094312-4442) [n:127.0.0.1:33487_ c:control_collection s:shard1  x:control_collection_shard1_replica_n1] o.a.s.c.SolrCore [[control_collection_shard1_replica_n1] ] Opening new SolrCore at [/home/jenkins/workspace/Lucene-Solr-7.6-Linux/solr/build/solr-core/test/J1/temp/solr.cloud.HttpPartitionOnCommitTest_7B4AF667D3501236-001/control-001/cores/control_collection_shard1_replica_n1], dataDir=[/home/jenkins/workspace/Lucene-Solr-7.6-Linux/solr/build/solr-core/test/J1/temp/solr.cloud.HttpPartitionOnCommitTest_7B4AF667D3501236-001/control-001/cores/control_collection_shard1_replica_n1/data/]
   [junit4]   2> 393037 INFO  (qtp1169094312-4442) [n:127.0.0.1:33487_ c:control_collection s:shard1  x:control_collection_shard1_replica_n1] o.a.s.u.RandomMergePolicy RandomMergePolicy wrapping class org.apache.lucene.index.TieredMergePolicy: [TieredMergePolicy: maxMergeAtOnce=24, maxMergeAtOnceExplicit=49, maxMergedSegmentMB=39.4287109375, floorSegmentMB=1.84765625, forceMergeDeletesPctAllowed=7.178787127834627, segmentsPerTier=49.0, maxCFSSegmentSizeMB=8.796093022207999E12, noCFSRatio=1.0, deletesPctAllowed=26.67481753640823
   [junit4]   2> 393038 WARN  (qtp1169094312-4442) [n:127.0.0.1:33487_ c:control_collection s:shard1  x:control_collection_shard1_replica_n1] o.a.s.c.RequestHandlers INVALID paramSet a in requestHandler {type = requestHandler,name = /dump,class = DumpRequestHandler,attributes = {initParams=a, name=/dump, class=DumpRequestHandler},args = {defaults={a=A,b=B}}}
   [junit4]   2> 393111 INFO  (qtp1169094312-4442) [n:127.0.0.1:33487_ c:control_collection s:shard1  x:control_collection_shard1_replica_n1] o.a.s.u.UpdateHandler Using UpdateLog implementation: org.apache.solr.update.UpdateLog
   [junit4]   2> 393111 INFO  (qtp1169094312-4442) [n:127.0.0.1:33487_ c:control_collection s:shard1  x:control_collection_shard1_replica_n1] o.a.s.u.UpdateLog Initializing UpdateLog: dataDir= defaultSyncLevel=FLUSH numRecordsToKeep=100 maxNumLogsToKeep=10 numVersionBuckets=65536
   [junit4]   2> 393112 INFO  (qtp1169094312-4442) [n:127.0.0.1:33487_ c:control_collection s:shard1  x:control_collection_shard1_replica_n1] o.a.s.u.CommitTracker Hard AutoCommit: disabled
   [junit4]   2> 393112 INFO  (qtp1169094312-4442) [n:127.0.0.1:33487_ c:control_collection s:shard1  x:control_collection_shard1_replica_n1] o.a.s.u.CommitTracker Soft AutoCommit: disabled
   [junit4]   2> 393114 INFO  (qtp1169094312-4442) [n:127.0.0.1:33487_ c:control_collection s:shard1  x:control_collection_shard1_replica_n1] o.a.s.u.RandomMergePolicy RandomMergePolicy wrapping class org.apache.lucene.index.TieredMergePolicy: [TieredMergePolicy: maxMergeAtOnce=38, maxMergeAtOnceExplicit=29, maxMergedSegmentMB=99.85546875, floorSegmentMB=1.6484375, forceMergeDeletesPctAllowed=22.733248125697617, segmentsPerTier=16.0, maxCFSSegmentSizeMB=8.796093022207999E12, noCFSRatio=1.0, deletesPctAllowed=21.486900891590935
   [junit4]   2> 393115 INFO  (qtp1169094312-4442) [n:127.0.0.1:33487_ c:control_collection s:shard1  x:control_collection_shard1_replica_n1] o.a.s.s.SolrIndexSearcher Opening [Searcher@65111669[control_collection_shard1_replica_n1] main]
   [junit4]   2> 393116 INFO  (qtp1169094312-4442) [n:127.0.0.1:33487_ c:control_collection s:shard1  x:control_collection_shard1_replica_n1] o.a.s.r.ManagedResourceStorage Configured ZooKeeperStorageIO with znodeBase: /configs/conf1
   [junit4]   2> 393116 INFO  (qtp1169094312-4442) [n:127.0.0.1:33487_ c:control_collection s:shard1  x:control_collection_shard1_replica_n1] o.a.s.r.ManagedResourceStorage Loaded null at path _rest_managed.json using ZooKeeperStorageIO:path=/configs/conf1
   [junit4]   2> 393117 INFO  (qtp1169094312-4442) [n:127.0.0.1:33487_ c:control_collection s:shard1  x:control_collection_shard1_replica_n1] o.a.s.h.ReplicationHandler Commits will be reserved for 10000ms.
   [junit4]   2> 393117 INFO  (qtp1169094312-4442) [n:127.0.0.1:33487_ c:control_collection s:shard1  x:control_collection_shard1_replica_n1] o.a.s.u.UpdateLog Could not find max version in index or recent updates, using new clock 1620548986398048256
   [junit4]   2> 393119 INFO  (searcherExecutor-1742-thread-1-processing-n:127.0.0.1:33487_ x:control_collection_shard1_replica_n1 c:control_collection s:shard1) [n:127.0.0.1:33487_ c:control_collection s:shard1  x:control_collection_shard1_replica_n1] o.a.s.c.SolrCore [control_collection_shard1_replica_n1] Registered new searcher Searcher@65111669[control_collection_shard1_replica_n1] main{ExitableDirectoryReader(UninvertingDirectoryReader())}
   [junit4]   2> 393122 INFO  (qtp1169094312-4442) [n:127.0.0.1:33487_ c:control_collection s:shard1  x:control_collection_shard1_replica_n1] o.a.s.c.ZkShardTerms Successful update of terms at /collections/control_collection/terms/shard1 to Terms{values={core_node2=0}, version=0}
   [junit4]   2> 393124 INFO  (qtp1169094312-4442) [n:127.0.0.1:33487_ c:control_collection s:shard1  x:control_collection_shard1_replica_n1] o.a.s.c.ShardLeaderElectionContext Enough replicas found to continue.
   [junit4]   2> 393124 INFO  (qtp1169094312-4442) [n:127.0.0.1:33487_ c:control_collection s:shard1  x:control_collection_shard1_replica_n1] o.a.s.c.ShardLeaderElectionContext I may be the new leader - try and sync
   [junit4]   2> 393124 INFO  (qtp1169094312-4442) [n:127.0.0.1:33487_ c:control_collection s:shard1  x:control_collection_shard1_replica_n1] o.a.s.c.SyncStrategy Sync replicas to http://127.0.0.1:33487/control_collection_shard1_replica_n1/
   [junit4]   2> 393124 INFO  (qtp1169094312-4442) [n:127.0.0.1:33487_ c:control_collection s:shard1  x:control_collection_shard1_replica_n1] o.a.s.c.SyncStrategy Sync Success - now sync replicas to me
   [junit4]   2> 393124 INFO  (qtp1169094312-4442) [n:127.0.0.1:33487_ c:control_collection s:shard1  x:control_collection_shard1_replica_n1] o.a.s.c.SyncStrategy http://127.0.0.1:33487/control_collection_shard1_replica_n1/ has no replicas
   [junit4]   2> 393124 INFO  (qtp1169094312-4442) [n:127.0.0.1:33487_ c:control_collection s:shard1  x:control_collection_shard1_replica_n1] o.a.s.c.ShardLeaderElectionContext Found all replicas participating in election, clear LIR
   [junit4]   2> 393126 INFO  (qtp1169094312-4442) [n:127.0.0.1:33487_ c:control_collection s:shard1  x:control_collection_shard1_replica_n1] o.a.s.c.ShardLeaderElectionContext I am the new leader: http://127.0.0.1:33487/control_collection_shard1_replica_n1/ shard1
   [junit4]   2> 393228 INFO  (qtp1169094312-4442) [n:127.0.0.1:33487_ c:control_collection s:shard1  x:control_collection_shard1_replica_n1] o.a.s.c.ZkController I am the leader, no recovery necessary
   [junit4]   2> 393229 INFO  (qtp1169094312-4442) [n:127.0.0.1:33487_ c:control_collection s:shard1  x:control_collection_shard1_replica_n1] o.a.s.s.HttpSolrCall [admin] webapp=null path=/admin/cores params={qt=/admin/cores&collection.configName=conf1&newCollection=true&name=control_collection_shard1_replica_n1&action=CREATE&numShards=1&collection=control_collection&shard=shard1&wt=javabin&version=2&replicaType=NRT} status=0 QTime=1318
   [junit4]   2> 393232 INFO  (qtp1169094312-4446) [n:127.0.0.1:33487_    ] o.a.s.h.a.CollectionsHandler Wait for new collection to be active for at most 30 seconds. Check all shard replicas
   [junit4]   2> 393330 INFO  (zkCallback-1340-thread-1) [    ] o.a.s.c.c.ZkStateReader A cluster state change: [WatchedEvent state:SyncConnected type:NodeDataChanged path:/collections/control_collection/state.json] for collection [control_collection] has occurred - updating... (live nodes size: [1])
   [junit4]   2> 393799 INFO  (OverseerCollectionConfigSetProcessor-72084675035987972-127.0.0.1:33487_-n_0000000000) [n:127.0.0.1:33487_    ] o.a.s.c.OverseerTaskQueue Response ZK path: /overseer/collection-queue-work/qnr-0000000000 doesn't exist.  Requestor may have disconnected from ZooKeeper
   [junit4]   2> 394232 INFO  (qtp1169094312-4446) [n:127.0.0.1:33487_    ] o.a.s.s.HttpSolrCall [admin] webapp=null path=/admin/collections params={collection.configName=conf1&name=control_collection&nrtReplicas=1&action=CREATE&numShards=1&createNodeSet=127.0.0.1:33487_&wt=javabin&version=2} status=0 QTime=2436
   [junit4]   2> 394236 INFO  (zkConnectionManagerCallback-1359-thread-1) [    ] o.a.s.c.c.ConnectionManager zkClient has connected
   [junit4]   2> 394237 INFO  (TEST-HttpPartitionOnCommitTest.test-seed#[7B4AF667D3501236]) [    ] o.a.s.c.c.ZkStateReader Updated live nodes from ZooKeeper... (0) -> (1)
   [junit4]   2> 394238 INFO  (TEST-HttpPartitionOnCommitTest.test-seed#[7B4AF667D3501236]) [    ] o.a.s.c.s.i.ZkClientClusterStateProvider Cluster at 127.0.0.1:43933/solr ready
   [junit4]   2> 394238 INFO  (TEST-HttpPartitionOnCommitTest.test-seed#[7B4AF667D3501236]) [    ] o.a.s.c.ChaosMonkey monkey: init - expire sessions:false cause connection loss:false
   [junit4]   2> 394238 INFO  (SocketProxy-Acceptor-33487) [    ] o.a.s.c.SocketProxy accepted Socket[addr=/127.0.0.1,port=40604,localport=33487], receiveBufferSize:531000
   [junit4]   2> 394239 INFO  (SocketProxy-Acceptor-33487) [    ] o.a.s.c.SocketProxy proxy connection Socket[addr=/127.0.0.1,port=40785,localport=45872], receiveBufferSize=530904
   [junit4]   2> 394239 INFO  (qtp1169094312-4439) [n:127.0.0.1:33487_    ] o.a.s.h.a.CollectionsHandler Invoked Collection Action :create with params collection.configName=conf1&name=collection1&nrtReplicas=1&action=CREATE&numShards=1&createNodeSet=&stateFormat=2&wt=javabin&version=2 and sendToOCPQueue=true
   [junit4]   2> 394241 INFO  (OverseerThreadFactory-1737-thread-2-processing-n:127.0.0.1:33487_) [n:127.0.0.1:33487_    ] o.a.s.c.a.c.CreateCollectionCmd Create collection collection1
   [junit4]   2> 394443 WARN  (OverseerThreadFactory-1737-thread-2-processing-n:127.0.0.1:33487_) [n:127.0.0.1:33487_    ] o.a.s.c.a.c.CreateCollectionCmd It is unusual to create a collection (collection1) without cores.
   [junit4]   2> 394445 INFO  (qtp1169094312-4439) [n:127.0.0.1:33487_    ] o.a.s.h.a.CollectionsHandler Wait for new collection to be active for at most 30 seconds. Check all shard replicas
   [junit4]   2> 394446 INFO  (qtp1169094312-4439) [n:127.0.0.1:33487_    ] o.a.s.s.HttpSolrCall [admin] webapp=null path=/admin/collections params={collection.configName=conf1&name=collection1&nrtReplicas=1&action=CREATE&numShards=1&createNodeSet=&stateFormat=2&wt=javabin&version=2} status=0 QTime=206
   [junit4]   2> 394568 INFO  (TEST-HttpPartitionOnCommitTest.test-seed#[7B4AF667D3501236]) [    ] o.a.s.c.AbstractFullDistribZkTestBase create jetty 1 in directory /home/jenkins/workspace/Lucene-Solr-7.6-Linux/solr/build/solr-core/test/J1/temp/solr.cloud.HttpPartitionOnCommitTest_7B4AF667D3501236-001/shard-1-001 of type TLOG
   [junit4]   2> 394568 INFO  (TEST-HttpPartitionOnCommitTest.test-seed#[7B4AF667D3501236]) [    ] o.e.j.s.Server jetty-9.4.11.v20180605; built: 2018-06-05T18:24:03.829Z; git: d5fc0523cfa96bfebfbda19606cad384d772f04c; jvm 12-ea+23
   [junit4]   2> 394569 INFO  (TEST-HttpPartitionOnCommitTest.test-seed#[7B4AF667D3501236]) [    ] o.e.j.s.session DefaultSessionIdManager workerName=node0
   [junit4]   2> 394569 INFO  (TEST-HttpPartitionOnCommitTest.test-seed#[7B4AF667D3501236]) [    ] o.e.j.s.session No SessionScavenger set, using defaults
   [junit4]   2> 394569 INFO  (TEST-HttpPartitionOnCommitTest.test-seed#[7B4AF667D3501236]) [    ] o.e.j.s.session node0 Scavenging every 660000ms
   [junit4]   2> 394569 INFO  (TEST-HttpPartitionOnCommitTest.test-seed#[7B4AF667D3501236]) [    ] o.e.j.s.h.ContextHandler Started o.e.j.s.ServletContextHandler@1f7adc0e{/,null,AVAILABLE}
   [junit4]   2> 394570 INFO  (TEST-HttpPartitionOnCommitTest.test-seed#[7B4AF667D3501236]) [    ] o.e.j.s.AbstractConnector Started ServerConnector@27d40ee3{HTTP/1.1,[http/1.1]}{127.0.0.1:37493}
   [junit4]   2> 394570 INFO  (TEST-HttpPartitionOnCommitTest.test-seed#[7B4AF667D3501236]) [    ] o.e.j.s.Server Started @394592ms
   [junit4]   2> 394570 INFO  (TEST-HttpPartitionOnCommitTest.test-seed#[7B4AF667D3501236]) [    ] o.a.s.c.s.e.JettySolrRunner Jetty properties: {hostContext=/, solrconfig=solrconfig.xml, solr.data.dir=/home/jenkins/workspace/Lucene-Solr-7.6-Linux/solr/build/solr-core/test/J1/temp/solr.cloud.HttpPartitionOnCommitTest_7B4AF667D3501236-001/tempDir-001/jetty1, hostPort=36345, coreRootDirectory=/home/jenkins/workspace/Lucene-Solr-7.6-Linux/solr/build/solr-core/test/J1/temp/solr.cloud.HttpPartitionOnCommitTest_7B4AF667D3501236-001/shard-1-001/cores, replicaType=TLOG}
   [junit4]   2> 394570 ERROR (TEST-HttpPartitionOnCommitTest.test-seed#[7B4AF667D3501236]) [    ] o.a.s.u.StartupLoggingUtils Missing Java Option solr.log.dir. Logging may be missing or incomplete.
   [junit4]   2> 394570 INFO  (TEST-HttpPartitionOnCommitTest.test-seed#[7B4AF667D3501236]) [    ] o.a.s.s.SolrDispatchFilter Using logger factory org.apache.logging.slf4j.Log4jLoggerFactory
   [junit4]   2> 394570 INFO  (TEST-HttpPartitionOnCommitTest.test-seed#[7B4AF667D3501236]) [    ] o.a.s.s.SolrDispatchFilter  ___      _       Welcome to Apache Solr™ version 7.6.0
   [junit4]   2> 394570 INFO  (TEST-HttpPartitionOnCommitTest.test-seed#[7B4AF667D3501236]) [    ] o.a.s.s.SolrDispatchFilter / __| ___| |_ _   Starting in cloud mode on port null
   [junit4]   2> 394570 INFO  (TEST-HttpPartitionOnCommitTest.test-seed#[7B4AF667D3501236]) [    ] o.a.s.s.SolrDispatchFilter \__ \/ _ \ | '_|  Install dir: null
   [junit4]   2> 394571 INFO  (TEST-HttpPartitionOnCommitTest.test-seed#[7B4AF667D3501236]) [    ] o.a.s.s.SolrDispatchFilter |___/\___/_|_|    Start time: 2018-12-22T10:52:28.260005Z
   [junit4]   2> 394572 INFO  (zkConnectionManagerCallback-1361-thread-1) [    ] o.a.s.c.c.ConnectionManager zkClient has connected
   [junit4]   2> 394573 INFO  (TEST-HttpPartitionOnCommitTest.test-seed#[7B4AF667D3501236]) [    ] o.a.s.s.SolrDispatchFilter Loading solr.xml from SolrHome (not found in ZooKeeper)
   [junit4]   2> 394573 INFO  (TEST-HttpPartitionOnCommitTest.test-seed#[7B4AF667D3501236]) [    ] o.a.s.c.SolrXmlConfig Loading container configuration from /home/jenkins/workspace/Lucene-Solr-7.6-Linux/solr/build/solr-core/test/J1/temp/solr.cloud.HttpPartitionOnCommitTest_7B4AF667D3501236-001/shard-1-001/solr.xml
   [junit4]   2> 394575 INFO  (TEST-HttpPartitionOnCommitTest.test-seed#[7B4AF667D3501236]) [    ] o.a.s.c.SolrXmlConfig Configuration parameter autoReplicaFailoverWorkLoopDelay is ignored
   [junit4]   2> 394575 INFO  (TEST-HttpPartitionOnCommitTest.test-seed#[7B4AF667D3501236]) [    ] o.a.s.c.SolrXmlConfig Configuration parameter autoReplicaFailoverBadNodeExpiration is ignored
   [junit4]   2> 394576 INFO  (TEST-HttpPartitionOnCommitTest.test-seed#[7B4AF667D3501236]) [    ] o.a.s.c.SolrXmlConfig MBean server found: com.sun.jmx.mbeanserver.JmxMBeanServer@797a720f, but no JMX reporters were configured - adding default JMX reporter.
   [junit4]   2> 394606 INFO  (TEST-HttpPartitionOnCommitTest.test-seed#[7B4AF667D3501236]) [    ] o.a.s.c.ZkContainer Zookeeper client=127.0.0.1:43933/solr
   [junit4]   2> 394607 INFO  (zkConnectionManagerCallback-1365-thread-1) [    ] o.a.s.c.c.ConnectionManager zkClient has connected
   [junit4]   2> 394609 INFO  (zkConnectionManagerCallback-1367-thread-1) [    ] o.a.s.c.c.ConnectionManager zkClient has connected
   [junit4]   2> 394612 INFO  (TEST-HttpPartitionOnCommitTest.test-seed#[7B4AF667D3501236]) [    ] o.a.s.c.c.ZkStateReader Updated live nodes from ZooKeeper... (0) -> (1)
   [junit4]   2> 394614 INFO  (TEST-HttpPartitionOnCommitTest.test-seed#[7B4AF667D3501236]) [    ] o.a.s.c.TransientSolrCoreCacheDefault Allocating transient cache for 4 transient cores
   [junit4]   2> 394614 INFO  (TEST-HttpPartitionOnCommitTest.test-seed#[7B4AF667D3501236]) [    ] o.a.s.c.ZkController Register node as live in ZooKeeper:/live_nodes/127.0.0.1:36345_
   [junit4]   2> 394615 INFO  (zkCallback-1347-thread-1) [    ] o.a.s.c.c.ZkStateReader Updated live nodes from ZooKeeper... (1) -> (2)
   [junit4]   2> 394615 INFO  (zkCallback-1340-thread-2) [    ] o.a.s.c.c.ZkStateReader Updated live nodes from ZooKeeper... (1) -> (2)
   [junit4]   2> 394615 INFO  (zkCallback-1358-thread-1) [    ] o.a.s.c.c.ZkStateReader Updated live nodes from ZooKeeper... (1) -> (2)
   [junit4]   2> 394615 INFO  (zkCallback-1366-thread-1) [    ] o.a.s.c.c.ZkStateReader Updated live nodes from ZooKeeper... (1) -> (2)
   [junit4]   2> 394637 INFO  (zkConnectionManagerCallback-1374-thread-1) [    ] o.a.s.c.c.ConnectionManager zkClient has connected
   [junit4]   2> 394638 INFO  (TEST-HttpPartitionOnCommitTest.test-seed#[7B4AF667D3501236]) [    ] o.a.s.c.c.ZkStateReader Updated live nodes from ZooKeeper... (0) -> (2)
   [junit4]   2> 394639 INFO  (TEST-HttpPartitionOnCommitTest.test-seed#[7B4AF667D3501236]) [    ] o.a.s.c.s.i.ZkClientClusterStateProvider Cluster at 127.0.0.1:43933/solr ready
   [junit4]   2> 394639 INFO  (TEST-HttpPartitionOnCommitTest.test-seed#[7B4AF667D3501236]) [    ] o.a.s.h.a.MetricsHistoryHandler No .system collection, keeping metrics history in memory.
   [junit4]   2> 394667 INFO  (TEST-HttpPartitionOnCommitTest.test-seed#[7B4AF667D3501236]) [    ] o.a.s.m.r.SolrJmxReporter JMX monitoring for 'solr.node' (registry 'solr.node') enabled at server: com.sun.jmx.mbeanserver.JmxMBeanServer@797a720f
   [junit4]   2> 394682 INFO  (TEST-HttpPartitionOnCommitTest.test-seed#[7B4AF667D3501236]) [    ] o.a.s.m.r.SolrJmxReporter JMX monitoring for 'solr.jvm' (registry 'solr.jvm') enabled at server: com.sun.jmx.mbeanserver.JmxMBeanServer@797a720f
   [junit4]   2> 394683 INFO  (TEST-HttpPartitionOnCommitTest.test-seed#[7B4AF667D3501236]) [    ] o.a.s.m.r.SolrJmxReporter JMX monitoring for 'solr.jetty' (registry 'solr.jetty') enabled at server: com.sun.jmx.mbeanserver.JmxMBeanServer@797a720f
   [junit4]   2> 394685 INFO  (TEST-HttpPartitionOnCommitTest.test-seed#[7B4AF667D3501236]) [    ] o.a.s.c.CorePropertiesLocator Found 0 core definitions underneath /home/jenkins/workspace/Lucene-Solr-7.6-Linux/solr/build/solr-core/test/J1/temp/solr.cloud.HttpPartitionOnCommitTest_7B4AF667D3501236-001/shard-1-001/cores
   [junit4]   2> 394718 INFO  (qtp1169094312-4487) [n:127.0.0.1:33487_    ] o.a.s.h.a.CollectionsHandler Invoked Collection Action :addreplica with params node=127.0.0.1:36345_&action=ADDREPLICA&collection=collection1&shard=shard1&type=TLOG&wt=javabin&version=2 and sendToOCPQueue=true
   [junit4]   2> 394719 INFO  (OverseerCollectionConfigSetProcessor-72084675035987972-127.0.0.1:33487_-n_0000000000) [n:127.0.0.1:33487_    ] o.a.s.c.OverseerTaskQueue Response ZK path: /overseer/collection-queue-work/qnr-0000000002 doesn't exist.  Requestor may have disconnected from ZooKeeper
   [junit4]   2> 394721 INFO  (qtp1169094312-4445) [n:127.0.0.1:33487_    ] o.a.s.s.HttpSolrCall [admin] webapp=null path=/admin/metrics params={wt=javabin&version=2&key=solr.core.control_collection.shard1.replica_n1:INDEX.sizeInBytes} status=0 QTime=0
   [junit4]   2> 394722 INFO  (qtp1169094312-4440) [n:127.0.0.1:33487_    ] o.a.s.s.HttpSolrCall [admin] webapp=null path=/admin/metrics params={prefix=CONTAINER.fs.usableSpace,CONTAINER.fs.totalSpace,CORE.coreName&wt=javabin&version=2&group=solr.node,solr.core} status=0 QTime=0
   [junit4]   2> 394723 INFO  (SocketProxy-Acceptor-36345) [    ] o.a.s.c.SocketProxy accepted Socket[addr=/127.0.0.1,port=36822,localport=36345], receiveBufferSize:531000
   [junit4]   2> 394723 INFO  (SocketProxy-Acceptor-36345) [    ] o.a.s.c.SocketProxy proxy connection Socket[addr=/127.0.0.1,port=37493,localport=39398], receiveBufferSize=530904
   [junit4]   2> 394724 INFO  (qtp16099586-4510) [n:127.0.0.1:36345_    ] o.a.s.s.HttpSolrCall [admin] webapp=null path=/admin/metrics params={prefix=CONTAINER.fs.usableSpace,CONTAINER.fs.totalSpace,CORE.coreName&wt=javabin&version=2&group=solr.node,solr.core} status=0 QTime=0
   [junit4]   2> 394725 INFO  (OverseerThreadFactory-1737-thread-3-processing-n:127.0.0.1:33487_) [n:127.0.0.1:33487_ c:collection1 s:shard1  ] o.a.s.c.a.c.AddReplicaCmd Node Identified 127.0.0.1:36345_ for creating new replica of shard shard1 for collection collection1
   [junit4]   2> 394726 INFO  (SocketProxy-Acceptor-36345) [    ] o.a.s.c.SocketProxy accepted Socket[addr=/127.0.0.1,port=36826,localport=36345], receiveBufferSize:531000
   [junit4]   2> 394726 INFO  (SocketProxy-Acceptor-36345) [    ] o.a.s.c.SocketProxy proxy connection Socket[addr=/127.0.0.1,port=37493,localport=39402], receiveBufferSize=530904
   [junit4]   2> 394727 INFO  (qtp16099586-4505) [n:127.0.0.1:36345_    x:collection1_shard1_replica_t21] o.a.s.h.a.CoreAdminOperation core create command qt=/admin/cores&collection.configName=conf1&name=collection1_shard1_replica_t21&action=CREATE&collection=collection1&shard=shard1&wt=javabin&version=2&replicaType=TLOG
   [junit4]   2> 395736 INFO  (qtp16099586-4505) [n:127.0.0.1:36345_ c:collection1 s:shard1  x:collection1_shard1_replica_t21] o.a.s.c.SolrConfig Using Lucene MatchVersion: 7.6.0
   [junit4]   2> 395753 INFO  (qtp16099586-4505) [n:127.0.0.1:36345_ c:collection1 s:shard1  x:collection1_shard1_replica_t21] o.a.s.s.IndexSchema [collection1_shard1_replica_t21] Schema name=test
   [junit4]   2> 395809 INFO  (qtp16099586-4505) [n:127.0.0.1:36345_ c:collection1 s:shard1  x:collection1_shard1_replica_t21] o.a.s.s.IndexSchema Loaded schema test/1.0 with uniqueid field id
   [junit4]   2> 395819 INFO  (qtp16099586-4505) [n:127.0.0.1:36345_ c:collection1 s:shard1  x:collection1_shard1_replica_t21] o.a.s.c.CoreContainer Creating SolrCore 'collection1_shard1_replica_t21' using configuration from collection collection1, trusted=true
   [junit4]   2> 395820 INFO  (qtp16099586-4505) [n:127.0.0.1:36345_ c:collection1 s:shard1  x:collection1_shard1_replica_t21] o.a.s.m.r.SolrJmxReporter JMX monitoring for 'solr.core.collection1.shard1.replica_t21' (registry 'solr.core.collection1.shard1.replica_t21') enabled at server: com.sun.jmx.mbeanserver.JmxMBeanServer@797a720f
   [junit4]   2> 395820 INFO  (qtp16099586-4505) [n:127.0.0.1:36345_ c:collection1 s:shard1  x:collection1_shard1_replica_t21] o.a.s.c.SolrCore [[collection1_shard1_replica_t21] ] Opening new SolrCore at [/home/jenkins/workspace/Lucene-Solr-7.6-Linux/solr/build/solr-core/test/J1/temp/solr.cloud.HttpPartitionOnCommitTest_7B4AF667D3501236-001/shard-1-001/cores/collection1_shard1_replica_t21], dataDir=[/home/jenkins/workspace/Lucene-Solr-7.6-Linux/solr/build/solr-core/test/J1/temp/solr.cloud.HttpPartitionOnCommitTest_7B4AF667D3501236-001/shard-1-001/cores/collection1_shard1_replica_t21/data/]
   [junit4]   2> 395823 INFO  (qtp16099586-4505) [n:127.0.0.1:36345_ c:collection1 s:shard1  x:collection1_shard1_replica_t21] o.a.s.u.RandomMergePolicy RandomMergePolicy wrapping class org.apache.lucene.index.TieredMergePolicy: [TieredMergePolicy: maxMergeAtOnce=24, maxMergeAtOnceExplicit=49, maxMergedSegmentMB=39.4287109375, floorSegmentMB=1.84765625, forceMergeDeletesPctAllowed=7.178787127834627, segmentsPerTier=49.0, maxCFSSegmentSizeMB=8.796093022207999E12, noCFSRatio=1.0, deletesPctAllowed=26.67481753640823
   [junit4]   2> 395824 WARN  (qtp16099586-4505) [n:127.0.0.1:36345_ c:collection1 s:shard1  x:collection1_shard1_replica_t21] o.a.s.c.RequestHandlers INVALID paramSet a in requestHandler {type = requestHandler,name = /dump,class = DumpRequestHandler,attributes = {initParams=a, name=/dump, class=DumpRequestHandler},args = {defaults={a=A,b=B}}}
   [junit4]   2> 395895 INFO  (qtp16099586-4505) [n:127.0.0.1:36345_ c:collection1 s:shard1  x:collection1_shard1_replica_t21] o.a.s.u.UpdateHandler Using UpdateLog implementation: org.apache.solr.update.UpdateLog
   [junit4]   2> 395895 INFO  (qtp16099586-4505) [n:127.0.0.1:36345_ c:collection1 s:shard1  x:collection1_shard1_replica_t21] o.a.s.u.UpdateLog Initializing UpdateLog: dataDir= defaultSyncLevel=FLUSH numRecordsToKeep=100 maxNumLogsToKeep=10 numVersionBuckets=65536
   [junit4]   2> 395897 INFO  (qtp16099586-4505) [n:127.0.0.1:36345_ c:collection1 s:shard1  x:collection1_shard1_replica_t21] o.a.s.u.CommitTracker Hard AutoCommit: disabled
   [junit4]   2> 395897 INFO  (qtp16099586-4505) [n:127.0.0.1:36345_ c:collection1 s:shard1  x:collection1_shard1_replica_t21] o.a.s.u.CommitTracker Soft AutoCommit: disabled
   [junit4]   2> 395900 INFO  (qtp16099586-4505) [n:127.0.0.1:36345_ c:collection1 s:shard1  x:collection1_shard1_replica_t21] o.a.s.u.RandomMergePolicy RandomMergePolicy wrapping class org.apache.lucene.index.TieredMergePolicy: [TieredMergePolicy: maxMergeAtOnce=38, maxMergeAtOnceExplicit=29, maxMergedSegmentMB=99.85546875, floorSegmentMB=1.6484375, forceMergeDeletesPctAllowed=22.733248125697617, segmentsPerTier=16.0, maxCFSSegmentSizeMB=8.796093022207999E12, noCFSRatio=1.0, deletesPctAllowed=21.486900891590935
   [junit4]   2> 395900 INFO  (qtp16099586-4505) [n:127.0.0.1:36345_ c:collection1 s:shard1  x:collection1_shard1_replica_t21] o.a.s.s.SolrIndexSearcher Opening [Searcher@cb69888[collection1_shard1_replica_t21] main]
   [junit4]   2> 395901 INFO  (qtp16099586-4505) [n:127.0.0.1:36345_ c:collection1 s:shard1  x:collection1_shard1_replica_t21] o.a.s.r.ManagedResourceStorage Configured ZooKeeperStorageIO with znodeBase: /configs/conf1
   [junit4]   2> 395901 INFO  (qtp16099586-4505) [n:127.0.0.1:36345_ c:collection1 s:shard1  x:collection1_shard1_replica_t21] o.a.s.r.ManagedResourceStorage Loaded null at path _rest_managed.json using ZooKeeperStorageIO:path=/configs/conf1
   [junit4]   2> 395903 INFO  (qtp16099586-4505) [n:127.0.0.1:36345_ c:collection1 s:shard1  x:collection1_shard1_replica_t21] o.a.s.h.ReplicationHandler Commits will be reserved for 10000ms.
   [junit4]   2> 395903 INFO  (qtp16099586-4505) [n:127.0.0.1:36345_ c:collection1 s:shard1  x:collection1_shard1_replica_t21] o.a.s.u.UpdateLog Could not find max version in index or recent updates, using new clock 1620548989319380992
   [junit4]   2> 395905 INFO  (searcherExecutor-1756-thread-1-processing-n:127.0.0.1:36345_ x:collection1_shard1_replica_t21 c:collection1 s:shard1) [n:127.0.0.1:36345_ c:collection1 s:shard1  x:collection1_shard1_replica_t21] o.a.s.c.SolrCore [collection1_shard1_replica_t21] Registered new searcher Searcher@cb69888[collection1_shard1_replica_t21] main{ExitableDirectoryReader(UninvertingDirectoryReader())}
   [junit4]   2> 395908 INFO  (qtp16099586-4505) [n:127.0.0.1:36345_ c:collection1 s:shard1  x:collection1_shard1_replica_t21] o.a.s.c.ZkShardTerms Successful update of terms at /collections/collection1/terms/shard1 to Terms{values={core_node22=0}, version=0}
   [junit4]   2> 395910 INFO  (qtp16099586-4505) [n:127.0.0.1:36345_ c:collection1 s:shard1  x:collection1_shard1_replica_t21] o.a.s.c.ShardLeaderElectionContext Enough replicas found to continue.
   [junit4]   2> 395910 INFO  (qtp16099586-4505) [n:127.0.0.1:36345_ c:collection1 s:shard1  x:collection1_shard1_replica_t21] o.a.s.c.ShardLeaderElectionContext I may be the new leader - try and sync
   [junit4]   2> 395910 INFO  (qtp16099586-4505) [n:127.0.0.1:36345_ c:collection1 s:shard1  x:collection1_shard1_replica_t21] o.a.s.c.SyncStrategy Sync replicas to http://127.0.0.1:36345/collection1_shard1_replica_t21/
   [junit4]   2> 395910 INFO  (qtp16099586-4505) [n:127.0.0.1:36345_ c:collection1 s:shard1  x:collection1_shard1_replica_t21] o.a.s.c.SyncStrategy Sync Success - now sync replicas to me
   [junit4]   2> 395911 INFO  (qtp16099586-4505) [n:127.0.0.1:36345_ c:collection1 s:shard1  x:collection1_shard1_replica_t21] o.a.s.c.SyncStrategy http://127.0.0.1:36345/collection1_shard1_replica_t21/ has no replicas
   [junit4]   2> 395911 INFO  (qtp16099586-4505) [n:127.0.0.1:36345_ c:collection1 s:shard1  x:collection1_shard1_replica_t21] o.a.s.c.ShardLeaderElectionContext Found all replicas participating in election, clear LIR
   [junit4]   2> 395911 INFO  (qtp16099586-4505) [n:127.0.0.1:36345_ c:collection1 s:shard1  x:collection1_shard1_replica_t21] o.a.s.c.ZkController collection1_shard1_replica_t21 stopping background replication from leader
   [junit4]   2> 395913 INFO  (qtp16099586-4505) [n:127.0.0.1:36345_ c:collection1 s:shard1  x:collection1_shard1_replica_t21] o.a.s.c.ShardLeaderElectionContext I am the new leader: http://127.0.0.1:36345/collection1_shard1_replica_t21/ shard1
   [junit4]   2> 396015 INFO  (qtp16099586-4505) [n:127.0.0.1:36345_ c:collection1 s:shard1  x:collection1_shard1_replica_t21] o.a.s.c.ZkController I am the leader, no recovery necessary
   [junit4]   2> 396017 INFO  (qtp16099586-4505) [n:127.0.0.1:36345_ c:collection1 s:shard1  x:collection1_shard1_replica_t21] o.a.s.s.HttpSolrCall [admin] webapp=null path=/admin/cores params={qt=/admin/cores&collection.configName=conf1&name=collection1_shard1_replica_t21&action=CREATE&collection=collection1&shard=shard1&wt=javabin&version=2&replicaType=TLOG} status=0 QTime=1289
   [junit4]   2> 396019 INFO  (qtp1169094312-4487) [n:127.0.0.1:33487_ c:collection1   ] o.a.s.s.HttpSolrCall [admin] webapp=null path=/admin/collections params={node=127.0.0.1:36345_&action=ADDREPLICA&collection=collection1&shard=shard1&type=TLOG&wt=javabin&version=2} status=0 QTime=1300
   [junit4]   2> 396117 INFO  (zkCallback-1366-thread-1) [    ] o.a.s.c.c.ZkStateReader A cluster state change: [WatchedEvent state:SyncConnected type:NodeDataChanged path:/collections/collection1/state.json] for collection [collection1] has occurred - updating... (live nodes size: [2])
   [junit4]   2> 396167 INFO  (TEST-HttpPartitionOnCommitTest.test-seed#[7B4AF667D3501236]) [    ] o.a.s.c.AbstractFullDistribZkTestBase create jetty 2 in directory /home/jenkins/workspace/Lucene-Solr-7.6-Linux/solr/build/solr-core/test/J1/temp/solr.cloud.HttpPartitionOnCommitTest_7B4AF667D3501236-001/shard-2-001 of type TLOG
   [junit4]   2> 396167 INFO  (TEST-HttpPartitionOnCommitTest.test-seed#[7B4AF667D3501236]) [    ] o.e.j.s.Server jetty-9.4.11.v20180605; built: 2018-06-05T18:24:03.829Z; git: d5fc0523cfa96bfebfbda19606cad384d772f04c; jvm 12-ea+23
   [junit4]   2> 396174 INFO  (TEST-HttpPartitionOnCommitTest.test-seed#[7B4AF667D3501236]) [    ] o.e.j.s.session DefaultSessionIdManager workerName=node0
   [junit4]   2> 396174 INFO  (TEST-HttpPartitionOnCommitTest.test-seed#[7B4AF667D3501236]) [    ] o.e.j.s.session No SessionScavenger set, using defaults
   [junit4]   2> 396174 INFO  (TEST-HttpPartitionOnCommitTest.test-seed#[7B4AF667D3501236]) [    ] o.e.j.s.session node0 Scavenging every 600000ms
   [junit4]   2> 396175 INFO  (TEST-HttpPartitionOnCommitTest.test-seed#[7B4AF667D3501236]) [    ] o.e.j.s.h.ContextHandler Started o.e.j.s.ServletContextHandler@5adbfa50{/,null,AVAILABLE}
   [junit4]   2> 396175 INFO  (TEST-HttpPartitionOnCommitTest.test-seed#[7B4AF667D3501236]) [    ] o.e.j.s.AbstractConnector Started ServerConnector@5818c99c{HTTP/1.1,[http/1.1]}{127.0.0.1:42263}
   [junit4]   2> 396175 INFO  (TEST-HttpPartitionOnCommitTest.test-seed#[7B4AF667D3501236]) [    ] o.e.j.s.Server Started @396197ms
   [junit4]   2> 396175 INFO  (TEST-HttpPartitionOnCommitTest.test-seed#[7B4AF667D3501236]) [    ] o.a.s.c.s.e.JettySolrRunner Jetty properties: {hostContext=/, solrconfig=solrconfig.xml, solr.data.dir=/home/jenkins/workspace/Lucene-Solr-7.6-Linux/solr/build/solr-core/test/J1/temp/solr.cloud.HttpPartitionOnCommitTest_7B4AF667D3501236-001/tempDir-001/jetty2, hostPort=41341, coreRootDirectory=/home/jenkins/workspace/Lucene-Solr-7.6-Linux/solr/build/solr-core/test/J1/temp/solr.cloud.HttpPartitionOnCommitTest_7B4AF667D3501236-001/shard-2-001/cores, replicaType=TLOG}
   [junit4]   2> 396176 ERROR (TEST-HttpPartitionOnCommitTest.test-seed#[7B4AF667D3501236]) [    ] o.a.s.u.StartupLoggingUtils Missing Java Option solr.log.dir. Logging may be missing or incomplete.
   [junit4]   2> 396176 INFO  (TEST-HttpPartitionOnCommitTest.test-seed#[7B4AF667D3501236]) [    ] o.a.s.s.SolrDispatchFilter Using logger factory org.apache.logging.slf4j.Log4jLoggerFactory
   [junit4]   2> 396176 INFO  (TEST-HttpPartitionOnCommitTest.test-seed#[7B4AF667D3501236]) [    ] o.a.s.s.SolrDispatchFilter  ___      _       Welcome to Apache Solr™ version 7.6.0
   [junit4]   2> 396176 INFO  (TEST-HttpPartitionOnCommitTest.test-seed#[7B4AF667D3501236]) [    ] o.a.s.s.SolrDispatchFilter / __| ___| |_ _   Starting in cloud mode on port null
   [junit4]   2> 396176 INFO  (TEST-HttpPartitionOnCommitTest.test-seed#[7B4AF667D3501236]) [    ] o.a.s.s.SolrDispatchFilter \__ \/ _ \ | '_|  Install dir: null
   [junit4]   2> 396176 INFO  (TEST-HttpPartitionOnCommitTest.test-seed#[7B4AF667D3501236]) [    ] o.a.s.s.SolrDispatchFilter |___/\___/_|_|    Start time: 2018-12-22T10:52:29.865725Z
   [junit4]   2> 396179 INFO  (zkConnectionManagerCallback-1377-thread-1) [    ] o.a.s.c.c.ConnectionManager zkClient has connected
   [junit4]   2> 396180 INFO  (TEST-HttpPartitionOnCommitTest.test-seed#[7B4AF667D3501236]) [    ] o.a.s.s.SolrDispatchFilter Loading solr.xml from SolrHome (not found in ZooKeeper)
   [junit4]   2> 396180 INFO  (TEST-HttpPartitionOnCommitTest.test-seed#[7B4AF667D3501236]) [    ] o.a.s.c.SolrXmlConfig Loading container configuration from /home/jenkins/workspace/Lucene-Solr-7.6-Linux/solr/build/solr-core/test/J1/temp/solr.cloud.HttpPartitionOnCommitTest_7B4AF667D3501236-001/shard-2-001/solr.xml
   [junit4]   2> 396183 INFO  (TEST-HttpPartitionOnCommitTest.test-seed#[7B4AF667D3501236]) [    ] o.a.s.c.SolrXmlConfig Configuration parameter autoReplicaFailoverWorkLoopDelay is ignored
   [junit4]   2> 396183 INFO  (TEST-HttpPartitionOnCommitTest.test-seed#[7B4AF667D3501236]) [    ] o.a.s.c.SolrXmlConfig Configuration parameter autoReplicaFailoverBadNodeExpiration is ignored
   [junit4]   2> 396184 INFO  (TEST-HttpPartitionOnCommitTest.test-seed#[7B4AF667D3501236]) [    ] o.a.s.c.SolrXmlConfig MBean server found: com.sun.jmx.mbeanserver.JmxMBeanServer@797a720f, but no JMX reporters were configured - adding default JMX reporter.
   [junit4]   2> 396351 INFO  (TEST-HttpPartitionOnCommitTest.test-seed#[7B4AF667D3501236]) [    ] o.a.s.c.ZkContainer Zookeeper client=127.0.0.1:43933/solr
   [junit4]   2> 396364 INFO  (zkConnectionManagerCallback-1381-thread-1) [    ] o.a.s.c.c.ConnectionManager zkClient has connected
   [junit4]   2> 396366 INFO  (zkConnectionManagerCallback-1383-thread-1) [    ] o.a.s.c.c.ConnectionManager zkClient has connected
   [junit4]   2> 396370 INFO  (TEST-HttpPartitionOnCommitTest.test-seed#[7B4AF667D3501236]) [    ] o.a.s.c.c.ZkStateReader Updated live nodes from ZooKeeper... (0) -> (2)
   [junit4]   2> 396372 INFO  (TEST-HttpPartitionOnCommitTest.test-seed#[7B4AF667D3501236]) [    ] o.a.s.c.TransientSolrCoreCacheDefault Allocating transient cache for 4 transient cores
   [junit4]   2> 396372 INFO  (TEST-HttpPartitionOnCommitTest.test-seed#[7B4AF667D3501236]) [    ] o.a.s.c.ZkController Register node as live in ZooKeeper:/live_nodes/127.0.0.1:41341_
   [junit4]   2> 396372 INFO  (zkCallback-1358-thread-1) [    ] o.a.s.c.c.ZkStateReader Updated live nodes from ZooKeeper... (2) -> (3)
   [junit4]   2> 396372 INFO  (zkCallback-1347-thread-1) [    ] o.a.s.c.c.ZkStateReader Updated live nodes from ZooKeeper... (2) -> (3)
   [junit4]   2> 396372 INFO  (zkCallback-1366-thread-1) [    ] o.a.s.c.c.ZkStateReader Updated live nodes from ZooKeeper... (2) -> (3)
   [junit4]   2> 396372 INFO  (zkCallback-1340-thread-2) [    ] o.a.s.c.c.ZkStateReader Updated live nodes from ZooKeeper... (2) -> (3)
   [junit4]   2> 396373 INFO  (zkCallback-1373-thread-1) [    ] o.a.s.c.c.ZkStateReader Updated live nodes from ZooKeeper... (2) -> (3)
   [junit4]   2> 396373 INFO  (zkCallback-1382-thread-1) [    ] o.a.s.c.c.ZkStateReader Updated live nodes from ZooKeeper... (2) -> (3)
   [junit4]   2> 396387 INFO  (zkConnectionManagerCallback-1390-thread-1) [    ] o.a.s.c.c.ConnectionManager zkClient has connected
   [junit4]   2> 396388 INFO  (TEST-HttpPartitionOnCommitTest.test-seed#[7B4AF667D3501236]) [    ] o.a.s.c.c.ZkStateReader Updated live nodes from ZooKeeper... (0) -> (3)
   [junit4]   2> 396388 INFO  (TEST-HttpPartitionOnCommitTest.test-seed#[7B4AF667D3501236]) [    ] o.a.s.c.s.i.ZkClientClusterStateProvider Cluster at 127.0.0.1:43933/solr ready
   [junit4]   2> 396389 INFO  (TEST-HttpPartitionOnCommitTest.test-seed#[7B4AF667D3501236]) [    ] o.a.s.h.a.MetricsHistoryHandler No .system collection, keeping metrics history in memory.
   [junit4]   2> 396413 INFO  (TEST-HttpPartitionOnCommitTest.test-seed#[7B4AF667D3501236]) [    ] o.a.s.m.r.SolrJmxReporter JMX monitoring for 'solr.node' (registry 'solr.node') enabled at server: com.sun.jmx.mbeanserver.JmxMBeanServer@797a720f
   [junit4]   2> 396428 INFO  (TEST-HttpPartitionOnCommitTest.test-seed#[7B4AF667D3501236]) [    ] o.a.s.m.r.SolrJmxReporter JMX monitoring for 'solr.jvm' (registry 'solr.jvm') enabled at server: com.sun.jmx.mbeanserver.JmxMBeanServer@797a720f
   [junit4]   2> 396429 INFO  (TEST-HttpPartitionOnCommitTest.test-seed#[7B4AF667D3501236]) [    ] o.a.s.m.r.SolrJmxReporter JMX monitoring for 'solr.jetty' (registry 'solr.jetty') enabled at server: com.sun.jmx.mbeanserver.JmxMBeanServer@797a720f
   [junit4]   2> 396432 INFO  (TEST-HttpPartitionOnCommitTest.test-seed#[7B4AF667D3501236]) [    ] o.a.s.c.CorePropertiesLocator Found 0 core definitions underneath /home/jenkins/workspace/Lucene-Solr-7.6-Linux/solr/build/solr-core/test/J1/temp/solr.cloud.HttpPartitionOnCommitTest_7B4AF667D3501236-001/shard-2-001/cores
   [junit4]   2> 396479 INFO  (qtp1169094312-4442) [n:127.0.0.1:33487_    ] o.a.s.h.a.CollectionsHandler Invoked Collection Action :addreplica with params node=127.0.0.1:41341_&action=ADDREPLICA&collection=collection1&shard=shard1&type=TLOG&wt=javabin&version=2 and sendToOCPQueue=true
   [junit4]   2> 396481 INFO  (OverseerCollectionConfigSetProcessor-72084675035987972-127.0.0.1:33487_-n_0000000000) [n:127.0.0.1:33487_    ] o.a.s.c.OverseerTaskQueue Response ZK path: /overseer/collection-queue-work/qnr-0000000004 doesn't exist.  Requestor may have disconnected from ZooKeeper
   [junit4]   2> 396482 INFO  (qtp1169094312-4445) [n:127.0.0.1:33487_    ] o.a.s.s.HttpSolrCall [admin] webapp=null path=/admin/metrics params={wt=javabin&version=2&key=solr.core.control_collection.shard1.replica_n1:INDEX.sizeInBytes} status=0 QTime=0
   [junit4]   2> 396483 INFO  (qtp1169094312-4440) [n:127.0.0.1:33487_    ] o.a.s.s.HttpSolrCall [admin] webapp=null path=/admin/metrics params={prefix=CONTAINER.fs.usableSpace,CONTAINER.fs.totalSpace,CORE.coreName&wt=javabin&version=2&group=solr.node,solr.core} status=0 QTime=0
   [junit4]   2> 396484 INFO  (qtp16099586-4504) [n:127.0.0.1:36345_    ] o.a.s.s.HttpSolrCall [admin] webapp=null path=/admin/metrics params={wt=javabin&version=2&key=solr.core.collection1.shard1.replica_t21:INDEX.sizeInBytes} status=0 QTime=0
   [junit4]   2> 396485 INFO  (qtp16099586-4510) [n:127.0.0.1:36345_    ] o.a.s.s.HttpSolrCall [admin] webapp=null path=/admin/metrics params={prefix=CONTAINER.fs.usableSpace,CONTAINER.fs.totalSpace,CORE.coreName&wt=javabin&version=2&group=solr.node,solr.core} status=0 QTime=0
   [junit4]   2> 396486 INFO  (SocketProxy-Acceptor-41341) [    ] o.a.s.c.SocketProxy accepted Socket[addr=/127.0.0.1,port=38794,localport=41341], receiveBufferSize:531000
   [junit4]   2> 396486 INFO  (SocketProxy-Acceptor-41341) [    ] o.a.s.c.SocketProxy proxy connection Socket[addr=/127.0.0.1,port=42263,localport=36540], receiveBufferSize=530904
   [junit4]   2> 396488 INFO  (qtp754779964-4552) [n:127.0.0.1:41341_    ] o.a.s.s.HttpSolrCall [admin] webapp=null path=/admin/metrics params={prefix=CONTAINER.fs.usableSpace,CONTAINER.fs.totalSpace,CORE.coreName&wt=javabin&version=2&group=solr.node,solr.core} status=0 QTime=0
   [junit4]   2> 396489 INFO  (qtp16099586-4508) [n:127.0.0.1:36345_    ] o.a.s.s.HttpSolrCall [admin] webapp=null path=/admin/metrics params={wt=javabin&version=2&key=solr.core.collection1.shard1.replica_t21:INDEX.sizeInBytes} status=0 QTime=0
   [junit4]   2> 396489 INFO  (OverseerThreadFactory-1737-thread-4-processing-n:127.0.0.1:33487_) [n:127.0.0.1:33487_ c:collection1 s:shard1  ] o.a.s.c.a.c.AddReplicaCmd Node Identified 127.0.0.1:41341_ for creating new replica of shard shard1 for collection collection1
   [junit4]   2> 396491 INFO  (SocketProxy-Acceptor-41341) [    ] o.a.s.c.SocketProxy accepted Socket[addr=/127.0.0.1,port=38798,localport=41341], receiveBufferSize:531000
   [junit4]   2> 396492 INFO  (SocketProxy-Acceptor-41341) [    ] o.a.s.c.SocketProxy proxy connection Socket[addr=/127.0.0.1,port=42263,localport=36544], receiveBufferSize=530904
   [junit4]   2> 396492 INFO  (qtp754779964-4547) [n:127.0.0.1:41341_    x:collection1_shard1_replica_t23] o.a.s.h.a.CoreAdminOperation core create command qt=/admin/cores&collection.configName=conf1&name=collection1_shard1_replica_t23&action=CREATE&collection=collection1&shard=shard1&wt=javabin&version=2&replicaType=TLOG
   [junit4]   2> 396595 INFO  (zkCallback-1366-thread-1) [    ] o.a.s.c.c.ZkStateReader A cluster state change: [WatchedEvent state:SyncConnected type:NodeDataChanged path:/collections/collection1/state.json] for collection [collection1] has occurred - updating... (live nodes size: [3])
   [junit4]   2> 397537 INFO  (qtp754779964-4547) [n:127.0.0.1:41341_ c:collection1 s:shard1  x:collection1_shard1_replica_t23] o.a.s.c.SolrConfig Using Lucene MatchVersion: 7.6.0
   [junit4]   2> 397545 INFO  (qtp754779964-4547) [n:127.0.0.1:41341_ c:collection1 s:shard1  x:collection1_shard1_replica_t23] o.a.s.s.IndexSchema [collection1_shard1_replica_t23] Schema name=test
   [junit4]   2> 397608 INFO  (qtp754779964-4547) [n:127.0.0.1:41341_ c:collection1 s:shard1  x:collection1_shard1_replica_t23] o.a.s.s.IndexSchema Loaded schema test/1.0 with uniqueid field id
   [junit4]   2> 397619 INFO  (qtp754779964-4547) [n:127.0.0.1:41341_ c:collection1 s:shard1  x:collection1_shard1_replica_t23] o.a.s.c.CoreContainer Creating SolrCore 'collection1_shard1_replica_t23' using configuration from collection collection1, trusted=true
   [junit4]   2> 397619 INFO  (qtp754779964-4547) [n:127.0.0.1:41341_ c:collection1 s:shard1  x:collection1_shard1_replica_t23] o.a.s.m.r.SolrJmxReporter JMX monitoring for 'solr.core.collection1.shard1.replica_t23' (registry 'solr.core.collection1.shard1.replica_t23') enabled at server: com.sun.jmx.mbeanserver.JmxMBeanServer@797a720f
   [junit4]   2> 397619 INFO  (qtp754779964-4547) [n:127.0.0.1:41341_ c:collection1 s:shard1  x:collection1_shard1_replica_t23] o.a.s.c.SolrCore [[collection1_shard1_replica_t23] ] Opening new SolrCore at [/home/jenkins/workspace/Lucene-Solr-7.6-Linux/solr/build/solr-core/test/J1/temp/solr.cloud.HttpPartitionOnCommitTest_7B4AF667D3501236-001/shard-2-001/cores/collection1_shard1_replica_t23], dataDir=[/home/jenkins/workspace/Lucene-Solr-7.6-Linux/solr/build/solr-core/test/J1/temp/solr.cloud.HttpPartitionOnCommitTest_7B4AF667D3501236-001/shard-2-001/cores/collection1_shard1_replica_t23/data/]
   [junit4]   2> 397622 INFO  (qtp754779964-4547) [n:127.0.0.1:41341_ c:collection1 s:shard1  x:collection1_shard1_replica_t23] o.a.s.u.RandomMergePolicy RandomMergePolicy wrapping class org.apache.lucene.index.TieredMergePolicy: [TieredMergePolicy: maxMergeAtOnce=24, maxMergeAtOnceExplicit=49, maxMergedSegmentMB=39.4287109375, floorSegmentMB=1.84765625, forceMergeDeletesPctAllowed=7.178787127834627, segmentsPerTier=49.0, maxCFSSegmentSizeMB=8.796093022207999E12, noCFSRatio=1.0, deletesPctAllowed=26.67481753640823
   [junit4]   2> 397623 WARN  (qtp754779964-4547) [n:127.0.0.1:41341_ c:collection1 s:shard1  x:collection1_shard1_replica_t23] o.a.s.c.RequestHandlers INVALID paramSet a in requestHandler {type = requestHandler,name = /dump,class = DumpRequestHandler,attributes = {initParams=a, name=/dump, class=DumpRequestHandler},args = {defaults={a=A,b=B}}}
   [junit4]   2> 397694 INFO  (qtp754779964-4547) [n:127.0.0.1:41341_ c:collection1 s:shard1  x:collection1_shard1_replica_t23] o.a.s.u.UpdateHandler Using UpdateLog implementation: org.apache.solr.update.UpdateLog
   [junit4]   2> 397694 INFO  (qtp754779964-4547) [n:127.0.0.1:41341_ c:collection1 s:shard1  x:collection1_shard1_replica_t23] o.a.s.u.UpdateLog Initializing UpdateLog: dataDir= defaultSyncLevel=FLUSH numRecordsToKeep=100 maxNumLogsToKeep=10 numVersionBuckets=65536
   [junit4]   2> 397695 INFO  (qtp754779964-4547) [n:127.0.0.1:41341_ c:collection1 s:shard1  x:collection1_shard1_replica_t23] o.a.s.u.CommitTracker Hard AutoCommit: disabled
   [junit4]   2> 397696 INFO  (qtp754779964-4547) [n:127.0.0.1:41341_ c:collection1 s:shard1  x:collection1_shard1_replica_t23] o.a.s.u.CommitTracker Soft AutoCommit: disabled
   [junit4]   2> 397697 INFO  (qtp754779964-4547) [n:127.0.0.1:41341_ c:collection1 s:shard1  x:collection1_shard1_replica_t23] o.a.s.u.RandomMergePolicy RandomMergePolicy wrapping class org.apache.lucene.index.TieredMergePolicy: [TieredMergePolicy: maxMergeAtOnce=38, maxMergeAtOnceExplicit=29, maxMergedSegmentMB=99.85546875, floorSegmentMB=1.6484375, forceMergeDeletesPctAllowed=22.733248125697617, segmentsPerTier=16.0, maxCFSSegmentSizeMB=8.796093022207999E12, noCFSRatio=1.0, deletesPctAllowed=21.486900891590935
   [junit4]   2> 397698 INFO  (qtp754779964-4547) [n:127.0.0.1:41341_ c:collection1 s:shard1  x:collection1_shard1_replica_t23] o.a.s.s.SolrIndexSearcher Opening [Searcher@5fa93e78[collection1_shard1_replica_t23] main]
   [junit4]   2> 397698 INFO  (qtp754779964-4547) [n:127.0.0.1:41341_ c:collection1 s:shard1  x:collection1_shard1_replica_t23] o.a.s.r.ManagedResourceStorage Configured ZooKeeperStorageIO with znodeBase: /configs/conf1
   [junit4]   2> 397698 INFO  (qtp754779964-4547) [n:127.0.0.1:41341_ c:collection1 s:shard1  x:collection1_shard1_replica_t23] o.a.s.r.ManagedResourceStorage Loaded null at path _rest_managed.json using ZooKeeperStorageIO:path=/configs/conf1
   [junit4]   2> 397700 INFO  (qtp754779964-4547) [n:127.0.0.1:41341_ c:collection1 s:shard1  x:collection1_shard1_replica_t23] o.a.s.h.ReplicationHandler Commits will be reserved for 10000ms.
   [junit4]   2> 397700 INFO  (qtp754779964-4547) [n:127.0.0.1:41341_ c:collection1 s:shard1  x:collection1_shard1_replica_t23] o.a.s.u.UpdateLog Could not find max version in index or recent updates, using new clock 1620548991203672064
   [junit4]   2> 397703 INFO  (searcherExecutor-1770-thread-1-processing-n:127.0.0.1:41341_ x:collection1_shard1_replica_t23 c:collection1 s:shard1) [n:127.0.0.1:41341_ c:collection1 s:shard1  x:collection1_shard1_replica_t23] o.a.s.c.SolrCore [collection1_shard1_replica_t23] Registered new searcher Searcher@5fa93e78[collection1_shard1_replica_t23] main{ExitableDirectoryReader(UninvertingDirectoryReader())}
   [junit4]   2> 397705 INFO  (qtp754779964-4547) [n:127.0.0.1:41341_ c:collection1 s:shard1  x:collection1_shard1_replica_t23] o.a.s.c.ZkShardTerms Successful update of terms at /collections/collection1/terms/shard1 to Terms{values={core_node24=0, core_node22=0}, version=1}
   [junit4]   2> 397707 INFO  (qtp754779964-4547) [n:127.0.0.1:41341_ c:collection1 s:shard1  x:collection1_shard1_replica_t23] o.a.s.c.ZkController Core needs to recover:collection1_shard1_replica_t23
   [junit4]   2> 397707 INFO  (updateExecutor-1378-thread-1-processing-n:127.0.0.1:41341_ x:collection1_shard1_replica_t23 c:collection1 s:shard1) [n:127.0.0.1:41341_ c:collection1 s:shard1 r:core_node24 x:collection1_shard1_replica_t23] o.a.s.u.DefaultSolrCoreState Running recovery
   [junit4]   2> 397708 INFO  (recoveryExecutor-1379-thread-1-processing-n:127.0.0.1:41341_ x:collection1_shard1_replica_t23 c:collection1 s:shard1 r:core_node24) [n:127.0.0.1:41341_ c:collection1 s:shard1 r:core_node24 x:collection1_shard1_replica_t23] o.a.s.c.RecoveryStrategy Starting recovery process. recoveringAfterStartup=true
   [junit4]   2> 397708 INFO  (recoveryExecutor-1379-thread-1-processing-n:127.0.0.1:41341_ x:collection1_shard1_replica_t23 c:collection1 s:shard1 r:core_node24) [n:127.0.0.1:41341_ c:collection1 s:shard1 r:core_node24 x:collection1_shard1_replica_t23] o.a.s.c.RecoveryStrategy startupVersions is empty
   [junit4]   2> 397708 INFO  (recoveryExecutor-1379-thread-1-processing-n:127.0.0.1:41341_ x:collection1_shard1_replica_t23 c:collection1 s:shard1 r:core_node24) [n:127.0.0.1:41341_ c:collection1 s:shard1 r:core_node24 x:collection1_shard1_replica_t23] o.a.s.c.ZkController collection1_shard1_replica_t23 stopping background replication from leader
   [junit4]   2> 397709 INFO  (qtp754779964-4547) [n:127.0.0.1:41341_ c:collection1 s:shard1  x:collection1_shard1_replica_t23] o.a.s.s.HttpSolrCall [admin] webapp=null path=/admin/cores params={qt=/admin/cores&collection.configName=conf1&name=collection1_shard1_replica_t23&action=CREATE&collection=collection1&shard=shard1&wt=javabin&version=2&replicaType=TLOG} status=0 QTime=1216
   [junit4]   2> 397710 INFO  (SocketProxy-Acceptor-36345) [    ] o.a.s.c.SocketProxy accepted Socket[addr=/127.0.0.1,port=36848,localport=36345], receiveBufferSize:531000
   [junit4]   2> 397716 INFO  (SocketProxy-Acceptor-36345) [    ] o.a.s.c.SocketProxy proxy connection Socket[addr=/127.0.0.1,port=37493,localport=39424], receiveBufferSize=530904
   [junit4]   2> 397719 INFO  (qtp16099586-4506) [n:127.0.0.1:36345_ c:collection1 s:shard1 r:core_node22 x:collection1_shard1_replica_t21] o.a.s.c.S.Request [collection1_shard1_replica_t21]  webapp= path=/admin/ping params={wt=javabin&version=2} hits=0 status=0 QTime=0
   [junit4]   2> 397719 INFO  (qtp16099586-4506) [n:127.0.0.1:36345_ c:collection1 s:shard1 r:core_node22 x:collection1_shard1_replica_t21] o.a.s.c.S.Request [collection1_shard1_replica_t21]  webapp= path=/admin/ping params={wt=javabin&version=2} status=0 QTime=0
   [junit4]   2> 397719 INFO  (recoveryExecutor-1379-thread-1-processing-n:127.0.0.1:41341_ x:collection1_shard1_replica_t23 c:collection1 s:shard1 r:core_node24) [n:127.0.0.1:41341_ c:collection1 s:shard1 r:core_node24 x:collection1_shard1_replica_t23] o.a.s.c.RecoveryStrategy Begin buffering updates. core=[collection1_shard1_replica_t23]
   [junit4]   2> 397719 INFO  (OverseerCollectionConfigSetProcessor-72084675035987972-127.0.0.1:33487_-n_0000000000) [n:127.0.0.1:33487_    ] o.a.s.c.OverseerTaskQueue Response ZK path: /overseer/collection-queue-work/qnr-0000000006 doesn't exist.  Requestor may have disconnected from ZooKeeper
   [junit4]   2> 397719 INFO  (qtp1169094312-4442) [n:127.0.0.1:33487_ c:collection1   ] o.a.s.s.HttpSolrCall [admin] webapp=null path=/admin/collections params={node=127.0.0.1:41341_&action=ADDREPLICA&collection=collection1&shard=shard1&type=TLOG&wt=javabin&version=2} status=0 QTime=1240
   [junit4]   2> 397720 INFO  (recoveryExecutor-1379-thread-1-processing-n:127.0.0.1:41341_ x:collection1_shard1_replica_t23 c:collection1 s:shard1 r:core_node24) [n:127.0.0.1:41341_ c:collection1 s:shard1 r:core_node24 x:collection1_shard1_replica_t23] o.a.s.u.UpdateLog Starting to buffer updates. FSUpdateLog{state=ACTIVE, tlog=null}
   [junit4]   2> 397720 INFO  (recoveryExecutor-1379-thread-1-processing-n:127.0.0.1:41341_ x:collection1_shard1_replica_t23 c:collection1 s:shard1 r:core_node24) [n:127.0.0.1:41341_ c:collection1 s:shard1 r:core_node24 x:collection1_shard1_replica_t23] o.a.s.c.RecoveryStrategy Publishing state of core [collection1_shard1_replica_t23] as recovering, leader is [http://127.0.0.1:36345/collection1_shard1_replica_t21/] and I am [http://127.0.0.1:41341/collection1_shard1_replica_t23/]
   [junit4]   2> 397721 INFO  (recoveryExecutor-1379-thread-1-processing-n:127.0.0.1:41341_ x:collection1_shard1_replica_t23 c:collection1 s:shard1 r:core_node24) [n:127.0.0.1:41341_ c:collection1 s:shard1 r:core_node24 x:collection1_shard1_replica_t23] o.a.s.c.ZkShardTerms Successful update of terms at /collections/collection1/terms/shard1 to Terms{values={core_node24_recovering=0, core_node24=0, core_node22=0}, version=2}
   [junit4]   2> 397723 INFO  (recoveryExecutor-1379-thread-1-processing-n:127.0.0.1:41341_ x:collection1_shard1_replica_t23 c:collection1 s:shard1 r:core_node24) [n:127.0.0.1:41341_ c:collection1 s:shard1 r:core_node24 x:collection1_shard1_replica_t23] o.a.s.c.RecoveryStrategy Sending prep recovery command to [http://127.0.0.1:36345]; [WaitForState: action=PREPRECOVERY&core=collection1_shard1_replica_t21&nodeName=127.0.0.1:41341_&coreNodeName=core_node24&state=recovering&checkLive=true&onlyIfLeader=true&onlyIfLeaderActive=true]
   [junit4]   2> 397724 INFO  (SocketProxy-Acceptor-36345) [    ] o.a.s.c.SocketProxy accepted Socket[addr=/127.0.0.1,port=36852,localport=36345], receiveBufferSize:531000
   [junit4]   2> 397734 INFO  (SocketProxy-Acceptor-36345) [    ] o.a.s.c.SocketProxy proxy connection Socket[addr=/127.0.0.1,port=37493,localport=39428], receiveBufferSize=530904
   [junit4]   2> 397736 INFO  (qtp16099586-4503) [n:127.0.0.1:36345_    x:collection1_shard1_replica_t21] o.a.s.h.a.PrepRecoveryOp Going to wait for coreNodeName: core_node24, state: recovering, checkLive: true, onlyIfLeader: true, onlyIfLeaderActive: true, maxTime: 183 s
   [junit4]   2> 397736 INFO  (qtp16099586-4503) [n:127.0.0.1:36345_    x:collection1_shard1_replica_t21] o.a.s.h.a.PrepRecoveryOp In WaitForState(recovering): collection=collection1, shard=shard1, thisCore=collection1_shard1_replica_t21, leaderDoesNotNeedRecovery=false, isLeader? true, live=true, checkLive=true, currentState=down, localState=active, nodeName=127.0.0.1:41341_, coreNodeName=core_node24, onlyIfActiveCheckResult=false, nodeProps: core_node24:{"core":"collection1_shard1_replica_t23","base_url":"http://127.0.0.1:41341","node_name":"127.0.0.1:41341_","state":"down","type":"TLOG"}
   [junit4]   2> 397823 INFO  (zkCallback-1366-thread-1) [    ] o.a.s.c.c.ZkStateReader A cluster state change: [WatchedEvent state:SyncConnected type:NodeDataChanged path:/collections/collection1/state.json] for collection [collection1] has occurred - updating... (live nodes size: [3])
   [junit4]   2> 397823 INFO  (zkCallback-1382-thread-1) [    ] o.a.s.c.c.ZkStateReader A cluster state change: [WatchedEvent state:SyncConnected type:NodeDataChanged path:/collections/collection1/state.json] for collection [collection1] has occurred - updating... (live nodes size: [3])
   [junit4]   2> 397824 INFO  (zkCallback-1382-thread-2) [    ] o.a.s.c.c.ZkStateReader A cluster state change: [WatchedEvent state:SyncConnected type:NodeDataChanged path:/collections/collection1/state.json] for collection [collection1] has occurred - updating... (live nodes size: [3])
   [junit4]   2> 397858 INFO  (TEST-HttpPartitionOnCommitTest.test-seed#[7B4AF667D3501236]) [    ] o.a.s.c.AbstractFullDistribZkTestBase create jetty 3 in directory /home/jenkins/workspace/Lucene-Solr-7.6-Linux/solr/build/solr-core/test/J1/temp/solr.cloud.HttpPartitionOnCommitTest_7B4AF667D3501236-001/shard-3-001 of type TLOG
   [junit4]   2> 397859 INFO  (TEST-HttpPartitionOnCommitTest.test-seed#[7B4AF667D3501236]) [    ] o.e.j.s.Server jetty-9.4.11.v20180605; built: 2018-06-05T18:24:03.829Z; git: d5fc0523cfa96bfebfbda19606cad384d772f04c; jvm 12-ea+23
   [junit4]   2> 397860 INFO  (TEST-HttpPartitionOnCommitTest.test-seed#[7B4AF667D3501236]) [    ] o.e.j.s.session DefaultSessionIdManager workerName=node0
   [junit4]   2> 397860 INFO  (TEST-HttpPartitionOnCommitTest.test-seed#[7B4AF667D3501236]) [    ] o.e.j.s.session No SessionScavenger set, using defaults
   [junit4]   2> 397860 INFO  (TEST-HttpPartitionOnCommitTest.test-seed#[7B4AF667D3501236]) [    ] o.e.j.s.session node0 Scavenging every 600000ms
   [junit4]   2> 397860 INFO  (TEST-HttpPartitionOnCommitTest.test-seed#[7B4AF667D3501236]) [    ] o.e.j.s.h.ContextHandler Started o.e.j.s.ServletContextHandler@64d40b5e{/,null,AVAILABLE}
   [junit4]   2> 397861 INFO  (TEST-HttpPartitionOnCommitTest.test-seed#[7B4AF667D3501236]) [    ] o.e.j.s.AbstractConnector Started ServerConnector@399656df{HTTP/1.1,[http/1.1]}{127.0.0.1:44437}
   [junit4]   2> 397861 INFO  (TEST-HttpPartitionOnCommitTest.test-seed#[7B4AF667D3501236]) [    ] o.e.j.s.Server Started @397882ms
   [junit4]   2> 397861 INFO  (TEST-HttpPartitionOnCommitTest.test-seed#[7B4AF667D3501236]) [    ] o.a.s.c.s.e.JettySolrRunner Jetty properties: {hostContext=/, solrconfig=solrconfig.xml, solr.data.dir=/home/jenkins/workspace/Lucene-Solr-7.6-Linux/solr/build/solr-core/test/J1/temp/solr.cloud.HttpPartitionOnCommitTest_7B4AF667D3501236-001/tempDir-001/jetty3, hostPort=40933, coreRootDirectory=/home/jenkins/workspace/Lucene-Solr-7.6-Linux/solr/build/solr-core/test/J1/temp/solr.cloud.HttpPartitionOnCommitTest_7B4AF667D3501236-001/shard-3-001/cores, replicaType=TLOG}
   [junit4]   2> 397861 ERROR (TEST-HttpPartitionOnCommitTest.test-seed#[7B4AF667D3501236]) [    ] o.a.s.u.StartupLoggingUtils Missing Java Option solr.log.dir. Logging may be missing or incomplete.
   [junit4]   2> 397861 INFO  (TEST-HttpPartitionOnCommitTest.test-seed#[7B4AF667D3501236]) [    ] o.a.s.s.SolrDispatchFilter Using logger factory org.apache.logging.slf4j.Log4jLoggerFactory
   [junit4]   2> 397861 INFO  (TEST-HttpPartitionOnCommitTest.test-seed#[7B4AF667D3501236]) [    ] o.a.s.s.SolrDispatchFilter  ___      _       Welcome to Apache Solr™ version 7.6.0
   [junit4]   2> 397861 INFO  (TEST-HttpPartitionOnCommitTest.test-seed#[7B4AF667D3501236]) [    ] o.a.s.s.SolrDispatchFilter / __| ___| |_ _   Starting in cloud mode on port null
   [junit4]   2> 397861 INFO  (TEST-HttpPartitionOnCommitTest.test-seed#[7B4AF667D3501236]) [    ] o.a.s.s.SolrDispatchFilter \__ \/ _ \ | '_|  Install dir: null
   [junit4]   2> 397862 INFO  (TEST-HttpPartitionOnCommitTest.test-seed#[7B4AF667D3501236]) [    ] o.a.s.s.SolrDispatchFilter |___/\___/_|_|    Start time: 2018-12-22T10:52:31.550985Z
   [junit4]   2> 397865 INFO  (zkConnectionManagerCallback-1394-thread-1) [    ] o.a.s.c.c.ConnectionManager zkClient has connected
   [junit4]   2> 397866 INFO  (TEST-HttpPartitionOnCommitTest.test-seed#[7B4AF667D3501236]) [    ] o.a.s.s.SolrDispatchFilter Loading solr.xml from SolrHome (not found in ZooKeeper)
   [junit4]   2> 397866 INFO  (TEST-HttpPartitionOnCommitTest.test-seed#[7B4AF667D3501236]) [    ] o.a.s.c.SolrXmlConfig Loading container configuration from /home/jenkins/workspace/Lucene-Solr-7.6-Linux/solr/build/solr-core/test/J1/temp/solr.cloud.HttpPartitionOnCommitTest_7B4AF667D3501236-001/shard-3-001/solr.xml
   [junit4]   2> 397868 INFO  (TEST-HttpPartitionOnCommitTest.test-seed#[7B4AF667D3501236]) [    ] o.a.s.c.SolrXmlConfig Configuration parameter autoReplicaFailoverWorkLoopDelay is ignored
   [junit4]   2> 397868 INFO  (TEST-HttpPartitionOnCommitTest.test-seed#[7B4AF667D3501236]) [    ] o.a.s.c.SolrXmlConfig Configuration parameter autoReplicaFailoverBadNodeExpiration is ignored
   [junit4]   2> 397869 INFO  (TEST-HttpPartitionOnCommitTest.test-seed#[7B4AF667D3501236]) [    ] o.a.s.c.SolrXmlConfig MBean server found: com.sun.jmx.mbeanserver.JmxMBeanServer@797a720f, but no JMX reporters were configured - adding default JMX reporter.
   [junit4]   2> 397901 INFO  (TEST-HttpPartitionOnCommitTest.test-seed#[7B4AF667D3501236]) [    ] o.a.s.c.ZkContainer Zookeeper client=127.0.0.1:43933/solr
   [junit4]   2> 397902 INFO  (zkConnectionManagerCallback-1398-thread-1) [    ] o.a.s.c.c.ConnectionManager zkClient has connected
   [junit4]   2> 397904 INFO  (zkConnectionManagerCallback-1400-thread-1) [    ] o.a.s.c.c.ConnectionManager zkClient has connected
   [junit4]   2> 397908 INFO  (TEST-HttpPartitionOnCommitTest.test-seed#[7B4AF667D3501236]) [    ] o.a.s.c.c.ZkStateReader Updated live nodes from ZooKeeper... (0) -> (3)
   [junit4]   2> 397909 INFO  (TEST-HttpPartitionOnCommitTest.test-seed#[7B4AF667D3501236]) [    ] o.a.s.c.TransientSolrCoreCacheDefault Allocating transient cache for 4 transient cores
   [junit4]   2> 397910 INFO  (TEST-HttpPartitionOnCommitTest.test-seed#[7B4AF667D3501236]) [    ] o.a.s.c.ZkController Register node as live in ZooKeeper:/live_nodes/127.0.0.1:40933_
   [junit4]   2> 397910 INFO  (zkCallback-1382-thread-2) [    ] o.a.s.c.c.ZkStateReader Updated live nodes from ZooKeeper... (3) -> (4)
   [junit4]   2> 397910 INFO  (zkCallback-1366-thread-1) [    ] o.a.s.c.c.ZkStateReader Updated live nodes from ZooKeeper... (3) -> (4)
   [junit4]   2> 397910 INFO  (zkCallback-1373-thread-1) [    ] o.a.s.c.c.ZkStateReader Updated live nodes from ZooKeeper... (3) -> (4)
   [junit4]   2> 397910 INFO  (zkCallback-1340-thread-2) [    ] o.a.s.c.c.ZkStateReader Updated live nodes from ZooKeeper... (3) -> (4)
   [junit4]   2> 397910 INFO  (zkCallback-1358-thread-1) [    ] o.a.s.c.c.ZkStateReader Updated live nodes from ZooKeeper... (3) -> (4)
   [junit4]   2> 397910 INFO  (zkCallback-1347-thread-1) [    ] o.a.s.c.c.ZkStateReader Updated live nodes from ZooKeeper... (3) -> (4)
   [junit4]   2> 397911 INFO  (zkCallback-1389-thread-1) [    ] o.a.s.c.c.ZkStateReader Updated live nodes from ZooKeeper... (3) -> (4)
   [junit4]   2> 397911 INFO  (zkCallback-1399-thread-1) [    ] o.a.s.c.c.ZkStateReader Updated live nodes from ZooKeeper... (3) -> (4)
   [junit4]   2> 397925 INFO  (zkConnectionManagerCallback-1407-thread-1) [    ] o.a.s.c.c.ConnectionManager zkClient has connected
   [junit4]   2> 397926 INFO  (TEST-HttpPartitionOnCommitTest.test-seed#[7B4AF667D3501236]) [    ] o.a.s.c.c.ZkStateReader Updated live nodes from ZooKeeper... (0) -> (4)
   [junit4]   2> 397927 INFO  (TEST-HttpPartitionOnCommitTest.test-seed#[7B4AF667D3501236]) [    ] o.a.s.c.s.i.ZkClientClusterStateProvider Cluster at 127.0.0.1:43933/solr ready
   [junit4]   2> 397927 INFO  (TEST-HttpPartitionOnCommitTest.test-seed#[7B4AF667D3501236]) [    ] o.a.s.h.a.MetricsHistoryHandler No .system collection, keeping metrics history in memory.
   [junit4]   2> 397959 INFO  (TEST-HttpPartitionOnCommitTest.test-seed#[7B4AF667D3501236]) [    ] o.a.s.m.r.SolrJmxReporter JMX monitoring for 'solr.node' (registry 'solr.node') enabled at server: com.sun.jmx.mbeanserver.JmxMBeanServer@797a720f
   [junit4]   2> 397974 INFO  (TEST-HttpPartitionOnCommitTest.test-seed#[7B4AF667D3501236]) [    ] o.a.s.m.r.SolrJmxReporter JMX monitoring for 'solr.jvm' (registry 'solr.jvm') enabled at server: com.sun.jmx.mbeanserver.JmxMBeanServer@797a720f
   [junit4]   2> 397974 INFO  (TEST-HttpPartitionOnCommitTest.test-seed#[7B4AF667D3501236]) [    ] o.a.s.m.r.SolrJmxReporter JMX monitoring for 'solr.jetty' (registry 'solr.jetty') enabled at server: com.sun.jmx.mbeanserver.JmxMBeanServer@797a720f
   [junit4]   2> 397977 INFO  (TEST-HttpPartitionOnCommitTest.test-seed#[7B4AF667D3501236]) [    ] o.a.s.c.CorePropertiesLocator Found 0 core definitions underneath /home/jenkins/workspace/Lucene-Solr-7.6-Linux/solr/build/solr-core/test/J1/temp/solr.cloud.HttpPartitionOnCommitTest_7B4AF667D3501236-001/shard-3-001/cores
   [junit4]   2> 398036 INFO  (qtp1169094312-4487) [n:127.0.0.1:33487_    ] o.a.s.h.a.CollectionsHandler Invoked Collection Action :addreplica with params node=127.0.0.1:40933_&action=ADDREPLICA&collection=collection1&shard=shard1&type=TLOG&wt=javabin&version=2 and sendToOCPQueue=true
   [junit4]   2> 398040 INFO  (qtp1169094312-4445) [n:127.0.0.1:33487_    ] o.a.s.s.HttpSolrCall [admin] webapp=null path=/admin/metrics params={wt=javabin&version=2&key=solr.core.control_collection.shard1.replica_n1:INDEX.sizeInBytes} status=0 QTime=0
   [junit4]   2> 398042 INFO  (qtp1169094312-4440) [n:127.0.0.1:33487_    ] o.a.s.s.HttpSolrCall [admin] webapp=null path=/admin/metrics params={prefix=CONTAINER.fs.usableSpace,CONTAINER.fs.totalSpace,CORE.coreName&wt=javabin&version=2&group=solr.node,solr.core} status=0 QTime=1
   [junit4]   2> 398043 INFO  (qtp16099586-4510) [n:127.0.0.1:36345_    ] o.a.s.s.HttpSolrCall [admin] webapp=null path=/admin/metrics params={wt=javabin&version=2&key=solr.core.collection1.shard1.replica_t21:INDEX.sizeInBytes} status=0 QTime=0
   [junit4]   2> 398044 INFO  (qtp16099586-4510) [n:127.0.0.1:36345_    ] o.a.s.s.HttpSolrCall [admin] webapp=null path=/admin/metrics params={prefix=CONTAINER.fs.usableSpace,CONTAINER.fs.totalSpace,CORE.coreName&wt=javabin&version=2&group=solr.node,solr.core} status=0 QTime=1
   [junit4]   2> 398045 INFO  (SocketProxy-Acceptor-40933) [    ] o.a.s.c.SocketProxy accepted Socket[addr=/127.0.0.1,port=60680,localport=40933], receiveBufferSize:531000
   [junit4]   2> 398047 INFO  (SocketProxy-Acceptor-40933) [    ] o.a.s.c.SocketProxy proxy connection Socket[addr=/127.0.0.1,port=44437,localport=38970], receiveBufferSize=530904
   [junit4]   2> 398048 INFO  (qtp2054613156-4605) [n:127.0.0.1:40933_    ] o.a.s.s.HttpSolrCall [admin] webapp=null path=/admin/metrics params={prefix=CONTAINER.fs.usableSpace,CONTAINER.fs.totalSpace,CORE.coreName&wt=javabin&version=2&group=solr.node,solr.core} status=0 QTime=0
   [junit4]   2> 398049 INFO  (qtp754779964-4546) [n:127.0.0.1:41341_    ] o.a.s.s.HttpSolrCall [admin] webapp=null path=/admin/metrics params={wt=javabin&version=2&key=solr.core.collection1.shard1.replica_t23:INDEX.sizeInBytes} status=0 QTime=0
   [junit4]   2> 398051 INFO  (qtp754779964-4552) [n:127.0.0.1:41341_    ] o.a.s.s.HttpSolrCall [admin] webapp=null path=/admin/metrics params={prefix=CONTAINER.fs.usableSpace,CONTAINER.fs.totalSpace,CORE.coreName&wt=javabin&version=2&group=solr.node,solr.core} status=0 QTime=0
   [junit4]   2> 398052 INFO  (qtp16099586-4504) [n:127.0.0.1:36345_    ] o.a.s.s.HttpSolrCall [admin] webapp=null path=/admin/metrics params={wt=javabin&version=2&key=solr.core.collection1.shard1.replica_t21:INDEX.sizeInBytes} status=0 QTime=0
   [junit4]   2> 398052 INFO  (OverseerThreadFactory-1737-thread-5-processing-n:127.0.0.1:33487_) [n:127.0.0.1:33487_ c:collection1 s:shard1  ] o.a.s.c.a.c.AddReplicaCmd Node Identified 127.0.0.1:40933_ for creating new replica of shard shard1 for collection collection1
   [junit4]   2> 398053 INFO  (SocketProxy-Acceptor-40933) [    ] o.a.s.c.SocketProxy 

[...truncated too long message...]

s/collection1/state.json
   [junit4]   2> 	12	/solr/clusterprops.json
   [junit4]   2> 	12	/solr/clusterstate.json
   [junit4]   2> 	5	/solr/autoscaling.json
   [junit4]   2> 	3	/solr/collections/c8n_1x3_commits/state.json
   [junit4]   2> 
   [junit4]   2> Maximum concurrent children watches above limit:
   [junit4]   2> 
   [junit4]   2> 	12	/solr/live_nodes
   [junit4]   2> 	12	/solr/collections
   [junit4]   2> 	5	/solr/overseer/queue
   [junit4]   2> 	5	/solr/autoscaling/events/.scheduled_maintenance
   [junit4]   2> 	5	/solr/autoscaling/events/.auto_add_replicas
   [junit4]   2> 	5	/solr/overseer/collection-queue-work
   [junit4]   2> 	5	/solr/overseer/queue-work
   [junit4]   2> 
   [junit4]   2> 1015293 WARN  (TEST-HttpPartitionOnCommitTest.test-seed#[7B4AF667D3501236]) [    ] o.a.s.c.SocketProxy Closing 6 connections to: http://127.0.0.1:33487/, target: http://127.0.0.1:40785/
   [junit4]   2> 1015293 WARN  (TEST-HttpPartitionOnCommitTest.test-seed#[7B4AF667D3501236]) [    ] o.a.s.c.SocketProxy Closing 7 connections to: http://127.0.0.1:41341/, target: http://127.0.0.1:42263/
   [junit4]   2> 1015293 WARN  (TEST-HttpPartitionOnCommitTest.test-seed#[7B4AF667D3501236]) [    ] o.a.s.c.SocketProxy Closing 5 connections to: http://127.0.0.1:45175/, target: http://127.0.0.1:37807/
   [junit4]   2> 1015293 WARN  (TEST-HttpPartitionOnCommitTest.test-seed#[7B4AF667D3501236]) [    ] o.a.s.c.SocketProxy Closing 6 connections to: http://127.0.0.1:40933/, target: http://127.0.0.1:44437/
   [junit4]   2> 1015293 WARN  (TEST-HttpPartitionOnCommitTest.test-seed#[7B4AF667D3501236]) [    ] o.a.s.c.SocketProxy Closing 13 connections to: http://127.0.0.1:36345/, target: http://127.0.0.1:37493/
   [junit4]   2> NOTE: reproduce with: ant test  -Dtestcase=HttpPartitionOnCommitTest -Dtests.method=test -Dtests.seed=7B4AF667D3501236 -Dtests.multiplier=3 -Dtests.slow=true -Dtests.locale=lg -Dtests.timezone=Universal -Dtests.asserts=true -Dtests.file.encoding=UTF-8
   [junit4] ERROR    624s J1 | HttpPartitionOnCommitTest.test <<<
   [junit4]    > Throwable #1: org.apache.solr.client.solrj.SolrServerException: Timeout occured while waiting response from server at: http://127.0.0.1:36345
   [junit4]    > 	at __randomizedtesting.SeedInfo.seed([7B4AF667D3501236:F31EC9BD7DAC7FCE]:0)
   [junit4]    > 	at org.apache.solr.client.solrj.impl.HttpSolrClient.executeMethod(HttpSolrClient.java:654)
   [junit4]    > 	at org.apache.solr.client.solrj.impl.HttpSolrClient.request(HttpSolrClient.java:255)
   [junit4]    > 	at org.apache.solr.client.solrj.impl.HttpSolrClient.request(HttpSolrClient.java:244)
   [junit4]    > 	at org.apache.solr.client.solrj.SolrClient.request(SolrClient.java:1260)
   [junit4]    > 	at org.apache.solr.cloud.BasicDistributedZkTest.createCollection(BasicDistributedZkTest.java:646)
   [junit4]    > 	at org.apache.solr.cloud.AbstractFullDistribZkTestBase.createCollection(AbstractFullDistribZkTestBase.java:1611)
   [junit4]    > 	at org.apache.solr.cloud.HttpPartitionOnCommitTest.multiShardTest(HttpPartitionOnCommitTest.java:65)
   [junit4]    > 	at org.apache.solr.cloud.HttpPartitionOnCommitTest.test(HttpPartitionOnCommitTest.java:56)
   [junit4]    > 	at java.base/jdk.internal.reflect.NativeMethodAccessorImpl.invoke0(Native Method)
   [junit4]    > 	at java.base/jdk.internal.reflect.NativeMethodAccessorImpl.invoke(NativeMethodAccessorImpl.java:62)
   [junit4]    > 	at java.base/jdk.internal.reflect.DelegatingMethodAccessorImpl.invoke(DelegatingMethodAccessorImpl.java:43)
   [junit4]    > 	at java.base/java.lang.reflect.Method.invoke(Method.java:567)
   [junit4]    > 	at org.apache.solr.BaseDistributedSearchTestCase$ShardsRepeatRule$ShardsFixedStatement.callStatement(BaseDistributedSearchTestCase.java:1010)
   [junit4]    > 	at org.apache.solr.BaseDistributedSearchTestCase$ShardsRepeatRule$ShardsStatement.evaluate(BaseDistributedSearchTestCase.java:985)
   [junit4]    > 	at java.base/java.lang.Thread.run(Thread.java:835)
   [junit4]    > Caused by: java.net.SocketTimeoutException: Read timed out
   [junit4]    > 	at java.base/java.net.SocketInputStream.socketRead0(Native Method)
   [junit4]    > 	at java.base/java.net.SocketInputStream.socketRead(SocketInputStream.java:115)
   [junit4]    > 	at java.base/java.net.SocketInputStream.read(SocketInputStream.java:168)
   [junit4]    > 	at java.base/java.net.SocketInputStream.read(SocketInputStream.java:140)
   [junit4]    > 	at org.apache.http.impl.io.SessionInputBufferImpl.streamRead(SessionInputBufferImpl.java:137)
   [junit4]    > 	at org.apache.http.impl.io.SessionInputBufferImpl.fillBuffer(SessionInputBufferImpl.java:153)
   [junit4]    > 	at org.apache.http.impl.io.SessionInputBufferImpl.readLine(SessionInputBufferImpl.java:282)
   [junit4]    > 	at org.apache.http.impl.conn.DefaultHttpResponseParser.parseHead(DefaultHttpResponseParser.java:138)
   [junit4]    > 	at org.apache.http.impl.conn.DefaultHttpResponseParser.parseHead(DefaultHttpResponseParser.java:56)
   [junit4]    > 	at org.apache.http.impl.io.AbstractMessageParser.parse(AbstractMessageParser.java:259)
   [junit4]    > 	at org.apache.http.impl.DefaultBHttpClientConnection.receiveResponseHeader(DefaultBHttpClientConnection.java:163)
   [junit4]    > 	at org.apache.http.impl.conn.CPoolProxy.receiveResponseHeader(CPoolProxy.java:165)
   [junit4]    > 	at org.apache.http.protocol.HttpRequestExecutor.doReceiveResponse(HttpRequestExecutor.java:273)
   [junit4]    > 	at org.apache.http.protocol.HttpRequestExecutor.execute(HttpRequestExecutor.java:125)
   [junit4]    > 	at org.apache.http.impl.execchain.MainClientExec.execute(MainClientExec.java:272)
   [junit4]    > 	at org.apache.http.impl.execchain.ProtocolExec.execute(ProtocolExec.java:185)
   [junit4]    > 	at org.apache.http.impl.execchain.RetryExec.execute(RetryExec.java:89)
   [junit4]    > 	at org.apache.http.impl.execchain.RedirectExec.execute(RedirectExec.java:111)
   [junit4]    > 	at org.apache.http.impl.client.InternalHttpClient.doExecute(InternalHttpClient.java:185)
   [junit4]    > 	at org.apache.http.impl.client.CloseableHttpClient.execute(CloseableHttpClient.java:83)
   [junit4]    > 	at org.apache.http.impl.client.CloseableHttpClient.execute(CloseableHttpClient.java:56)
   [junit4]    > 	at org.apache.solr.client.solrj.impl.HttpSolrClient.executeMethod(HttpSolrClient.java:542)
   [junit4]    > 	... 47 more
   [junit4]   2> NOTE: leaving temporary files on disk at: /home/jenkins/workspace/Lucene-Solr-7.6-Linux/solr/build/solr-core/test/J1/temp/solr.cloud.HttpPartitionOnCommitTest_7B4AF667D3501236-001
   [junit4]   2> Dec 22, 2018 11:02:48 AM com.carrotsearch.randomizedtesting.ThreadLeakControl checkThreadLeaks
   [junit4]   2> WARNING: Will linger awaiting termination of 3 leaked thread(s).
   [junit4]   2> NOTE: test params are: codec=Asserting(Lucene70): {}, docValues:{}, maxPointsInLeafNode=748, maxMBSortInHeap=7.3598376651906205, sim=RandomSimilarity(queryNorm=false): {}, locale=lg, timezone=Universal
   [junit4]   2> NOTE: Linux 4.15.0-42-generic amd64/Oracle Corporation 12-ea (64-bit)/cpus=8,threads=1,free=55080984,total=518979584
   [junit4]   2> NOTE: All tests run in this JVM: [SortSpecParsingTest, TestDeleteCollectionOnDownNodes, SpellPossibilityIteratorTest, SuggesterTest, TestStressReorder, SyncSliceTest, TestBadConfig, AddSchemaFieldsUpdateProcessorFactoryTest, UniqFieldsUpdateProcessorFactoryTest, TestTlogReplica, NodeAddedTriggerIntegrationTest, TestCollationFieldDocValues, TestCorePropertiesReload, DOMUtilTest, CheckHdfsIndexTest, OutOfBoxZkACLAndCredentialsProvidersTest, PropertiesRequestHandlerTest, MetricsConfigTest, TestCursorMarkWithoutUniqueKey, TestSolr4Spatial2, TestCSVLoader, ReplicaListTransformerTest, NoCacheHeaderTest, CustomHighlightComponentTest, TestSolrXml, TestClassicSimilarityFactory, TestReqParamsAPI, TestReplicaProperties, MultiSolrCloudTestCaseTest, MetricUtilsTest, TestMissingGroups, SolrIndexMetricsTest, ConfigureRecoveryStrategyTest, TestPolicyCloud, TestHighlightDedupGrouping, TestStressCloudBlindAtomicUpdates, LeaderElectionTest, TestDistribIDF, TestFieldCacheVsDocValues, TestSlowCompositeReaderWrapper, CloneFieldUpdateProcessorFactoryTest, MergeStrategyTest, MBeansHandlerTest, ZkFailoverTest, SolrCloudExampleTest, TestSweetSpotSimilarityFactory, TestUnInvertedFieldException, PolyFieldTest, RangeFacetCloudTest, TestShardHandlerFactory, ClusterStateTest, WordBreakSolrSpellCheckerTest, ZkSolrClientTest, TestRuleBasedAuthorizationPlugin, DataDrivenBlockJoinTest, PluginInfoTest, OverseerModifyCollectionTest, TestMacros, RequestHandlersTest, AddBlockUpdateTest, TestApiFramework, HdfsBasicDistributedZkTest, HttpPartitionOnCommitTest]
   [junit4] Completed [369/836 (1!)] on J1 in 624.88s, 1 test, 1 error <<< FAILURES!

[...truncated 44271 lines...]
[repro] Jenkins log URL: https://jenkins.thetaphi.de/job/Lucene-Solr-7.6-Linux/134/consoleText

[repro] Revision: e1d5761f7b976aa4ab83969f9a699597c0855b3e

[repro] Ant options: "-Dargs=-XX:-UseCompressedOops -XX:+UseSerialGC"
[repro] Repro line:  ant test  -Dtestcase=HttpPartitionOnCommitTest -Dtests.method=test -Dtests.seed=7B4AF667D3501236 -Dtests.multiplier=3 -Dtests.slow=true -Dtests.locale=lg -Dtests.timezone=Universal -Dtests.asserts=true -Dtests.file.encoding=UTF-8

[repro] ant clean

[...truncated 6 lines...]
[repro] Test suites by module:
[repro]    solr/core
[repro]       HttpPartitionOnCommitTest
[repro] ant compile-test

[...truncated 3585 lines...]
[repro] ant test-nocompile -Dtests.dups=5 -Dtests.maxfailures=5 -Dtests.class="*.HttpPartitionOnCommitTest" -Dtests.showOutput=onerror "-Dargs=-XX:-UseCompressedOops -XX:+UseSerialGC" -Dtests.seed=7B4AF667D3501236 -Dtests.multiplier=3 -Dtests.slow=true -Dtests.locale=lg -Dtests.timezone=Universal -Dtests.asserts=true -Dtests.file.encoding=UTF-8

[...truncated 76 lines...]
[repro] Failures:
[repro]   0/5 failed: org.apache.solr.cloud.HttpPartitionOnCommitTest
[repro] Exiting with code 0

[...truncated 40 lines...]