You are viewing a plain text version of this content. The canonical link for it is here.
Posted to dev@kafka.apache.org by Apache Jenkins Server <je...@builds.apache.org> on 2017/05/24 00:36:32 UTC

Build failed in Jenkins: kafka-trunk-jdk8 #1581

See <https://builds.apache.org/job/kafka-trunk-jdk8/1581/display/redirect?page=changes>

Changes:

[ismael] KAFKA-5135; Controller Health Metrics (KIP-143)

------------------------------------------
[...truncated 891.05 KB...]

kafka.coordinator.transaction.TransactionCoordinatorTest > shouldRespondWithCoordinatorLoadInProgressOnEndTxnWhenCoordinatorIsLoading STARTED

kafka.coordinator.transaction.TransactionCoordinatorTest > shouldRespondWithCoordinatorLoadInProgressOnEndTxnWhenCoordinatorIsLoading PASSED

kafka.coordinator.transaction.TransactionCoordinatorTest > shouldRespondWithSuccessOnAddPartitionsWhenStateIsCompleteAbort STARTED

kafka.coordinator.transaction.TransactionCoordinatorTest > shouldRespondWithSuccessOnAddPartitionsWhenStateIsCompleteAbort PASSED

kafka.coordinator.transaction.TransactionCoordinatorTest > shouldWaitForCommitToCompleteOnHandleInitPidAndExistingTransactionInPrepareAbortState STARTED

kafka.coordinator.transaction.TransactionCoordinatorTest > shouldWaitForCommitToCompleteOnHandleInitPidAndExistingTransactionInPrepareAbortState PASSED

kafka.coordinator.transaction.TransactionCoordinatorTest > shouldAbortExpiredTransactionsInOngoingState STARTED

kafka.coordinator.transaction.TransactionCoordinatorTest > shouldAbortExpiredTransactionsInOngoingState PASSED

kafka.coordinator.transaction.TransactionCoordinatorTest > shouldRespondWithErrorsNoneOnAddPartitionWhenNoErrorsAndPartitionsTheSame STARTED

kafka.coordinator.transaction.TransactionCoordinatorTest > shouldRespondWithErrorsNoneOnAddPartitionWhenNoErrorsAndPartitionsTheSame PASSED

kafka.coordinator.transaction.TransactionCoordinatorTest > shouldRespondWithInvalidRequestOnEndTxnWhenTransactionalIdIsEmpty STARTED

kafka.coordinator.transaction.TransactionCoordinatorTest > shouldRespondWithInvalidRequestOnEndTxnWhenTransactionalIdIsEmpty PASSED

kafka.coordinator.transaction.TransactionCoordinatorTest > shouldRespondWithInvalidRequestAddPartitionsToTransactionWhenTransactionalIdIsEmpty STARTED

kafka.coordinator.transaction.TransactionCoordinatorTest > shouldRespondWithInvalidRequestAddPartitionsToTransactionWhenTransactionalIdIsEmpty PASSED

kafka.coordinator.transaction.TransactionCoordinatorTest > shouldAppendPrepareAbortToLogOnEndTxnWhenStatusIsOngoingAndResultIsAbort STARTED

kafka.coordinator.transaction.TransactionCoordinatorTest > shouldAppendPrepareAbortToLogOnEndTxnWhenStatusIsOngoingAndResultIsAbort PASSED

kafka.coordinator.transaction.TransactionCoordinatorTest > shouldAcceptInitPidAndReturnNextPidWhenTransactionalIdIsNull STARTED

kafka.coordinator.transaction.TransactionCoordinatorTest > shouldAcceptInitPidAndReturnNextPidWhenTransactionalIdIsNull PASSED

kafka.coordinator.transaction.TransactionCoordinatorTest > shouldRemoveTransactionsForPartitionOnEmigration STARTED

kafka.coordinator.transaction.TransactionCoordinatorTest > shouldRemoveTransactionsForPartitionOnEmigration PASSED

kafka.coordinator.transaction.TransactionCoordinatorTest > shouldWaitForCommitToCompleteOnHandleInitPidAndExistingTransactionInPrepareCommitState STARTED

kafka.coordinator.transaction.TransactionCoordinatorTest > shouldWaitForCommitToCompleteOnHandleInitPidAndExistingTransactionInPrepareCommitState PASSED

kafka.coordinator.transaction.TransactionCoordinatorTest > shouldReturnInvalidTxnRequestOnEndTxnRequestWhenStatusIsCompleteCommitAndResultIsNotCommit STARTED

kafka.coordinator.transaction.TransactionCoordinatorTest > shouldReturnInvalidTxnRequestOnEndTxnRequestWhenStatusIsCompleteCommitAndResultIsNotCommit PASSED

kafka.coordinator.transaction.TransactionCoordinatorTest > shouldReturnOkOnEndTxnWhenStatusIsCompleteCommitAndResultIsCommit STARTED

kafka.coordinator.transaction.TransactionCoordinatorTest > shouldReturnOkOnEndTxnWhenStatusIsCompleteCommitAndResultIsCommit PASSED

kafka.coordinator.transaction.TransactionCoordinatorTest > shouldRespondWithConcurrentTransactionsOnAddPartitionsWhenStateIsPrepareCommit STARTED

kafka.coordinator.transaction.TransactionCoordinatorTest > shouldRespondWithConcurrentTransactionsOnAddPartitionsWhenStateIsPrepareCommit PASSED

kafka.coordinator.transaction.TransactionCoordinatorTest > shouldIncrementEpochAndUpdateMetadataOnHandleInitPidWhenExistingCompleteTransaction STARTED

kafka.coordinator.transaction.TransactionCoordinatorTest > shouldIncrementEpochAndUpdateMetadataOnHandleInitPidWhenExistingCompleteTransaction PASSED

kafka.coordinator.transaction.TransactionCoordinatorTest > shouldRespondWithNotCoordinatorOnInitPidWhenNotCoordinator STARTED

kafka.coordinator.transaction.TransactionCoordinatorTest > shouldRespondWithNotCoordinatorOnInitPidWhenNotCoordinator PASSED

kafka.coordinator.transaction.TransactionCoordinatorTest > shouldRespondWithConcurrentTransactionOnAddPartitionsWhenStateIsPrepareAbort STARTED

kafka.coordinator.transaction.TransactionCoordinatorTest > shouldRespondWithConcurrentTransactionOnAddPartitionsWhenStateIsPrepareAbort PASSED

kafka.coordinator.transaction.TransactionCoordinatorTest > shouldInitPidWithEpochZeroForNewTransactionalId STARTED

kafka.coordinator.transaction.TransactionCoordinatorTest > shouldInitPidWithEpochZeroForNewTransactionalId PASSED

kafka.coordinator.transaction.ProducerIdManagerTest > testExceedPIDLimit STARTED

kafka.coordinator.transaction.ProducerIdManagerTest > testExceedPIDLimit PASSED

kafka.coordinator.transaction.ProducerIdManagerTest > testGetPID STARTED

kafka.coordinator.transaction.ProducerIdManagerTest > testGetPID PASSED

kafka.coordinator.transaction.TransactionMarkerChannelManagerTest > shouldGenerateEmptyMapWhenNoRequestsOutstanding STARTED

kafka.coordinator.transaction.TransactionMarkerChannelManagerTest > shouldGenerateEmptyMapWhenNoRequestsOutstanding PASSED

kafka.coordinator.transaction.TransactionMarkerChannelManagerTest > shouldGenerateRequestPerPartitionPerBroker STARTED

kafka.coordinator.transaction.TransactionMarkerChannelManagerTest > shouldGenerateRequestPerPartitionPerBroker PASSED

kafka.coordinator.transaction.TransactionMarkerChannelManagerTest > shouldRemoveMarkersForTxnPartitionWhenPartitionEmigrated STARTED

kafka.coordinator.transaction.TransactionMarkerChannelManagerTest > shouldRemoveMarkersForTxnPartitionWhenPartitionEmigrated PASSED

kafka.coordinator.transaction.TransactionMarkerChannelManagerTest > shouldGenerateRequestPerBroker STARTED

kafka.coordinator.transaction.TransactionMarkerChannelManagerTest > shouldGenerateRequestPerBroker PASSED

kafka.coordinator.transaction.TransactionMarkerChannelManagerTest > shouldRetryGettingLeaderWhenNotFound STARTED

kafka.coordinator.transaction.TransactionMarkerChannelManagerTest > shouldRetryGettingLeaderWhenNotFound PASSED

kafka.coordinator.transaction.TransactionLogTest > shouldReadWriteMessages STARTED

kafka.coordinator.transaction.TransactionLogTest > shouldReadWriteMessages PASSED

kafka.coordinator.transaction.TransactionLogTest > shouldThrowExceptionWriteInvalidTxn STARTED

kafka.coordinator.transaction.TransactionLogTest > shouldThrowExceptionWriteInvalidTxn PASSED

kafka.coordinator.transaction.TransactionStateManagerTest > testAppendTransactionToLogWhileProducerFenced STARTED

kafka.coordinator.transaction.TransactionStateManagerTest > testAppendTransactionToLogWhileProducerFenced PASSED

kafka.coordinator.transaction.TransactionStateManagerTest > shouldReturnNotCooridnatorErrorIfTransactionIdPartitionNotOwned STARTED

kafka.coordinator.transaction.TransactionStateManagerTest > shouldReturnNotCooridnatorErrorIfTransactionIdPartitionNotOwned PASSED

kafka.coordinator.transaction.TransactionStateManagerTest > testValidateTransactionTimeout STARTED

kafka.coordinator.transaction.TransactionStateManagerTest > testValidateTransactionTimeout PASSED

kafka.coordinator.transaction.TransactionStateManagerTest > shouldWriteTxnMarkersForTransactionInPreparedCommitState STARTED

kafka.coordinator.transaction.TransactionStateManagerTest > shouldWriteTxnMarkersForTransactionInPreparedCommitState PASSED

kafka.coordinator.transaction.TransactionStateManagerTest > testAppendTransactionToLog STARTED

kafka.coordinator.transaction.TransactionStateManagerTest > testAppendTransactionToLog PASSED

kafka.coordinator.transaction.TransactionStateManagerTest > testAppendTransactionToLogWhilePendingStateChanged STARTED

kafka.coordinator.transaction.TransactionStateManagerTest > testAppendTransactionToLogWhilePendingStateChanged PASSED

kafka.coordinator.transaction.TransactionStateManagerTest > testLoadAndRemoveTransactionsForPartition STARTED

kafka.coordinator.transaction.TransactionStateManagerTest > testLoadAndRemoveTransactionsForPartition PASSED

kafka.coordinator.transaction.TransactionStateManagerTest > testAddGetPids STARTED

kafka.coordinator.transaction.TransactionStateManagerTest > testAddGetPids PASSED

kafka.coordinator.transaction.TransactionStateManagerTest > shouldWriteTxnMarkersForTransactionInPreparedAbortState STARTED

kafka.coordinator.transaction.TransactionStateManagerTest > shouldWriteTxnMarkersForTransactionInPreparedAbortState PASSED

kafka.coordinator.transaction.TransactionStateManagerTest > shouldOnlyConsiderTransactionsInTheOngoingStateForExpiry STARTED

kafka.coordinator.transaction.TransactionStateManagerTest > shouldOnlyConsiderTransactionsInTheOngoingStateForExpiry PASSED

unit.kafka.admin.ResetConsumerGroupOffsetTest > testResetOffsetsShiftByHigherThanLatest STARTED

unit.kafka.admin.ResetConsumerGroupOffsetTest > testResetOffsetsShiftByHigherThanLatest PASSED

unit.kafka.admin.ResetConsumerGroupOffsetTest > testResetOffsetsShiftMinus STARTED

unit.kafka.admin.ResetConsumerGroupOffsetTest > testResetOffsetsShiftMinus PASSED

unit.kafka.admin.ResetConsumerGroupOffsetTest > testResetOffsetsToCurrentOffset STARTED

unit.kafka.admin.ResetConsumerGroupOffsetTest > testResetOffsetsToCurrentOffset PASSED

unit.kafka.admin.ResetConsumerGroupOffsetTest > testResetOffsetsToEarliestOnOneTopicAndPartition STARTED

unit.kafka.admin.ResetConsumerGroupOffsetTest > testResetOffsetsToEarliestOnOneTopicAndPartition PASSED

unit.kafka.admin.ResetConsumerGroupOffsetTest > testResetOffsetsByDurationToEarliest STARTED

unit.kafka.admin.ResetConsumerGroupOffsetTest > testResetOffsetsByDurationToEarliest PASSED

unit.kafka.admin.ResetConsumerGroupOffsetTest > testResetOffsetsToEarliestOnOneTopic STARTED

unit.kafka.admin.ResetConsumerGroupOffsetTest > testResetOffsetsToEarliestOnOneTopic PASSED

unit.kafka.admin.ResetConsumerGroupOffsetTest > testResetOffsetsNotExistingGroup STARTED

unit.kafka.admin.ResetConsumerGroupOffsetTest > testResetOffsetsNotExistingGroup PASSED

unit.kafka.admin.ResetConsumerGroupOffsetTest > testResetOffsetsToZonedDateTime STARTED

unit.kafka.admin.ResetConsumerGroupOffsetTest > testResetOffsetsToZonedDateTime PASSED

unit.kafka.admin.ResetConsumerGroupOffsetTest > testResetOffsetsToEarliest STARTED

unit.kafka.admin.ResetConsumerGroupOffsetTest > testResetOffsetsToEarliest PASSED

unit.kafka.admin.ResetConsumerGroupOffsetTest > testResetOffsetsExportImportPlan STARTED

unit.kafka.admin.ResetConsumerGroupOffsetTest > testResetOffsetsExportImportPlan PASSED

unit.kafka.admin.ResetConsumerGroupOffsetTest > testResetOffsetsToSpecificOffset STARTED

unit.kafka.admin.ResetConsumerGroupOffsetTest > testResetOffsetsToSpecificOffset PASSED

unit.kafka.admin.ResetConsumerGroupOffsetTest > testResetOffsetsShiftPlus STARTED

unit.kafka.admin.ResetConsumerGroupOffsetTest > testResetOffsetsShiftPlus PASSED

unit.kafka.admin.ResetConsumerGroupOffsetTest > testResetOffsetsToLatest STARTED

unit.kafka.admin.ResetConsumerGroupOffsetTest > testResetOffsetsToLatest PASSED

unit.kafka.admin.ResetConsumerGroupOffsetTest > testResetOffsetsShiftByLowerThanEarliest STARTED

unit.kafka.admin.ResetConsumerGroupOffsetTest > testResetOffsetsShiftByLowerThanEarliest PASSED

unit.kafka.admin.ResetConsumerGroupOffsetTest > testResetOffsetsByDuration STARTED

unit.kafka.admin.ResetConsumerGroupOffsetTest > testResetOffsetsByDuration PASSED

unit.kafka.admin.ResetConsumerGroupOffsetTest > testResetOffsetsToLocalDateTime STARTED

unit.kafka.admin.ResetConsumerGroupOffsetTest > testResetOffsetsToLocalDateTime PASSED

unit.kafka.admin.ResetConsumerGroupOffsetTest > testResetOffsetsToEarliestOnTopicsAndPartitions STARTED

unit.kafka.admin.ResetConsumerGroupOffsetTest > testResetOffsetsToEarliestOnTopicsAndPartitions PASSED

unit.kafka.admin.ResetConsumerGroupOffsetTest > testResetOffsetsToEarliestOnTopics STARTED

unit.kafka.admin.ResetConsumerGroupOffsetTest > testResetOffsetsToEarliestOnTopics PASSED

1372 tests completed, 1 failed, 6 skipped
:kafka-trunk-jdk8:core:test FAILED
:test_core_2_11 FAILED

FAILURE: Build failed with an exception.

* What went wrong:
Execution failed for task ':kafka-trunk-jdk8:core:test'.
> There were failing tests. See the report at: file://<https://builds.apache.org/job/kafka-trunk-jdk8/ws/core/build/reports/tests/test/index.html>

* Try:
Run with --stacktrace option to get the stack trace. Run with --info or --debug option to get more log output.

BUILD FAILED

Total time: 45 mins 10.634 secs
Build step 'Execute shell' marked build as failure
[FINDBUGS] Collecting findbugs analysis files...
Setting GRADLE_3_4_RC_2_HOME=/home/jenkins/jenkins-slave/tools/hudson.plugins.gradle.GradleInstallation/Gradle_3.4-rc-2
[FINDBUGS] Searching for all files in <https://builds.apache.org/job/kafka-trunk-jdk8/ws/> that match the pattern **/build/reports/findbugs/*.xml
[FINDBUGS] Parsing 1 file in <https://builds.apache.org/job/kafka-trunk-jdk8/ws/>
[FINDBUGS] Successfully parsed file <https://builds.apache.org/job/kafka-trunk-jdk8/ws/core/build/reports/findbugs/main.xml> with 0 unique warnings and 0 duplicates.
[FINDBUGS] Computing warning deltas based on reference build #1578
Recording test results
Setting GRADLE_3_4_RC_2_HOME=/home/jenkins/jenkins-slave/tools/hudson.plugins.gradle.GradleInstallation/Gradle_3.4-rc-2
Setting GRADLE_3_4_RC_2_HOME=/home/jenkins/jenkins-slave/tools/hudson.plugins.gradle.GradleInstallation/Gradle_3.4-rc-2
Not sending mail to unregistered user ismael@juma.me.uk
Not sending mail to unregistered user wangguoz@gmail.com

Jenkins build is back to normal : kafka-trunk-jdk8 #1583

Posted by Apache Jenkins Server <je...@builds.apache.org>.
See <https://builds.apache.org/job/kafka-trunk-jdk8/1583/display/redirect?page=changes>


Build failed in Jenkins: kafka-trunk-jdk8 #1582

Posted by Apache Jenkins Server <je...@builds.apache.org>.
See <https://builds.apache.org/job/kafka-trunk-jdk8/1582/display/redirect?page=changes>

Changes:

[me] KAFKA-5081: Force jackson-annotations to a single version matching

------------------------------------------
[...truncated 893.75 KB...]

kafka.security.auth.SimpleAclAuthorizerTest > testAclManagementAPIs STARTED

kafka.security.auth.SimpleAclAuthorizerTest > testAclManagementAPIs PASSED

kafka.security.auth.SimpleAclAuthorizerTest > testWildCardAcls STARTED

kafka.security.auth.SimpleAclAuthorizerTest > testWildCardAcls PASSED

kafka.security.auth.SimpleAclAuthorizerTest > testTopicAcl STARTED

kafka.security.auth.SimpleAclAuthorizerTest > testTopicAcl PASSED

kafka.security.auth.SimpleAclAuthorizerTest > testSuperUserHasAccess STARTED

kafka.security.auth.SimpleAclAuthorizerTest > testSuperUserHasAccess PASSED

kafka.security.auth.SimpleAclAuthorizerTest > testDenyTakesPrecedence STARTED

kafka.security.auth.SimpleAclAuthorizerTest > testDenyTakesPrecedence PASSED

kafka.security.auth.SimpleAclAuthorizerTest > testNoAclFoundOverride STARTED

kafka.security.auth.SimpleAclAuthorizerTest > testNoAclFoundOverride PASSED

kafka.security.auth.SimpleAclAuthorizerTest > testHighConcurrencyModificationOfResourceAcls STARTED

kafka.security.auth.SimpleAclAuthorizerTest > testHighConcurrencyModificationOfResourceAcls PASSED

kafka.security.auth.SimpleAclAuthorizerTest > testLoadCache STARTED

kafka.security.auth.SimpleAclAuthorizerTest > testLoadCache PASSED

kafka.integration.PrimitiveApiTest > testMultiProduce STARTED

kafka.integration.PrimitiveApiTest > testMultiProduce PASSED

kafka.integration.PrimitiveApiTest > testDefaultEncoderProducerAndFetch STARTED

kafka.integration.PrimitiveApiTest > testDefaultEncoderProducerAndFetch PASSED

kafka.integration.PrimitiveApiTest > testFetchRequestCanProperlySerialize STARTED

kafka.integration.PrimitiveApiTest > testFetchRequestCanProperlySerialize PASSED

kafka.integration.PrimitiveApiTest > testPipelinedProduceRequests STARTED

kafka.integration.PrimitiveApiTest > testPipelinedProduceRequests PASSED

kafka.integration.PrimitiveApiTest > testProduceAndMultiFetch STARTED

kafka.integration.PrimitiveApiTest > testProduceAndMultiFetch PASSED

kafka.integration.PrimitiveApiTest > testDefaultEncoderProducerAndFetchWithCompression STARTED

kafka.integration.PrimitiveApiTest > testDefaultEncoderProducerAndFetchWithCompression PASSED

kafka.integration.PrimitiveApiTest > testConsumerEmptyTopic STARTED

kafka.integration.PrimitiveApiTest > testConsumerEmptyTopic PASSED

kafka.integration.PrimitiveApiTest > testEmptyFetchRequest STARTED

kafka.integration.PrimitiveApiTest > testEmptyFetchRequest PASSED

kafka.integration.MetricsDuringTopicCreationDeletionTest > testMetricsDuringTopicCreateDelete STARTED

kafka.integration.MetricsDuringTopicCreationDeletionTest > testMetricsDuringTopicCreateDelete PASSED

kafka.integration.AutoOffsetResetTest > testResetToLatestWhenOffsetTooLow STARTED

kafka.integration.AutoOffsetResetTest > testResetToLatestWhenOffsetTooLow PASSED

kafka.integration.AutoOffsetResetTest > testResetToEarliestWhenOffsetTooLow STARTED

kafka.integration.AutoOffsetResetTest > testResetToEarliestWhenOffsetTooLow PASSED

kafka.integration.AutoOffsetResetTest > testResetToEarliestWhenOffsetTooHigh STARTED

kafka.integration.AutoOffsetResetTest > testResetToEarliestWhenOffsetTooHigh PASSED

kafka.integration.AutoOffsetResetTest > testResetToLatestWhenOffsetTooHigh STARTED

kafka.integration.AutoOffsetResetTest > testResetToLatestWhenOffsetTooHigh PASSED

kafka.integration.TopicMetadataTest > testIsrAfterBrokerShutDownAndJoinsBack STARTED

kafka.integration.TopicMetadataTest > testIsrAfterBrokerShutDownAndJoinsBack PASSED

kafka.integration.TopicMetadataTest > testAutoCreateTopicWithCollision STARTED

kafka.integration.TopicMetadataTest > testAutoCreateTopicWithCollision PASSED

kafka.integration.TopicMetadataTest > testAliveBrokerListWithNoTopics STARTED

kafka.integration.TopicMetadataTest > testAliveBrokerListWithNoTopics PASSED

kafka.integration.TopicMetadataTest > testAutoCreateTopic STARTED

kafka.integration.TopicMetadataTest > testAutoCreateTopic PASSED

kafka.integration.TopicMetadataTest > testGetAllTopicMetadata STARTED

kafka.integration.TopicMetadataTest > testGetAllTopicMetadata PASSED

kafka.integration.TopicMetadataTest > testAliveBrokersListWithNoTopicsAfterNewBrokerStartup STARTED

kafka.integration.TopicMetadataTest > testAliveBrokersListWithNoTopicsAfterNewBrokerStartup PASSED

kafka.integration.TopicMetadataTest > testBasicTopicMetadata STARTED

kafka.integration.TopicMetadataTest > testBasicTopicMetadata PASSED

kafka.integration.TopicMetadataTest > testAutoCreateTopicWithInvalidReplication STARTED

kafka.integration.TopicMetadataTest > testAutoCreateTopicWithInvalidReplication PASSED

kafka.integration.TopicMetadataTest > testAliveBrokersListWithNoTopicsAfterABrokerShutdown STARTED

kafka.integration.TopicMetadataTest > testAliveBrokersListWithNoTopicsAfterABrokerShutdown PASSED

kafka.integration.FetcherTest > testFetcher STARTED

kafka.integration.FetcherTest > testFetcher PASSED

kafka.integration.UncleanLeaderElectionTest > testUncleanLeaderElectionEnabled STARTED

kafka.integration.UncleanLeaderElectionTest > testUncleanLeaderElectionEnabled PASSED

kafka.integration.UncleanLeaderElectionTest > testCleanLeaderElectionDisabledByTopicOverride STARTED

kafka.integration.UncleanLeaderElectionTest > testCleanLeaderElectionDisabledByTopicOverride SKIPPED

kafka.integration.UncleanLeaderElectionTest > testUncleanLeaderElectionDisabled STARTED

kafka.integration.UncleanLeaderElectionTest > testUncleanLeaderElectionDisabled SKIPPED

kafka.integration.UncleanLeaderElectionTest > testUncleanLeaderElectionInvalidTopicOverride STARTED

kafka.integration.UncleanLeaderElectionTest > testUncleanLeaderElectionInvalidTopicOverride PASSED

kafka.integration.UncleanLeaderElectionTest > testUncleanLeaderElectionEnabledByTopicOverride STARTED

kafka.integration.UncleanLeaderElectionTest > testUncleanLeaderElectionEnabledByTopicOverride PASSED

kafka.integration.MinIsrConfigTest > testDefaultKafkaConfig STARTED

kafka.integration.MinIsrConfigTest > testDefaultKafkaConfig PASSED

unit.kafka.admin.ResetConsumerGroupOffsetTest > testResetOffsetsShiftByHigherThanLatest STARTED

unit.kafka.admin.ResetConsumerGroupOffsetTest > testResetOffsetsShiftByHigherThanLatest PASSED

unit.kafka.admin.ResetConsumerGroupOffsetTest > testResetOffsetsShiftMinus STARTED

unit.kafka.admin.ResetConsumerGroupOffsetTest > testResetOffsetsShiftMinus PASSED

unit.kafka.admin.ResetConsumerGroupOffsetTest > testResetOffsetsToCurrentOffset STARTED

unit.kafka.admin.ResetConsumerGroupOffsetTest > testResetOffsetsToCurrentOffset PASSED

unit.kafka.admin.ResetConsumerGroupOffsetTest > testResetOffsetsToEarliestOnOneTopicAndPartition STARTED

unit.kafka.admin.ResetConsumerGroupOffsetTest > testResetOffsetsToEarliestOnOneTopicAndPartition PASSED

unit.kafka.admin.ResetConsumerGroupOffsetTest > testResetOffsetsByDurationToEarliest STARTED

unit.kafka.admin.ResetConsumerGroupOffsetTest > testResetOffsetsByDurationToEarliest PASSED

unit.kafka.admin.ResetConsumerGroupOffsetTest > testResetOffsetsToEarliestOnOneTopic STARTED

unit.kafka.admin.ResetConsumerGroupOffsetTest > testResetOffsetsToEarliestOnOneTopic PASSED

unit.kafka.admin.ResetConsumerGroupOffsetTest > testResetOffsetsNotExistingGroup STARTED

unit.kafka.admin.ResetConsumerGroupOffsetTest > testResetOffsetsNotExistingGroup PASSED

unit.kafka.admin.ResetConsumerGroupOffsetTest > testResetOffsetsToZonedDateTime STARTED

unit.kafka.admin.ResetConsumerGroupOffsetTest > testResetOffsetsToZonedDateTime PASSED

unit.kafka.admin.ResetConsumerGroupOffsetTest > testResetOffsetsToEarliest STARTED

unit.kafka.admin.ResetConsumerGroupOffsetTest > testResetOffsetsToEarliest PASSED

unit.kafka.admin.ResetConsumerGroupOffsetTest > testResetOffsetsExportImportPlan STARTED

unit.kafka.admin.ResetConsumerGroupOffsetTest > testResetOffsetsExportImportPlan PASSED

unit.kafka.admin.ResetConsumerGroupOffsetTest > testResetOffsetsToSpecificOffset STARTED

unit.kafka.admin.ResetConsumerGroupOffsetTest > testResetOffsetsToSpecificOffset PASSED

unit.kafka.admin.ResetConsumerGroupOffsetTest > testResetOffsetsShiftPlus STARTED

unit.kafka.admin.ResetConsumerGroupOffsetTest > testResetOffsetsShiftPlus PASSED

unit.kafka.admin.ResetConsumerGroupOffsetTest > testResetOffsetsToLatest STARTED

unit.kafka.admin.ResetConsumerGroupOffsetTest > testResetOffsetsToLatest PASSED

unit.kafka.admin.ResetConsumerGroupOffsetTest > testResetOffsetsShiftByLowerThanEarliest STARTED

unit.kafka.admin.ResetConsumerGroupOffsetTest > testResetOffsetsShiftByLowerThanEarliest PASSED

unit.kafka.admin.ResetConsumerGroupOffsetTest > testResetOffsetsByDuration STARTED

unit.kafka.admin.ResetConsumerGroupOffsetTest > testResetOffsetsByDuration PASSED

unit.kafka.admin.ResetConsumerGroupOffsetTest > testResetOffsetsToLocalDateTime STARTED

unit.kafka.admin.ResetConsumerGroupOffsetTest > testResetOffsetsToLocalDateTime PASSED

unit.kafka.admin.ResetConsumerGroupOffsetTest > testResetOffsetsToEarliestOnTopicsAndPartitions STARTED

unit.kafka.admin.ResetConsumerGroupOffsetTest > testResetOffsetsToEarliestOnTopicsAndPartitions PASSED

unit.kafka.admin.ResetConsumerGroupOffsetTest > testResetOffsetsToEarliestOnTopics STARTED

unit.kafka.admin.ResetConsumerGroupOffsetTest > testResetOffsetsToEarliestOnTopics PASSED

1372 tests completed, 1 failed, 6 skipped
:kafka-trunk-jdk8:core:test FAILED
:test_core_2_11 FAILED

FAILURE: Build failed with an exception.

* What went wrong:
Execution failed for task ':kafka-trunk-jdk8:core:test'.
> There were failing tests. See the report at: file://<https://builds.apache.org/job/kafka-trunk-jdk8/ws/core/build/reports/tests/test/index.html>

* Try:
Run with --stacktrace option to get the stack trace. Run with --info or --debug option to get more log output.

BUILD FAILED

Total time: 56 mins 2.664 secs
Build step 'Execute shell' marked build as failure
[FINDBUGS] Collecting findbugs analysis files...
Setting GRADLE_3_4_RC_2_HOME=/home/jenkins/jenkins-slave/tools/hudson.plugins.gradle.GradleInstallation/Gradle_3.4-rc-2
[FINDBUGS] Searching for all files in <https://builds.apache.org/job/kafka-trunk-jdk8/ws/> that match the pattern **/build/reports/findbugs/*.xml
[FINDBUGS] Parsing 1 file in <https://builds.apache.org/job/kafka-trunk-jdk8/ws/>
[FINDBUGS] Successfully parsed file <https://builds.apache.org/job/kafka-trunk-jdk8/ws/core/build/reports/findbugs/main.xml> with 0 unique warnings and 0 duplicates.
[FINDBUGS] Computing warning deltas based on reference build #1578
Recording test results
Setting GRADLE_3_4_RC_2_HOME=/home/jenkins/jenkins-slave/tools/hudson.plugins.gradle.GradleInstallation/Gradle_3.4-rc-2
Setting GRADLE_3_4_RC_2_HOME=/home/jenkins/jenkins-slave/tools/hudson.plugins.gradle.GradleInstallation/Gradle_3.4-rc-2
Not sending mail to unregistered user ismael@juma.me.uk
Not sending mail to unregistered user wangguoz@gmail.com