You are viewing a plain text version of this content. The canonical link for it is here.
Posted to dev@lucene.apache.org by Apache Jenkins Server <je...@builds.apache.org> on 2014/06/01 08:53:44 UTC
[JENKINS-MAVEN] Lucene-Solr-Maven-trunk #1149: POMs out of sync
Build: https://builds.apache.org/job/Lucene-Solr-Maven-trunk/1149/
2 tests failed.
FAILED: org.apache.solr.cloud.CollectionsAPIDistributedZkTest.org.apache.solr.cloud.CollectionsAPIDistributedZkTest
Error Message:
Suite timeout exceeded (>= 7200000 msec).
Stack Trace:
java.lang.Exception: Suite timeout exceeded (>= 7200000 msec).
at __randomizedtesting.SeedInfo.seed([7154727157C9DB86]:0)
FAILED: org.apache.solr.cloud.CollectionsAPIDistributedZkTest.testDistribSearch
Error Message:
Test abandoned because suite timeout was reached.
Stack Trace:
java.lang.Exception: Test abandoned because suite timeout was reached.
at __randomizedtesting.SeedInfo.seed([7154727157C9DB86]:0)
Build Log:
[...truncated 54883 lines...]
BUILD FAILED
/usr/home/hudson/hudson-slave/workspace/Lucene-Solr-Maven-trunk/build.xml:490: The following error occurred while executing this line:
/usr/home/hudson/hudson-slave/workspace/Lucene-Solr-Maven-trunk/build.xml:182: The following error occurred while executing this line:
/usr/home/hudson/hudson-slave/workspace/Lucene-Solr-Maven-trunk/extra-targets.xml:77: Java returned: 1
Total time: 202 minutes 38 seconds
Build step 'Invoke Ant' marked build as failure
Recording test results
Email was triggered for: Failure
Sending email for trigger: Failure