You are viewing a plain text version of this content. The canonical link for it is here.
Posted to commits@sling.apache.org by Apache Jenkins Server <je...@builds.apache.org> on 2016/08/22 08:09:27 UTC
Build failed in Jenkins: sling-trunk-1.8 #3828
See <https://builds.apache.org/job/sling-trunk-1.8/3828/changes>
Changes:
[bdelacretaz] [maven-release-plugin] prepare for next development iteration
[bdelacretaz] [maven-release-plugin] prepare release org.apache.sling.servlets.get-2.1.18
------------------------------------------
[...truncated 133206 lines...]
[JENKINS] Archiving disabled
[JENKINS] Archiving disabled
[JENKINS] Archiving disabled
[JENKINS] Archiving disabled[INFO] ------------------------------------------------------------------------
[INFO] Reactor Summary:
[INFO]
[INFO] Apache Sling JAR Resource Bundle ................... SUCCESS [ 6.418 s]
[INFO] Apache Sling (Parent) .............................. SUCCESS [ 12.023 s]
[INFO] Apache Sling Tooling Support Install ............... SUCCESS [ 14.963 s]
[INFO] Apache Sling Provisioning Model .................... SUCCESS [ 18.258 s]
[INFO] Apache Sling Tooling Support Source ................ SUCCESS [ 5.515 s]
[INFO] Apache Sling Testing Utilities ..................... SUCCESS [ 31.300 s]
[INFO] Apache Sling API ................................... SUCCESS [ 15.720 s]
[INFO] Apache Sling Resource Resolver ..................... SUCCESS [ 20.047 s]
[INFO] Apache Sling System Bundle Extension: Java Transaction API SUCCESS [ 4.961 s]
[INFO] Apache Sling System Bundle Extension: XML APIs ..... SUCCESS [ 3.142 s]
[INFO] Apache Sling System Bundle Extension: Activation API SUCCESS [ 3.217 s]
[INFO] Apache Sling System Bundle Extension: WS APIs ...... SUCCESS [ 3.420 s]
[INFO] Apache Sling Dynamic Class Loader Support .......... SUCCESS [ 17.025 s]
[INFO] Apache Sling Commons FileSystem ClassLoader ........ SUCCESS [ 5.798 s]
[INFO] Apache Sling Commons Java Compiler ................. SUCCESS [ 7.255 s]
[INFO] Apache Sling JSON Library .......................... SUCCESS [ 14.335 s]
[INFO] Apache Sling SLF4J Implementation (Logback) ........ SUCCESS [01:14 min]
[INFO] Apache Sling OSGi LogService Implementation ........ SUCCESS [ 6.174 s]
[INFO] Apache Sling MIME type mapping support ............. SUCCESS [ 9.415 s]
[INFO] Apache Sling Content Detection Support ............. SUCCESS [01:24 min]
[INFO] Apache Sling Commons OSGi support .................. SUCCESS [ 9.600 s]
[INFO] Apache Sling Scheduler Support ..................... SUCCESS [ 9.636 s]
[INFO] Apache Sling Thread Dumper ......................... SUCCESS [ 3.084 s]
[INFO] Apache Sling Thread Support ........................ SUCCESS [ 6.256 s]
[INFO] Apache Sling Metrics ............................... SUCCESS [ 9.860 s]
[INFO] Apache Sling Authentication Service ................ SUCCESS [ 6.988 s]
[INFO] Apache Sling Form Based Authentication Handler ..... SUCCESS [ 15.544 s]
[INFO] Apache Sling Engine Implementation ................. SUCCESS [ 23.945 s]
[INFO] Apache Sling Repository API Bundle ................. SUCCESS [ 2.947 s]
[INFO] Apache Sling JCR Base Bundle ....................... SUCCESS [ 6.892 s]
[INFO] Apache Sling Pax Exam Utilities .................... SUCCESS [01:09 min]
[INFO] Apache Sling Initial Content Loader ................ SUCCESS [02:09 min]
[INFO] Apache Sling Jackrabbit Embedded Repository ........ SUCCESS [ 14.696 s]
[INFO] Apache Sling Jackrabbit UserManager Support ........ SUCCESS [ 5.774 s]
[INFO] Apache Sling Jackrabbit JSR-283 Access Control Manager Support SUCCESS [ 3.748 s]
[INFO] Apache Sling Wrapper Bundle for the JCR API ........ SUCCESS [ 3.395 s]
[INFO] Apache Sling JCR Resource Resolver ................. SUCCESS [ 55.867 s]
[INFO] Apache Sling Versioning Integration Tests .......... SUCCESS [ 20.392 s]
[INFO] Apache Sling JCR Repository Registration ........... SUCCESS [ 5.946 s]
[INFO] Apache Sling Simple WebDAV Access to repositories .. SUCCESS [ 4.381 s]
[INFO] Apache Sling DavEx Access to repositories .......... SUCCESS [ 5.855 s]
[INFO] Apache Sling JCR WebConsole Bundle ................. SUCCESS [ 2.992 s]
[INFO] Apache Sling JCR Oak Repository Server ............. SUCCESS [01:01 min]
[INFO] Apache Sling SlingRepository Integration Tests ..... SUCCESS [01:58 min]
[INFO] Apache Sling RepoInit Parser ....................... SUCCESS [ 6.990 s]
[INFO] Apache Sling RepoInit JCR module ................... SUCCESS [ 32.144 s]
[INFO] Apache Sling Servlet Resolver ...................... SUCCESS [ 6.540 s]
[INFO] Apache Sling Default GET Servlets .................. SUCCESS [ 7.095 s]
[INFO] Apache Sling Default POST Servlets ................. SUCCESS [ 8.768 s]
[INFO] Apache Sling Compat Servlets ....................... SUCCESS [ 2.942 s]
[INFO] Apache Sling Scripting Implementation API .......... SUCCESS [ 3.944 s]
[INFO] Apache Sling Scripting Core implementation ......... SUCCESS [ 33.245 s]
[INFO] Apache Sling Scripting JavaScript Support .......... SUCCESS [ 29.247 s]
[INFO] Apache Sling Scripting JSP Support ................. SUCCESS [ 8.768 s]
[INFO] Apache Sling JSP Tag Library ....................... SUCCESS [ 9.345 s]
[INFO] Apache Sling JSP Standard Tag Library .............. SUCCESS [ 3.341 s]
[INFO] Apache Sling Scripting Sightly Compiler ............ SUCCESS [ 51.215 s]
[INFO] Apache Sling Scripting Sightly Java Compiler ....... SUCCESS [ 35.300 s]
[INFO] Apache Sling Scripting Sightly Engine .............. SUCCESS [ 34.134 s]
[INFO] Apache Sling Scripting Sightly JavaScript Use Provider SUCCESS [ 5.662 s]
[INFO] Apache Sling Scripting Sightly Models Use Provider . SUCCESS [ 4.020 s]
[INFO] Apache Sling Scripting Sightly Read-Eval-Print Loop Environment SUCCESS [ 3.346 s]
[INFO] Apache Sling Scripting Sightly Integration Tests Content SUCCESS [ 8.219 s]
[INFO] Apache Sling Launchpad Base ........................ SUCCESS [ 24.338 s]
[INFO] Apache Sling Subsystems Base Installer ............. SUCCESS [ 7.174 s]
[INFO] Apache Sling Filesystem Resource Provider .......... SUCCESS [ 4.277 s]
[INFO] Apache Sling Installer WebConsole Plugin ........... SUCCESS [ 4.032 s]
[INFO] Apache Sling JCR Installer ......................... SUCCESS [02:08 min]
[INFO] Apache Sling Launchpad Application Builder ......... SUCCESS [01:18 min]
[INFO] Apache Sling Scripting Sightly Integration Tests ... SUCCESS [03:59 min]
[INFO] Apache Sling Scripting Sightly Reactor ............. SUCCESS [ 1.982 s]
[INFO] Apache Sling Adapter Manager Implementation ........ SUCCESS [ 5.569 s]
[INFO] Apache Sling Bundle Resource Provider .............. SUCCESS [ 3.141 s]
[INFO] Apache Sling Distributed Event Admin ............... SUCCESS [ 5.088 s]
[INFO] Apache Sling Discovery API ......................... SUCCESS [ 2.838 s]
[INFO] Apache Sling Discovery Commons ..................... SUCCESS [01:08 min]
[INFO] Apache Sling Discovery Base ........................ SUCCESS [01:13 min]
[INFO] Apache Sling Resource-Based Discovery Service ...... SUCCESS [03:28 min]
[INFO] Apache Sling Oak-Based Discovery Service ........... SUCCESS [02:36 min]
[INFO] Apache Sling Discovery Support Bundle .............. SUCCESS [ 5.820 s]
[INFO] Apache Sling Discovery Standalone Implementation ... SUCCESS [ 8.155 s]
[INFO] Apache Sling Event Support ......................... SUCCESS [10:43 min]
[INFO] Apache Sling Feature Flags ......................... SUCCESS [ 3.651 s]
[INFO] Apache Sling javax.activation bundle ............... SUCCESS [ 3.865 s]
[INFO] Apache Sling Service User Mapper ................... SUCCESS [ 6.659 s]
[INFO] Apache Sling Settings .............................. SUCCESS [ 7.192 s]
[INFO] Apache Sling Web Console Branding .................. SUCCESS [ 10.523 s]
[INFO] Apache Sling Web Console Security Provider ......... SUCCESS [ 6.086 s]
[INFO] Apache Sling Explorer .............................. SUCCESS [ 4.519 s]
[INFO] Apache Sling Health Check Core ..................... SUCCESS [03:05 min]
[INFO] Apache Sling Health Check Samples .................. SUCCESS [ 22.985 s]
[INFO] Apache Sling Health Check Support Components ....... SUCCESS [ 7.697 s]
[INFO] Apache Sling Health Check Webconsole Plugin ........ SUCCESS [ 5.733 s]
[INFO] Apache Sling Health Check JUnit Bridge ............. SUCCESS [ 9.793 s]
[INFO] Apache Sling Health Check Annotations .............. SUCCESS [ 3.584 s]
[INFO] Apache Sling Health Check Integration Tests ........ SUCCESS [ 10.709 s]
[INFO] Apache Sling Health Check Reactor POM .............. SUCCESS [ 4.411 s]
[INFO] Apache Sling Resource Access Security .............. SUCCESS [ 7.246 s]
[INFO] Apache Sling Resource Access Security Integration Tests SUCCESS [ 41.588 s]
[INFO] Apache Sling Models API ............................ SUCCESS [ 14.077 s]
[INFO] Apache Sling Models Implementation ................. SUCCESS [ 10.861 s]
[INFO] Apache Sling Models Integration Tests .............. SUCCESS [ 49.750 s]
[INFO] Apache Sling Internationalization Support .......... FAILURE [ 47.553 s]
[INFO] Apache Sling XSS Protection Bundle ................. SKIPPED
[INFO] Apache Sling JUnit Core ............................ SKIPPED
[INFO] Apache Sling JUnit Tests Teleporter ................ SKIPPED
[INFO] Apache Sling Resource Builder ...................... SKIPPED
[INFO] Apache Sling Servlet Helpers ....................... SKIPPED
[INFO] Apache Sling RepoInit Integration Tests ............ SKIPPED
[INFO] Apache Sling RepoInit Reactor ...................... SKIPPED
[INFO] Apache Sling Test Tools ............................ SKIPPED
[INFO] Apache Sling Testing Clients ....................... SKIPPED
[INFO] Apache Sling Testing Hamcrest ...................... SKIPPED
[INFO] Apache Sling Server Setup Tools .................... SKIPPED
[INFO] Apache Sling Testing Rules ......................... SKIPPED
[INFO] Apache Sling JUnit Scriptable Tests Provider ....... SKIPPED
[INFO] Apache Sling JUnit Health Checks ................... SKIPPED
[INFO] Apache Sling JUnit Remote Tests Runners ............ SKIPPED
[INFO] Apache Sling JUnit Performance ..................... SKIPPED
[INFO] Apache Sling Testing Mock Log Configuration ........ SKIPPED
[INFO] Apache Sling Testing Resource Resolver Mock ........ SKIPPED
[INFO] Apache Sling Testing JCR Mock ...................... SKIPPED
[INFO] Apache Sling Testing OSGi Mock ..................... SKIPPED
[INFO] Apache Sling Testing Sling Mock .................... SKIPPED
[INFO] Apache Sling Testing Sling Mock Oak-based Resource Resolver SKIPPED
[INFO] Apache Sling Testing Mocks Modules Reactor ......... SKIPPED
[INFO] Apache Sling Testing - sample bundle with integration tests SKIPPED
[INFO] Apache Sling Testing - sample module with integration tests SKIPPED
[INFO] Apache Sling Testing PaxExam ....................... SKIPPED
[INFO] Apache Sling Testing Modules Reactor ............... SKIPPED
[INFO] Apache Sling Installer ............................. SKIPPED
[INFO] Apache Sling File Installer ........................ SKIPPED
[INFO] Apache Sling Installer Configuration Admin Support . SKIPPED
[INFO] Apache Sling Deployment Package Installer .......... SKIPPED
[INFO] Apache Sling Subsystems Installer .................. SKIPPED
[INFO] Apache Sling Installer Health Checks ............... SKIPPED
[INFO] Apache Sling Installer Integration Tests ........... SKIPPED
[INFO] Apache Sling Launchpad API ......................... SKIPPED
[INFO] Apache Sling Launchpad Installer ................... SKIPPED
[INFO] Apache Sling Launchpad Content ..................... SKIPPED
[INFO] Apache Sling Validation Framework API .............. SKIPPED
[INFO] Apache Sling Validation Framework Core Implementation SKIPPED
[INFO] Apache Sling Validation Framework Testing Services . SKIPPED
[INFO] Apache Sling Validation Framework Integration Tests SKIPPED
[INFO] Apache Sling Validation Framework Examples ......... SKIPPED
[INFO] Apache Sling Validation Framework Builder .......... SKIPPED
[INFO] Apache Sling Models Validation Implementation ...... SKIPPED
[INFO] Apache Sling Launchpad Testing Services ............ SKIPPED
[INFO] Apache Sling Launchpad Testing Services WAR ........ SKIPPED
[INFO] Apache Sling Launchpad Testing Fragment Bundle ..... SKIPPED
[INFO] Apache Sling Launchpad Test Bundles ................ SKIPPED
[INFO] Apache Sling Integration Tests ..................... SKIPPED
[INFO] Apache Sling Launchpad Testing ..................... SKIPPED
[INFO] Apache Sling (Builder) ............................. SKIPPED
[INFO] ------------------------------------------------------------------------
[INFO] BUILD FAILURE
[INFO] ------------------------------------------------------------------------
[INFO] Total time: 59:42 min
[INFO] Finished at: 2016-08-22T07:42:47+00:00
[INFO] Final Memory: 284M/451M
[INFO] ------------------------------------------------------------------------
Waiting for Jenkins to finish collecting data
[ERROR] Failed to execute goal org.apache.maven.plugins:maven-failsafe-plugin:2.19.1:integration-test (default) on project org.apache.sling.i18n: Execution default of goal org.apache.maven.plugins:maven-failsafe-plugin:2.19.1:integration-test failed: The forked VM terminated without properly saying goodbye. VM crash or System.exit called?
[ERROR] Command was /bin/sh -c cd <https://builds.apache.org/job/sling-trunk-1.8/ws/trunk/bundles/extensions/i18n> && /usr/local/asfpackages/java/jdk1.8.0_102/jre/bin/java -jar <https://builds.apache.org/job/sling-trunk-1.8/ws/trunk/bundles/extensions/i18n/target/surefire/surefirebooter1126278424491496389.jar> <https://builds.apache.org/job/sling-trunk-1.8/ws/trunk/bundles/extensions/i18n/target/surefire/surefire102929244342933771tmp> <https://builds.apache.org/job/sling-trunk-1.8/ws/trunk/bundles/extensions/i18n/target/surefire/surefire_15949547011991483391tmp>
[ERROR] -> [Help 1]
[ERROR]
[ERROR] To see the full stack trace of the errors, re-run Maven with the -e switch.
[ERROR] Re-run Maven using the -X switch to enable full debug logging.
[ERROR]
[ERROR] For more information about the errors and possible solutions, please read the following articles:
[ERROR] [Help 1] http://cwiki.apache.org/confluence/display/MAVEN/PluginExecutionException
[ERROR]
[ERROR] After correcting the problems, you can resume the build with the command
[ERROR] mvn <goals> -rf :org.apache.sling.i18n
channel stopped
Found 18 test results
Found 95 test results
Found 45 test results
Found 8 test results
Found 4 test results
Found 2 test results
Found 17 test results
Found 4 test results
Found 94 test results
Found 44 test results
Found 10 test results
Found 21 test results
Found 9 test results
Found 36 test results
Found 42 test results
Found 22 test results
Found 10 test results
Found 31 test results
Found 83 test results
Found failed test junit/org.apache.sling.discovery.commons/TestInitDelayingTopologyEventListener
Found failed test junit/org.apache.sling.discovery.commons/TestInitDelayingTopologyEventListener/testProperties
Found 50 test results
Found 30 test results
Found 5 test results
Found 95 test results
Found 77 test results
Found 4 test results
Found 94 test results
Found 3 test results
Found 8 test results
Found 2 test results
Found 13 test results
Found 27 test results
Found 3 test results
Found 38 test results
Found 9 test results
Found 96 test results
Found 8 test results
Found 17 test results
Found 45 test results
Found 34 test results
Found 9 test results
Found 94 test results
Found 3 test results
Found 75 test results
Found 184 test results
Found 16 test results
Found 10 test results
Found 49 test results
Found 35 test results
Found 21 test results
Found 210 test results
Found 24 test results
Found 81 test results
Found 27 test results
Found 24 test results
Found 13 test results
Found 2 test results
Found 393 test results
Found failed test junit/io.sightly.tck.tests/TestBuilder$1
Found failed test junit/io.sightly.tck.tests/TestBuilder$1/Block_Statements__data_sly_test____false
Found 17 test results
Found 28 test results
Found 44 test results
Found 92 test results
Found 18 test results
Found 2 test results
Jenkins build is still unstable: sling-trunk-1.8 #3864
Posted by Apache Jenkins Server <je...@builds.apache.org>.
See <https://builds.apache.org/job/sling-trunk-1.8/changes>
Jenkins build is still unstable: sling-trunk-1.8 #3863
Posted by Apache Jenkins Server <je...@builds.apache.org>.
See <https://builds.apache.org/job/sling-trunk-1.8/changes>
Jenkins build is still unstable: sling-trunk-1.8 #3862
Posted by Apache Jenkins Server <je...@builds.apache.org>.
See <https://builds.apache.org/job/sling-trunk-1.8/changes>
Jenkins build is still unstable: sling-trunk-1.8 #3861
Posted by Apache Jenkins Server <je...@builds.apache.org>.
See <https://builds.apache.org/job/sling-trunk-1.8/changes>
Jenkins build is still unstable: sling-trunk-1.8 #3860
Posted by Apache Jenkins Server <je...@builds.apache.org>.
See <https://builds.apache.org/job/sling-trunk-1.8/changes>
Jenkins build is still unstable: sling-trunk-1.8 #3859
Posted by Apache Jenkins Server <je...@builds.apache.org>.
See <https://builds.apache.org/job/sling-trunk-1.8/3859/>
Jenkins build is still unstable: sling-trunk-1.8 #3858
Posted by Apache Jenkins Server <je...@builds.apache.org>.
See <https://builds.apache.org/job/sling-trunk-1.8/changes>
Jenkins build is unstable: sling-trunk-1.8 #3857
Posted by Apache Jenkins Server <je...@builds.apache.org>.
See <https://builds.apache.org/job/sling-trunk-1.8/3857/changes>
Build failed in Jenkins: sling-trunk-1.8 #3856
Posted by Apache Jenkins Server <je...@builds.apache.org>.
See <https://builds.apache.org/job/sling-trunk-1.8/3856/changes>
Changes:
[radu] SLING-6010 - Correctly include LICENSE and NOTICE files in both source and binary jars
------------------------------------------
[...truncated 179785 lines...]
[JENKINS] Archiving disabled
[JENKINS] Archiving disabled
[JENKINS] Archiving disabled
[JENKINS] Archiving disabled
[JENKINS] Archiving disabled
[JENKINS] Archiving disabled
[JENKINS] Archiving disabled
[JENKINS] Archiving disabled[INFO] ------------------------------------------------------------------------
[INFO] Reactor Summary:
[INFO]
[INFO] Apache Sling JAR Resource Bundle ................... SUCCESS [ 5.308 s]
[INFO] Apache Sling (Parent) .............................. SUCCESS [ 9.564 s]
[INFO] Apache Sling Tooling Support Install ............... SUCCESS [ 26.389 s]
[INFO] Apache Sling Provisioning Model .................... SUCCESS [ 12.024 s]
[INFO] Apache Sling Tooling Support Source ................ SUCCESS [ 4.311 s]
[INFO] Apache Sling Testing Utilities ..................... SUCCESS [ 38.100 s]
[INFO] Apache Sling API ................................... SUCCESS [ 7.905 s]
[INFO] Apache Sling Resource Resolver ..................... SUCCESS [ 8.383 s]
[INFO] Apache Sling System Bundle Extension: Java Transaction API SUCCESS [ 3.286 s]
[INFO] Apache Sling System Bundle Extension: XML APIs ..... SUCCESS [ 2.338 s]
[INFO] Apache Sling System Bundle Extension: Activation API SUCCESS [ 2.485 s]
[INFO] Apache Sling System Bundle Extension: WS APIs ...... SUCCESS [ 3.303 s]
[INFO] Apache Sling Dynamic Class Loader Support .......... SUCCESS [ 11.934 s]
[INFO] Apache Sling Commons FileSystem ClassLoader ........ SUCCESS [ 5.917 s]
[INFO] Apache Sling Commons Java Compiler ................. SUCCESS [ 4.639 s]
[INFO] Apache Sling JSON Library .......................... SUCCESS [ 6.833 s]
[INFO] Apache Sling SLF4J Implementation (Logback) ........ SUCCESS [ 38.175 s]
[INFO] Apache Sling OSGi LogService Implementation ........ SUCCESS [ 3.238 s]
[INFO] Apache Sling MIME type mapping support ............. SUCCESS [ 3.590 s]
[INFO] Apache Sling Content Detection Support ............. SUCCESS [01:04 min]
[INFO] Apache Sling Commons OSGi support .................. SUCCESS [ 5.634 s]
[INFO] Apache Sling Scheduler Support ..................... SUCCESS [ 5.359 s]
[INFO] Apache Sling Thread Dumper ......................... SUCCESS [ 2.398 s]
[INFO] Apache Sling Thread Support ........................ SUCCESS [ 4.420 s]
[INFO] Apache Sling Metrics ............................... SUCCESS [ 5.975 s]
[INFO] Apache Sling Authentication Service ................ SUCCESS [ 5.220 s]
[INFO] Apache Sling Form Based Authentication Handler ..... SUCCESS [ 10.145 s]
[INFO] Apache Sling Engine Implementation ................. SUCCESS [ 13.256 s]
[INFO] Apache Sling Repository API Bundle ................. SUCCESS [ 2.506 s]
[INFO] Apache Sling JCR Base Bundle ....................... SUCCESS [ 6.622 s]
[INFO] Apache Sling Pax Exam Utilities .................... SUCCESS [ 56.787 s]
[INFO] Apache Sling Initial Content Loader ................ SUCCESS [01:41 min]
[INFO] Apache Sling Jackrabbit Embedded Repository ........ SUCCESS [ 9.412 s]
[INFO] Apache Sling Jackrabbit UserManager Support ........ SUCCESS [ 4.188 s]
[INFO] Apache Sling Jackrabbit JSR-283 Access Control Manager Support SUCCESS [ 4.760 s]
[INFO] Apache Sling Wrapper Bundle for the JCR API ........ SUCCESS [ 3.414 s]
[INFO] Apache Sling JCR Resource Resolver ................. SUCCESS [01:44 min]
[INFO] Apache Sling Versioning Integration Tests .......... SUCCESS [ 27.979 s]
[INFO] Apache Sling JCR Repository Registration ........... SUCCESS [ 4.438 s]
[INFO] Apache Sling Simple WebDAV Access to repositories .. SUCCESS [ 3.679 s]
[INFO] Apache Sling DavEx Access to repositories .......... SUCCESS [ 4.028 s]
[INFO] Apache Sling JCR WebConsole Bundle ................. SUCCESS [ 3.100 s]
[INFO] Apache Sling JCR Oak Repository Server ............. SUCCESS [ 22.828 s]
[INFO] Apache Sling SlingRepository Integration Tests ..... SUCCESS [ 50.898 s]
[INFO] Apache Sling RepoInit Parser ....................... SUCCESS [ 5.248 s]
[INFO] Apache Sling RepoInit JCR module ................... SUCCESS [ 13.262 s]
[INFO] Apache Sling Servlet Resolver ...................... SUCCESS [ 4.462 s]
[INFO] Apache Sling Default GET Servlets .................. SUCCESS [ 5.209 s]
[INFO] Apache Sling Default POST Servlets ................. SUCCESS [ 4.765 s]
[INFO] Apache Sling Compat Servlets ....................... SUCCESS [ 2.757 s]
[INFO] Apache Sling Scripting Implementation API .......... SUCCESS [ 2.351 s]
[INFO] Apache Sling Scripting Core implementation ......... SUCCESS [ 19.988 s]
[INFO] Apache Sling Scripting JavaScript Support .......... SUCCESS [ 36.781 s]
[INFO] Apache Sling Scripting JSP Support ................. SUCCESS [ 6.652 s]
[INFO] Apache Sling JSP Tag Library ....................... SUCCESS [ 21.619 s]
[INFO] Apache Sling JSP Standard Tag Library .............. SUCCESS [ 3.149 s]
[INFO] Apache Sling Scripting Sightly Compiler ............ SUCCESS [ 20.717 s]
[INFO] Apache Sling Scripting Sightly Java Compiler ....... SUCCESS [ 10.955 s]
[INFO] Apache Sling Scripting Sightly Engine .............. SUCCESS [ 12.397 s]
[INFO] Apache Sling Scripting Sightly JavaScript Use Provider SUCCESS [ 3.446 s]
[INFO] Apache Sling Scripting Sightly Models Use Provider . SUCCESS [ 2.462 s]
[INFO] Apache Sling Scripting Sightly Read-Eval-Print Loop Environment SUCCESS [ 2.559 s]
[INFO] Apache Sling Scripting Sightly Integration Tests Content SUCCESS [ 4.439 s]
[INFO] Apache Sling Launchpad Base ........................ SUCCESS [ 15.221 s]
[INFO] Apache Sling Subsystems Base Installer ............. SUCCESS [ 3.147 s]
[INFO] Apache Sling Filesystem Resource Provider .......... SUCCESS [ 2.843 s]
[INFO] Apache Sling Installer WebConsole Plugin ........... SUCCESS [ 4.545 s]
[INFO] Apache Sling JCR Installer ......................... SUCCESS [02:22 min]
[INFO] Apache Sling Launchpad Application Builder ......... SUCCESS [ 42.065 s]
[INFO] Apache Sling Scripting Sightly Integration Tests ... SUCCESS [02:07 min]
[INFO] Apache Sling Scripting Sightly Reactor ............. SUCCESS [ 1.423 s]
[INFO] Apache Sling Adapter Manager Implementation ........ SUCCESS [ 3.614 s]
[INFO] Apache Sling Bundle Resource Provider .............. SUCCESS [ 2.483 s]
[INFO] Apache Sling Distributed Event Admin ............... SUCCESS [ 4.366 s]
[INFO] Apache Sling Discovery API ......................... SUCCESS [ 2.545 s]
[INFO] Apache Sling Discovery Commons ..................... SUCCESS [01:08 min]
[INFO] Apache Sling Discovery Base ........................ SUCCESS [01:15 min]
[INFO] Apache Sling Resource-Based Discovery Service ...... SUCCESS [03:49 min]
[INFO] Apache Sling Oak-Based Discovery Service ........... SUCCESS [02:30 min]
[INFO] Apache Sling Discovery Support Bundle .............. SUCCESS [ 2.721 s]
[INFO] Apache Sling Discovery Standalone Implementation ... SUCCESS [ 3.140 s]
[INFO] Apache Sling Event Support ......................... SUCCESS [13:25 min]
[INFO] Apache Sling Feature Flags ......................... SUCCESS [ 4.358 s]
[INFO] Apache Sling javax.activation bundle ............... SUCCESS [ 2.965 s]
[INFO] Apache Sling Service User Mapper ................... SUCCESS [ 3.843 s]
[INFO] Apache Sling Settings .............................. SUCCESS [ 3.482 s]
[INFO] Apache Sling Web Console Branding .................. SUCCESS [ 2.178 s]
[INFO] Apache Sling Web Console Security Provider ......... SUCCESS [ 2.483 s]
[INFO] Apache Sling Explorer .............................. SUCCESS [ 2.836 s]
[INFO] Apache Sling Health Check Core ..................... SUCCESS [01:45 min]
[INFO] Apache Sling Health Check Samples .................. SUCCESS [ 5.625 s]
[INFO] Apache Sling Health Check Support Components ....... SUCCESS [ 7.179 s]
[INFO] Apache Sling Health Check Webconsole Plugin ........ SUCCESS [ 3.079 s]
[INFO] Apache Sling Health Check JUnit Bridge ............. SUCCESS [ 5.240 s]
[INFO] Apache Sling Health Check Annotations .............. SUCCESS [ 2.338 s]
[INFO] Apache Sling Health Check Integration Tests ........ SUCCESS [ 7.022 s]
[INFO] Apache Sling Health Check Reactor POM .............. SUCCESS [ 2.502 s]
[INFO] Apache Sling Resource Access Security .............. SUCCESS [ 3.800 s]
[INFO] Apache Sling Resource Access Security Integration Tests SUCCESS [ 45.923 s]
[INFO] Apache Sling Models API ............................ SUCCESS [ 4.105 s]
[INFO] Apache Sling Models Implementation ................. SUCCESS [ 7.179 s]
[INFO] Apache Sling Models Integration Tests .............. SUCCESS [ 54.186 s]
[INFO] Apache Sling Internationalization Support .......... FAILURE [01:17 min]
[INFO] Apache Sling XSS Protection Bundle ................. SKIPPED
[INFO] Apache Sling JUnit Core ............................ SKIPPED
[INFO] Apache Sling JUnit Tests Teleporter ................ SKIPPED
[INFO] Apache Sling Resource Builder ...................... SKIPPED
[INFO] Apache Sling Servlet Helpers ....................... SKIPPED
[INFO] Apache Sling RepoInit Integration Tests ............ SKIPPED
[INFO] Apache Sling RepoInit Reactor ...................... SKIPPED
[INFO] Apache Sling Test Tools ............................ SKIPPED
[INFO] Apache Sling Testing Clients ....................... SKIPPED
[INFO] Apache Sling Testing Hamcrest ...................... SKIPPED
[INFO] Apache Sling Server Setup Tools .................... SKIPPED
[INFO] Apache Sling Testing Rules ......................... SKIPPED
[INFO] Apache Sling JUnit Scriptable Tests Provider ....... SKIPPED
[INFO] Apache Sling JUnit Health Checks ................... SKIPPED
[INFO] Apache Sling JUnit Remote Tests Runners ............ SKIPPED
[INFO] Apache Sling JUnit Performance ..................... SKIPPED
[INFO] Apache Sling Testing Mock Log Configuration ........ SKIPPED
[INFO] Apache Sling Testing Resource Resolver Mock ........ SKIPPED
[INFO] Apache Sling Testing JCR Mock ...................... SKIPPED
[INFO] Apache Sling Testing OSGi Mock ..................... SKIPPED
[INFO] Apache Sling Testing Sling Mock .................... SKIPPED
[INFO] Apache Sling Testing Sling Mock Oak-based Resource Resolver SKIPPED
[INFO] Apache Sling Testing Mocks Modules Reactor ......... SKIPPED
[INFO] Apache Sling Testing - sample bundle with integration tests SKIPPED
[INFO] Apache Sling Testing - sample module with integration tests SKIPPED
[INFO] Apache Sling Testing PaxExam ....................... SKIPPED
[INFO] Apache Sling Testing Modules Reactor ............... SKIPPED
[INFO] Apache Sling Installer ............................. SKIPPED
[INFO] Apache Sling File Installer ........................ SKIPPED
[INFO] Apache Sling Installer Configuration Admin Support . SKIPPED
[INFO] Apache Sling Deployment Package Installer .......... SKIPPED
[INFO] Apache Sling Subsystems Installer .................. SKIPPED
[INFO] Apache Sling Installer Health Checks ............... SKIPPED
[INFO] Apache Sling Installer Integration Tests ........... SKIPPED
[INFO] Apache Sling Launchpad API ......................... SKIPPED
[INFO] Apache Sling Launchpad Installer ................... SKIPPED
[INFO] Apache Sling Launchpad Content ..................... SKIPPED
[INFO] Apache Sling Validation Framework API .............. SKIPPED
[INFO] Apache Sling Validation Framework Core Implementation SKIPPED
[INFO] Apache Sling Validation Framework Testing Services . SKIPPED
[INFO] Apache Sling Validation Framework Integration Tests SKIPPED
[INFO] Apache Sling Validation Framework Examples ......... SKIPPED
[INFO] Apache Sling Validation Framework Builder .......... SKIPPED
[INFO] Apache Sling Models Validation Implementation ...... SKIPPED
[INFO] Apache Sling Launchpad Testing Services ............ SKIPPED
[INFO] Apache Sling Launchpad Testing Services WAR ........ SKIPPED
[INFO] Apache Sling Launchpad Testing Fragment Bundle ..... SKIPPED
[INFO] Apache Sling Launchpad Test Bundles ................ SKIPPED
[INFO] Apache Sling Integration Tests ..................... SKIPPED
[INFO] Apache Sling Launchpad Testing ..................... SKIPPED
[INFO] Apache Sling (Builder) ............................. SKIPPED
[INFO] ------------------------------------------------------------------------
[INFO] BUILD FAILURE
[INFO] ------------------------------------------------------------------------
[INFO] Total time: 51:53 min
[INFO] Finished at: 2016-08-25T16:38:06+00:00
[INFO] Final Memory: 283M/469M
[INFO] ------------------------------------------------------------------------
Waiting for Jenkins to finish collecting data
[ERROR] Failed to execute goal org.apache.maven.plugins:maven-failsafe-plugin:2.19.1:integration-test (default) on project org.apache.sling.i18n: Execution default of goal org.apache.maven.plugins:maven-failsafe-plugin:2.19.1:integration-test failed: The forked VM terminated without properly saying goodbye. VM crash or System.exit called?
[ERROR] Command was /bin/sh -c cd <https://builds.apache.org/job/sling-trunk-1.8/ws/trunk/bundles/extensions/i18n> && /usr/local/asfpackages/java/jdk1.8.0_102/jre/bin/java -jar <https://builds.apache.org/job/sling-trunk-1.8/ws/trunk/bundles/extensions/i18n/target/surefire/surefirebooter1460409555222421628.jar> <https://builds.apache.org/job/sling-trunk-1.8/ws/trunk/bundles/extensions/i18n/target/surefire/surefire7990473146986328664tmp> <https://builds.apache.org/job/sling-trunk-1.8/ws/trunk/bundles/extensions/i18n/target/surefire/surefire_16140074462195819978tmp>
[ERROR] -> [Help 1]
[ERROR]
[ERROR] To see the full stack trace of the errors, re-run Maven with the -e switch.
[ERROR] Re-run Maven using the -X switch to enable full debug logging.
[ERROR]
[ERROR] For more information about the errors and possible solutions, please read the following articles:
[ERROR] [Help 1] http://cwiki.apache.org/confluence/display/MAVEN/PluginExecutionException
[ERROR]
[ERROR] After correcting the problems, you can resume the build with the command
[ERROR] mvn <goals> -rf :org.apache.sling.i18n
channel stopped
Found 18 test results
Found 95 test results
Found 41 test results
Found 8 test results
Found 4 test results
Found 2 test results
Found 17 test results
Found 4 test results
Found 94 test results
Found 44 test results
Found 10 test results
Found 21 test results
Found 9 test results
Found 36 test results
Found 42 test results
Found 22 test results
Found 10 test results
Found 31 test results
Found 83 test results
Found 50 test results
Found 30 test results
Found 5 test results
Found 95 test results
Found 77 test results
Found 4 test results
Found 94 test results
Found 3 test results
Found 8 test results
Found 2 test results
Found 13 test results
Found 27 test results
Found 3 test results
Found 38 test results
Found 9 test results
Found 96 test results
Found 8 test results
Found 17 test results
Found 45 test results
Found 34 test results
Found 9 test results
Found 94 test results
Found 3 test results
Found 75 test results
Found 184 test results
Found 16 test results
Found 10 test results
Found 49 test results
Found 35 test results
Found 21 test results
Found 210 test results
Found 24 test results
Found 81 test results
Found 27 test results
Found 24 test results
Found 13 test results
Found 2 test results
Found 394 test results
Found 17 test results
Found 28 test results
Found 44 test results
Found 92 test results
Found 18 test results
Found 2 test results
Jenkins build is still unstable: sling-trunk-1.8 #3855
Posted by Apache Jenkins Server <je...@builds.apache.org>.
See <https://builds.apache.org/job/sling-trunk-1.8/changes>
Jenkins build is still unstable: sling-trunk-1.8 #3854
Posted by Apache Jenkins Server <je...@builds.apache.org>.
See <https://builds.apache.org/job/sling-trunk-1.8/changes>
Jenkins build is still unstable: sling-trunk-1.8 #3853
Posted by Apache Jenkins Server <je...@builds.apache.org>.
See <https://builds.apache.org/job/sling-trunk-1.8/changes>
Jenkins build is still unstable: sling-trunk-1.8 #3852
Posted by Apache Jenkins Server <je...@builds.apache.org>.
See <https://builds.apache.org/job/sling-trunk-1.8/changes>
Jenkins build is unstable: sling-trunk-1.8 #3851
Posted by Apache Jenkins Server <je...@builds.apache.org>.
See <https://builds.apache.org/job/sling-trunk-1.8/3851/>
Build failed in Jenkins: sling-trunk-1.8 #3850
Posted by Apache Jenkins Server <je...@builds.apache.org>.
See <https://builds.apache.org/job/sling-trunk-1.8/3850/>
------------------------------------------
[...truncated 134289 lines...]
[JENKINS] Archiving disabled
[JENKINS] Archiving disabled
[JENKINS] Archiving disabled
[JENKINS] Archiving disabled
[JENKINS] Archiving disabled
[JENKINS] Archiving disabled[INFO] ------------------------------------------------------------------------
[INFO] Reactor Summary:
[INFO]
[INFO] Apache Sling JAR Resource Bundle ................... SUCCESS [ 5.120 s]
[INFO] Apache Sling (Parent) .............................. SUCCESS [ 10.622 s]
[INFO] Apache Sling Tooling Support Install ............... SUCCESS [ 12.527 s]
[INFO] Apache Sling Provisioning Model .................... SUCCESS [ 16.767 s]
[INFO] Apache Sling Tooling Support Source ................ SUCCESS [ 6.422 s]
[INFO] Apache Sling Testing Utilities ..................... SUCCESS [ 24.783 s]
[INFO] Apache Sling API ................................... SUCCESS [ 13.467 s]
[INFO] Apache Sling Resource Resolver ..................... SUCCESS [ 16.200 s]
[INFO] Apache Sling System Bundle Extension: Java Transaction API SUCCESS [ 5.152 s]
[INFO] Apache Sling System Bundle Extension: XML APIs ..... SUCCESS [ 2.728 s]
[INFO] Apache Sling System Bundle Extension: Activation API SUCCESS [ 2.895 s]
[INFO] Apache Sling System Bundle Extension: WS APIs ...... SUCCESS [ 2.694 s]
[INFO] Apache Sling Dynamic Class Loader Support .......... SUCCESS [ 16.400 s]
[INFO] Apache Sling Commons FileSystem ClassLoader ........ SUCCESS [ 6.335 s]
[INFO] Apache Sling Commons Java Compiler ................. SUCCESS [ 5.873 s]
[INFO] Apache Sling JSON Library .......................... SUCCESS [ 16.221 s]
[INFO] Apache Sling SLF4J Implementation (Logback) ........ SUCCESS [01:04 min]
[INFO] Apache Sling OSGi LogService Implementation ........ SUCCESS [ 4.596 s]
[INFO] Apache Sling MIME type mapping support ............. SUCCESS [ 5.808 s]
[INFO] Apache Sling Content Detection Support ............. SUCCESS [01:00 min]
[INFO] Apache Sling Commons OSGi support .................. SUCCESS [ 7.390 s]
[INFO] Apache Sling Scheduler Support ..................... SUCCESS [ 6.788 s]
[INFO] Apache Sling Thread Dumper ......................... SUCCESS [ 2.786 s]
[INFO] Apache Sling Thread Support ........................ SUCCESS [ 5.062 s]
[INFO] Apache Sling Metrics ............................... SUCCESS [ 8.102 s]
[INFO] Apache Sling Authentication Service ................ SUCCESS [ 6.350 s]
[INFO] Apache Sling Form Based Authentication Handler ..... SUCCESS [ 11.104 s]
[INFO] Apache Sling Engine Implementation ................. SUCCESS [ 21.990 s]
[INFO] Apache Sling Repository API Bundle ................. SUCCESS [ 2.783 s]
[INFO] Apache Sling JCR Base Bundle ....................... SUCCESS [ 6.563 s]
[INFO] Apache Sling Pax Exam Utilities .................... SUCCESS [ 53.033 s]
[INFO] Apache Sling Initial Content Loader ................ SUCCESS [01:44 min]
[INFO] Apache Sling Jackrabbit Embedded Repository ........ SUCCESS [ 15.341 s]
[INFO] Apache Sling Jackrabbit UserManager Support ........ SUCCESS [ 5.415 s]
[INFO] Apache Sling Jackrabbit JSR-283 Access Control Manager Support SUCCESS [ 3.974 s]
[INFO] Apache Sling Wrapper Bundle for the JCR API ........ SUCCESS [ 2.475 s]
[INFO] Apache Sling JCR Resource Resolver ................. SUCCESS [ 48.018 s]
[INFO] Apache Sling Versioning Integration Tests .......... SUCCESS [ 13.842 s]
[INFO] Apache Sling JCR Repository Registration ........... SUCCESS [ 5.149 s]
[INFO] Apache Sling Simple WebDAV Access to repositories .. SUCCESS [ 4.180 s]
[INFO] Apache Sling DavEx Access to repositories .......... SUCCESS [ 5.433 s]
[INFO] Apache Sling JCR WebConsole Bundle ................. SUCCESS [ 5.513 s]
[INFO] Apache Sling JCR Oak Repository Server ............. SUCCESS [ 37.684 s]
[INFO] Apache Sling SlingRepository Integration Tests ..... SUCCESS [01:52 min]
[INFO] Apache Sling RepoInit Parser ....................... SUCCESS [ 5.568 s]
[INFO] Apache Sling RepoInit JCR module ................... SUCCESS [ 26.683 s]
[INFO] Apache Sling Servlet Resolver ...................... SUCCESS [ 6.078 s]
[INFO] Apache Sling Default GET Servlets .................. SUCCESS [ 5.299 s]
[INFO] Apache Sling Default POST Servlets ................. SUCCESS [ 6.729 s]
[INFO] Apache Sling Compat Servlets ....................... SUCCESS [ 2.784 s]
[INFO] Apache Sling Scripting Implementation API .......... SUCCESS [ 2.582 s]
[INFO] Apache Sling Scripting Core implementation ......... SUCCESS [ 29.270 s]
[INFO] Apache Sling Scripting JavaScript Support .......... SUCCESS [ 34.809 s]
[INFO] Apache Sling Scripting JSP Support ................. SUCCESS [ 10.629 s]
[INFO] Apache Sling JSP Tag Library ....................... SUCCESS [ 7.952 s]
[INFO] Apache Sling JSP Standard Tag Library .............. SUCCESS [ 4.924 s]
[INFO] Apache Sling Scripting Sightly Compiler ............ SUCCESS [ 42.389 s]
[INFO] Apache Sling Scripting Sightly Java Compiler ....... SUCCESS [ 22.375 s]
[INFO] Apache Sling Scripting Sightly Engine .............. SUCCESS [ 24.332 s]
[INFO] Apache Sling Scripting Sightly JavaScript Use Provider SUCCESS [ 8.612 s]
[INFO] Apache Sling Scripting Sightly Models Use Provider . SUCCESS [ 3.244 s]
[INFO] Apache Sling Scripting Sightly Read-Eval-Print Loop Environment SUCCESS [ 3.265 s]
[INFO] Apache Sling Scripting Sightly Integration Tests Content SUCCESS [ 6.467 s]
[INFO] Apache Sling Launchpad Base ........................ SUCCESS [ 21.145 s]
[INFO] Apache Sling Subsystems Base Installer ............. SUCCESS [ 5.022 s]
[INFO] Apache Sling Filesystem Resource Provider .......... SUCCESS [ 3.510 s]
[INFO] Apache Sling Installer WebConsole Plugin ........... SUCCESS [ 2.759 s]
[INFO] Apache Sling JCR Installer ......................... SUCCESS [02:04 min]
[INFO] Apache Sling Launchpad Application Builder ......... SUCCESS [01:11 min]
[INFO] Apache Sling Scripting Sightly Integration Tests ... SUCCESS [03:08 min]
[INFO] Apache Sling Scripting Sightly Reactor ............. SUCCESS [ 2.231 s]
[INFO] Apache Sling Adapter Manager Implementation ........ SUCCESS [ 4.350 s]
[INFO] Apache Sling Bundle Resource Provider .............. SUCCESS [ 2.898 s]
[INFO] Apache Sling Distributed Event Admin ............... SUCCESS [ 4.038 s]
[INFO] Apache Sling Discovery API ......................... SUCCESS [ 2.799 s]
[INFO] Apache Sling Discovery Commons ..................... SUCCESS [ 49.815 s]
[INFO] Apache Sling Discovery Base ........................ SUCCESS [ 53.083 s]
[INFO] Apache Sling Resource-Based Discovery Service ...... SUCCESS [03:00 min]
[INFO] Apache Sling Oak-Based Discovery Service ........... SUCCESS [02:33 min]
[INFO] Apache Sling Discovery Support Bundle .............. SUCCESS [ 3.958 s]
[INFO] Apache Sling Discovery Standalone Implementation ... SUCCESS [ 3.421 s]
[INFO] Apache Sling Event Support ......................... SUCCESS [24:20 min]
[INFO] Apache Sling Feature Flags ......................... SUCCESS [ 3.192 s]
[INFO] Apache Sling javax.activation bundle ............... SUCCESS [ 3.023 s]
[INFO] Apache Sling Service User Mapper ................... SUCCESS [ 4.013 s]
[INFO] Apache Sling Settings .............................. SUCCESS [ 4.125 s]
[INFO] Apache Sling Web Console Branding .................. SUCCESS [ 2.702 s]
[INFO] Apache Sling Web Console Security Provider ......... SUCCESS [ 2.863 s]
[INFO] Apache Sling Explorer .............................. SUCCESS [ 2.650 s]
[INFO] Apache Sling Health Check Core ..................... SUCCESS [02:59 min]
[INFO] Apache Sling Health Check Samples .................. SUCCESS [ 5.007 s]
[INFO] Apache Sling Health Check Support Components ....... SUCCESS [ 4.002 s]
[INFO] Apache Sling Health Check Webconsole Plugin ........ SUCCESS [ 2.878 s]
[INFO] Apache Sling Health Check JUnit Bridge ............. SUCCESS [ 4.262 s]
[INFO] Apache Sling Health Check Annotations .............. SUCCESS [ 1.951 s]
[INFO] Apache Sling Health Check Integration Tests ........ SUCCESS [ 6.365 s]
[INFO] Apache Sling Health Check Reactor POM .............. SUCCESS [ 1.452 s]
[INFO] Apache Sling Resource Access Security .............. SUCCESS [ 4.885 s]
[INFO] Apache Sling Resource Access Security Integration Tests SUCCESS [ 34.241 s]
[INFO] Apache Sling Models API ............................ SUCCESS [ 3.229 s]
[INFO] Apache Sling Models Implementation ................. SUCCESS [ 7.803 s]
[INFO] Apache Sling Models Integration Tests .............. SUCCESS [ 42.797 s]
[INFO] Apache Sling Internationalization Support .......... FAILURE [ 42.070 s]
[INFO] Apache Sling XSS Protection Bundle ................. SKIPPED
[INFO] Apache Sling JUnit Core ............................ SKIPPED
[INFO] Apache Sling JUnit Tests Teleporter ................ SKIPPED
[INFO] Apache Sling Resource Builder ...................... SKIPPED
[INFO] Apache Sling Servlet Helpers ....................... SKIPPED
[INFO] Apache Sling RepoInit Integration Tests ............ SKIPPED
[INFO] Apache Sling RepoInit Reactor ...................... SKIPPED
[INFO] Apache Sling Test Tools ............................ SKIPPED
[INFO] Apache Sling Testing Clients ....................... SKIPPED
[INFO] Apache Sling Testing Hamcrest ...................... SKIPPED
[INFO] Apache Sling Server Setup Tools .................... SKIPPED
[INFO] Apache Sling Testing Rules ......................... SKIPPED
[INFO] Apache Sling JUnit Scriptable Tests Provider ....... SKIPPED
[INFO] Apache Sling JUnit Health Checks ................... SKIPPED
[INFO] Apache Sling JUnit Remote Tests Runners ............ SKIPPED
[INFO] Apache Sling JUnit Performance ..................... SKIPPED
[INFO] Apache Sling Testing Mock Log Configuration ........ SKIPPED
[INFO] Apache Sling Testing Resource Resolver Mock ........ SKIPPED
[INFO] Apache Sling Testing JCR Mock ...................... SKIPPED
[INFO] Apache Sling Testing OSGi Mock ..................... SKIPPED
[INFO] Apache Sling Testing Sling Mock .................... SKIPPED
[INFO] Apache Sling Testing Sling Mock Oak-based Resource Resolver SKIPPED
[INFO] Apache Sling Testing Mocks Modules Reactor ......... SKIPPED
[INFO] Apache Sling Testing - sample bundle with integration tests SKIPPED
[INFO] Apache Sling Testing - sample module with integration tests SKIPPED
[INFO] Apache Sling Testing PaxExam ....................... SKIPPED
[INFO] Apache Sling Testing Modules Reactor ............... SKIPPED
[INFO] Apache Sling Installer ............................. SKIPPED
[INFO] Apache Sling File Installer ........................ SKIPPED
[INFO] Apache Sling Installer Configuration Admin Support . SKIPPED
[INFO] Apache Sling Deployment Package Installer .......... SKIPPED
[INFO] Apache Sling Subsystems Installer .................. SKIPPED
[INFO] Apache Sling Installer Health Checks ............... SKIPPED
[INFO] Apache Sling Installer Integration Tests ........... SKIPPED
[INFO] Apache Sling Launchpad API ......................... SKIPPED
[INFO] Apache Sling Launchpad Installer ................... SKIPPED
[INFO] Apache Sling Launchpad Content ..................... SKIPPED
[INFO] Apache Sling Validation Framework API .............. SKIPPED
[INFO] Apache Sling Validation Framework Core Implementation SKIPPED
[INFO] Apache Sling Validation Framework Testing Services . SKIPPED
[INFO] Apache Sling Validation Framework Integration Tests SKIPPED
[INFO] Apache Sling Validation Framework Examples ......... SKIPPED
[INFO] Apache Sling Validation Framework Builder .......... SKIPPED
[INFO] Apache Sling Models Validation Implementation ...... SKIPPED
[INFO] Apache Sling Launchpad Testing Services ............ SKIPPED
[INFO] Apache Sling Launchpad Testing Services WAR ........ SKIPPED
[INFO] Apache Sling Launchpad Testing Fragment Bundle ..... SKIPPED
[INFO] Apache Sling Launchpad Test Bundles ................ SKIPPED
[INFO] Apache Sling Integration Tests ..................... SKIPPED
[INFO] Apache Sling Launchpad Testing ..................... SKIPPED
[INFO] Apache Sling (Builder) ............................. SKIPPED
[INFO] ------------------------------------------------------------------------
[INFO] BUILD FAILURE
[INFO] ------------------------------------------------------------------------
[INFO] Total time: 01:04 h
[INFO] Finished at: 2016-08-25T01:47:08+00:00
[INFO] Final Memory: 290M/473M
[INFO] ------------------------------------------------------------------------
Waiting for Jenkins to finish collecting data
[ERROR] Failed to execute goal org.apache.maven.plugins:maven-failsafe-plugin:2.19.1:integration-test (default) on project org.apache.sling.i18n: Execution default of goal org.apache.maven.plugins:maven-failsafe-plugin:2.19.1:integration-test failed: The forked VM terminated without properly saying goodbye. VM crash or System.exit called?
[ERROR] Command was /bin/sh -c cd <https://builds.apache.org/job/sling-trunk-1.8/ws/trunk/bundles/extensions/i18n> && /usr/local/asfpackages/java/jdk1.8.0_102/jre/bin/java -jar <https://builds.apache.org/job/sling-trunk-1.8/ws/trunk/bundles/extensions/i18n/target/surefire/surefirebooter8336179305993673202.jar> <https://builds.apache.org/job/sling-trunk-1.8/ws/trunk/bundles/extensions/i18n/target/surefire/surefire8699366887564959700tmp> <https://builds.apache.org/job/sling-trunk-1.8/ws/trunk/bundles/extensions/i18n/target/surefire/surefire_16706763439472868007tmp>
[ERROR] -> [Help 1]
[ERROR]
[ERROR] To see the full stack trace of the errors, re-run Maven with the -e switch.
[ERROR] Re-run Maven using the -X switch to enable full debug logging.
[ERROR]
[ERROR] For more information about the errors and possible solutions, please read the following articles:
[ERROR] [Help 1] http://cwiki.apache.org/confluence/display/MAVEN/PluginExecutionException
[ERROR]
[ERROR] After correcting the problems, you can resume the build with the command
[ERROR] mvn <goals> -rf :org.apache.sling.i18n
channel stopped
Found 18 test results
Found 95 test results
Found 41 test results
Found 8 test results
Found 4 test results
Found 2 test results
Found 17 test results
Found 4 test results
Found 94 test results
Found 44 test results
Found 10 test results
Found 21 test results
Found 9 test results
Found 36 test results
Found 42 test results
Found 22 test results
Found 10 test results
Found 31 test results
Found 83 test results
Found 50 test results
Found 30 test results
Found 5 test results
Found 95 test results
Found 77 test results
Found failed test junit/org.apache.sling.event.it/ChaosTest
Found failed test junit/org.apache.sling.event.it/ChaosTest/testDoChaos
Found 4 test results
Found 94 test results
Found 3 test results
Found 8 test results
Found 2 test results
Found 13 test results
Found 27 test results
Found 3 test results
Found 38 test results
Found 9 test results
Found 96 test results
Found 8 test results
Found 17 test results
Found 45 test results
Found 34 test results
Found 9 test results
Found 94 test results
Found 3 test results
Found 75 test results
Found 184 test results
Found 16 test results
Found 10 test results
Found 49 test results
Found 35 test results
Found 21 test results
Found 210 test results
Found 24 test results
Found 81 test results
Found 27 test results
Found 24 test results
Found 13 test results
Found 2 test results
Found 394 test results
Found 17 test results
Found 28 test results
Found 44 test results
Found 92 test results
Found 18 test results
Found 2 test results
Build failed in Jenkins: sling-trunk-1.8 #3849
Posted by Apache Jenkins Server <je...@builds.apache.org>.
See <https://builds.apache.org/job/sling-trunk-1.8/3849/>
------------------------------------------
[...truncated 137264 lines...]
[JENKINS] Archiving disabled
[JENKINS] Archiving disabled
[JENKINS] Archiving disabled
[JENKINS] Archiving disabled
[JENKINS] Archiving disabled
[JENKINS] Archiving disabled
[JENKINS] Archiving disabled
[JENKINS] Archiving disabled[INFO] ------------------------------------------------------------------------
[INFO] Reactor Summary:
[INFO]
[INFO] Apache Sling JAR Resource Bundle ................... SUCCESS [ 3.640 s]
[INFO] Apache Sling (Parent) .............................. SUCCESS [ 5.017 s]
[INFO] Apache Sling Tooling Support Install ............... SUCCESS [ 8.787 s]
[INFO] Apache Sling Provisioning Model .................... SUCCESS [ 15.663 s]
[INFO] Apache Sling Tooling Support Source ................ SUCCESS [ 3.213 s]
[INFO] Apache Sling Testing Utilities ..................... SUCCESS [01:29 min]
[INFO] Apache Sling API ................................... SUCCESS [ 8.779 s]
[INFO] Apache Sling Resource Resolver ..................... SUCCESS [ 10.044 s]
[INFO] Apache Sling System Bundle Extension: Java Transaction API SUCCESS [ 3.182 s]
[INFO] Apache Sling System Bundle Extension: XML APIs ..... SUCCESS [ 2.115 s]
[INFO] Apache Sling System Bundle Extension: Activation API SUCCESS [ 4.504 s]
[INFO] Apache Sling System Bundle Extension: WS APIs ...... SUCCESS [ 2.430 s]
[INFO] Apache Sling Dynamic Class Loader Support .......... SUCCESS [ 12.112 s]
[INFO] Apache Sling Commons FileSystem ClassLoader ........ SUCCESS [ 4.173 s]
[INFO] Apache Sling Commons Java Compiler ................. SUCCESS [ 4.380 s]
[INFO] Apache Sling JSON Library .......................... SUCCESS [ 7.414 s]
[INFO] Apache Sling SLF4J Implementation (Logback) ........ SUCCESS [ 58.325 s]
[INFO] Apache Sling OSGi LogService Implementation ........ SUCCESS [ 3.830 s]
[INFO] Apache Sling MIME type mapping support ............. SUCCESS [ 3.979 s]
[INFO] Apache Sling Content Detection Support ............. SUCCESS [02:31 min]
[INFO] Apache Sling Commons OSGi support .................. SUCCESS [ 5.333 s]
[INFO] Apache Sling Scheduler Support ..................... SUCCESS [ 4.980 s]
[INFO] Apache Sling Thread Dumper ......................... SUCCESS [ 3.926 s]
[INFO] Apache Sling Thread Support ........................ SUCCESS [ 4.573 s]
[INFO] Apache Sling Metrics ............................... SUCCESS [ 5.085 s]
[INFO] Apache Sling Authentication Service ................ SUCCESS [ 4.584 s]
[INFO] Apache Sling Form Based Authentication Handler ..... SUCCESS [ 24.225 s]
[INFO] Apache Sling Engine Implementation ................. SUCCESS [ 13.348 s]
[INFO] Apache Sling Repository API Bundle ................. SUCCESS [ 2.481 s]
[INFO] Apache Sling JCR Base Bundle ....................... SUCCESS [ 4.320 s]
[INFO] Apache Sling Pax Exam Utilities .................... SUCCESS [02:25 min]
[INFO] Apache Sling Initial Content Loader ................ SUCCESS [04:18 min]
[INFO] Apache Sling Jackrabbit Embedded Repository ........ SUCCESS [ 9.167 s]
[INFO] Apache Sling Jackrabbit UserManager Support ........ SUCCESS [ 3.732 s]
[INFO] Apache Sling Jackrabbit JSR-283 Access Control Manager Support SUCCESS [ 2.607 s]
[INFO] Apache Sling Wrapper Bundle for the JCR API ........ SUCCESS [ 2.192 s]
[INFO] Apache Sling JCR Resource Resolver ................. SUCCESS [02:05 min]
[INFO] Apache Sling Versioning Integration Tests .......... SUCCESS [01:29 min]
[INFO] Apache Sling JCR Repository Registration ........... SUCCESS [ 4.001 s]
[INFO] Apache Sling Simple WebDAV Access to repositories .. SUCCESS [ 3.533 s]
[INFO] Apache Sling DavEx Access to repositories .......... SUCCESS [ 4.483 s]
[INFO] Apache Sling JCR WebConsole Bundle ................. SUCCESS [ 2.363 s]
[INFO] Apache Sling JCR Oak Repository Server ............. SUCCESS [ 32.426 s]
[INFO] Apache Sling SlingRepository Integration Tests ..... SUCCESS [03:08 min]
[INFO] Apache Sling RepoInit Parser ....................... SUCCESS [ 5.280 s]
[INFO] Apache Sling RepoInit JCR module ................... SUCCESS [ 15.537 s]
[INFO] Apache Sling Servlet Resolver ...................... SUCCESS [ 4.706 s]
[INFO] Apache Sling Default GET Servlets .................. SUCCESS [ 4.389 s]
[INFO] Apache Sling Default POST Servlets ................. SUCCESS [ 5.271 s]
[INFO] Apache Sling Compat Servlets ....................... SUCCESS [ 2.765 s]
[INFO] Apache Sling Scripting Implementation API .......... SUCCESS [ 2.089 s]
[INFO] Apache Sling Scripting Core implementation ......... SUCCESS [ 46.731 s]
[INFO] Apache Sling Scripting JavaScript Support .......... SUCCESS [01:33 min]
[INFO] Apache Sling Scripting JSP Support ................. SUCCESS [ 8.105 s]
[INFO] Apache Sling JSP Tag Library ....................... SUCCESS [ 5.484 s]
[INFO] Apache Sling JSP Standard Tag Library .............. SUCCESS [ 2.399 s]
[INFO] Apache Sling Scripting Sightly Compiler ............ SUCCESS [ 20.353 s]
[INFO] Apache Sling Scripting Sightly Java Compiler ....... SUCCESS [ 11.329 s]
[INFO] Apache Sling Scripting Sightly Engine .............. SUCCESS [ 13.412 s]
[INFO] Apache Sling Scripting Sightly JavaScript Use Provider SUCCESS [ 2.913 s]
[INFO] Apache Sling Scripting Sightly Models Use Provider . SUCCESS [ 2.370 s]
[INFO] Apache Sling Scripting Sightly Read-Eval-Print Loop Environment SUCCESS [ 2.424 s]
[INFO] Apache Sling Scripting Sightly Integration Tests Content SUCCESS [ 6.881 s]
[INFO] Apache Sling Launchpad Base ........................ SUCCESS [ 21.843 s]
[INFO] Apache Sling Subsystems Base Installer ............. SUCCESS [ 3.711 s]
[INFO] Apache Sling Filesystem Resource Provider .......... SUCCESS [ 2.362 s]
[INFO] Apache Sling Installer WebConsole Plugin ........... SUCCESS [ 2.608 s]
[INFO] Apache Sling JCR Installer ......................... SUCCESS [03:32 min]
[INFO] Apache Sling Launchpad Application Builder ......... SUCCESS [01:18 min]
[INFO] Apache Sling Scripting Sightly Integration Tests ... SUCCESS [02:46 min]
[INFO] Apache Sling Scripting Sightly Reactor ............. SUCCESS [ 1.456 s]
[INFO] Apache Sling Adapter Manager Implementation ........ SUCCESS [ 3.470 s]
[INFO] Apache Sling Bundle Resource Provider .............. SUCCESS [ 2.964 s]
[INFO] Apache Sling Distributed Event Admin ............... SUCCESS [ 3.408 s]
[INFO] Apache Sling Discovery API ......................... SUCCESS [ 1.973 s]
[INFO] Apache Sling Discovery Commons ..................... SUCCESS [02:01 min]
[INFO] Apache Sling Discovery Base ........................ SUCCESS [04:09 min]
[INFO] Apache Sling Resource-Based Discovery Service ...... SUCCESS [07:53 min]
[INFO] Apache Sling Oak-Based Discovery Service ........... SUCCESS [02:32 min]
[INFO] Apache Sling Discovery Support Bundle .............. SUCCESS [ 2.275 s]
[INFO] Apache Sling Discovery Standalone Implementation ... SUCCESS [ 3.246 s]
[INFO] Apache Sling Event Support ......................... SUCCESS [29:26 min]
[INFO] Apache Sling Feature Flags ......................... SUCCESS [ 2.541 s]
[INFO] Apache Sling javax.activation bundle ............... SUCCESS [ 2.159 s]
[INFO] Apache Sling Service User Mapper ................... SUCCESS [ 3.743 s]
[INFO] Apache Sling Settings .............................. SUCCESS [ 3.818 s]
[INFO] Apache Sling Web Console Branding .................. SUCCESS [ 1.841 s]
[INFO] Apache Sling Web Console Security Provider ......... SUCCESS [ 2.623 s]
[INFO] Apache Sling Explorer .............................. SUCCESS [ 2.132 s]
[INFO] Apache Sling Health Check Core ..................... SUCCESS [03:53 min]
[INFO] Apache Sling Health Check Samples .................. SUCCESS [ 3.669 s]
[INFO] Apache Sling Health Check Support Components ....... SUCCESS [ 3.288 s]
[INFO] Apache Sling Health Check Webconsole Plugin ........ SUCCESS [ 2.058 s]
[INFO] Apache Sling Health Check JUnit Bridge ............. SUCCESS [ 3.258 s]
[INFO] Apache Sling Health Check Annotations .............. SUCCESS [ 1.924 s]
[INFO] Apache Sling Health Check Integration Tests ........ SUCCESS [ 12.199 s]
[INFO] Apache Sling Health Check Reactor POM .............. SUCCESS [ 1.275 s]
[INFO] Apache Sling Resource Access Security .............. SUCCESS [ 2.567 s]
[INFO] Apache Sling Resource Access Security Integration Tests SUCCESS [01:51 min]
[INFO] Apache Sling Models API ............................ SUCCESS [ 2.437 s]
[INFO] Apache Sling Models Implementation ................. SUCCESS [ 6.920 s]
[INFO] Apache Sling Models Integration Tests .............. SUCCESS [02:02 min]
[INFO] Apache Sling Internationalization Support .......... FAILURE [02:35 min]
[INFO] Apache Sling XSS Protection Bundle ................. SKIPPED
[INFO] Apache Sling JUnit Core ............................ SKIPPED
[INFO] Apache Sling JUnit Tests Teleporter ................ SKIPPED
[INFO] Apache Sling Resource Builder ...................... SKIPPED
[INFO] Apache Sling Servlet Helpers ....................... SKIPPED
[INFO] Apache Sling RepoInit Integration Tests ............ SKIPPED
[INFO] Apache Sling RepoInit Reactor ...................... SKIPPED
[INFO] Apache Sling Test Tools ............................ SKIPPED
[INFO] Apache Sling Testing Clients ....................... SKIPPED
[INFO] Apache Sling Testing Hamcrest ...................... SKIPPED
[INFO] Apache Sling Server Setup Tools .................... SKIPPED
[INFO] Apache Sling Testing Rules ......................... SKIPPED
[INFO] Apache Sling JUnit Scriptable Tests Provider ....... SKIPPED
[INFO] Apache Sling JUnit Health Checks ................... SKIPPED
[INFO] Apache Sling JUnit Remote Tests Runners ............ SKIPPED
[INFO] Apache Sling JUnit Performance ..................... SKIPPED
[INFO] Apache Sling Testing Mock Log Configuration ........ SKIPPED
[INFO] Apache Sling Testing Resource Resolver Mock ........ SKIPPED
[INFO] Apache Sling Testing JCR Mock ...................... SKIPPED
[INFO] Apache Sling Testing OSGi Mock ..................... SKIPPED
[INFO] Apache Sling Testing Sling Mock .................... SKIPPED
[INFO] Apache Sling Testing Sling Mock Oak-based Resource Resolver SKIPPED
[INFO] Apache Sling Testing Mocks Modules Reactor ......... SKIPPED
[INFO] Apache Sling Testing - sample bundle with integration tests SKIPPED
[INFO] Apache Sling Testing - sample module with integration tests SKIPPED
[INFO] Apache Sling Testing PaxExam ....................... SKIPPED
[INFO] Apache Sling Testing Modules Reactor ............... SKIPPED
[INFO] Apache Sling Installer ............................. SKIPPED
[INFO] Apache Sling File Installer ........................ SKIPPED
[INFO] Apache Sling Installer Configuration Admin Support . SKIPPED
[INFO] Apache Sling Deployment Package Installer .......... SKIPPED
[INFO] Apache Sling Subsystems Installer .................. SKIPPED
[INFO] Apache Sling Installer Health Checks ............... SKIPPED
[INFO] Apache Sling Installer Integration Tests ........... SKIPPED
[INFO] Apache Sling Launchpad API ......................... SKIPPED
[INFO] Apache Sling Launchpad Installer ................... SKIPPED
[INFO] Apache Sling Launchpad Content ..................... SKIPPED
[INFO] Apache Sling Validation Framework API .............. SKIPPED
[INFO] Apache Sling Validation Framework Core Implementation SKIPPED
[INFO] Apache Sling Validation Framework Testing Services . SKIPPED
[INFO] Apache Sling Validation Framework Integration Tests SKIPPED
[INFO] Apache Sling Validation Framework Examples ......... SKIPPED
[INFO] Apache Sling Validation Framework Builder .......... SKIPPED
[INFO] Apache Sling Models Validation Implementation ...... SKIPPED
[INFO] Apache Sling Launchpad Testing Services ............ SKIPPED
[INFO] Apache Sling Launchpad Testing Services WAR ........ SKIPPED
[INFO] Apache Sling Launchpad Testing Fragment Bundle ..... SKIPPED
[INFO] Apache Sling Launchpad Test Bundles ................ SKIPPED
[INFO] Apache Sling Integration Tests ..................... SKIPPED
[INFO] Apache Sling Launchpad Testing ..................... SKIPPED
[INFO] Apache Sling (Builder) ............................. SKIPPED
[INFO] ------------------------------------------------------------------------
[INFO] BUILD FAILURE
[INFO] ------------------------------------------------------------------------
[INFO] Total time: 01:34 h
[INFO] Finished at: 2016-08-24T20:18:30+00:00
[INFO] Final Memory: 281M/470M
[INFO] ------------------------------------------------------------------------
Waiting for Jenkins to finish collecting data
[ERROR] Failed to execute goal org.apache.maven.plugins:maven-failsafe-plugin:2.19.1:integration-test (default) on project org.apache.sling.i18n: Execution default of goal org.apache.maven.plugins:maven-failsafe-plugin:2.19.1:integration-test failed: The forked VM terminated without properly saying goodbye. VM crash or System.exit called?
[ERROR] Command was /bin/sh -c cd <https://builds.apache.org/job/sling-trunk-1.8/ws/trunk/bundles/extensions/i18n> && /usr/local/asfpackages/java/jdk1.8.0_102/jre/bin/java -jar <https://builds.apache.org/job/sling-trunk-1.8/ws/trunk/bundles/extensions/i18n/target/surefire/surefirebooter697416149157627253.jar> <https://builds.apache.org/job/sling-trunk-1.8/ws/trunk/bundles/extensions/i18n/target/surefire/surefire2134096393546764151tmp> <https://builds.apache.org/job/sling-trunk-1.8/ws/trunk/bundles/extensions/i18n/target/surefire/surefire_16804741162824871935tmp>
[ERROR] -> [Help 1]
[ERROR]
[ERROR] To see the full stack trace of the errors, re-run Maven with the -e switch.
[ERROR] Re-run Maven using the -X switch to enable full debug logging.
[ERROR]
[ERROR] For more information about the errors and possible solutions, please read the following articles:
[ERROR] [Help 1] http://cwiki.apache.org/confluence/display/MAVEN/PluginExecutionException
[ERROR]
[ERROR] After correcting the problems, you can resume the build with the command
[ERROR] mvn <goals> -rf :org.apache.sling.i18n
channel stopped
Found 18 test results
Found 95 test results
Found 41 test results
Found 8 test results
Found 4 test results
Found 2 test results
Found 17 test results
Found 4 test results
Found 94 test results
Found 44 test results
Found 10 test results
Found 21 test results
Found 9 test results
Found 36 test results
Found 42 test results
Found 22 test results
Found 10 test results
Found 31 test results
Found 83 test results
Found 50 test results
Found 30 test results
Found 5 test results
Found 95 test results
Found 77 test results
Found 4 test results
Found 94 test results
Found 3 test results
Found 8 test results
Found 2 test results
Found 13 test results
Found 27 test results
Found 3 test results
Found 38 test results
Found 9 test results
Found 96 test results
Found 8 test results
Found 17 test results
Found 45 test results
Found 34 test results
Found 9 test results
Found 94 test results
Found 3 test results
Found 75 test results
Found 184 test results
Found 16 test results
Found 10 test results
Found 49 test results
Found 35 test results
Found 21 test results
Found 210 test results
Found 24 test results
Found 81 test results
Found 27 test results
Found 24 test results
Found 13 test results
Found 2 test results
Found 394 test results
Found 17 test results
Found 28 test results
Found 44 test results
Found 92 test results
Found 18 test results
Found 2 test results
Jenkins build is still unstable: sling-trunk-1.8 #3848
Posted by Apache Jenkins Server <je...@builds.apache.org>.
See <https://builds.apache.org/job/sling-trunk-1.8/changes>
Jenkins build is still unstable: sling-trunk-1.8 #3847
Posted by Apache Jenkins Server <je...@builds.apache.org>.
See <https://builds.apache.org/job/sling-trunk-1.8/changes>
Jenkins build is unstable: sling-trunk-1.8 #3846
Posted by Apache Jenkins Server <je...@builds.apache.org>.
See <https://builds.apache.org/job/sling-trunk-1.8/3846/changes>
Build failed in Jenkins: sling-trunk-1.8 #3845
Posted by Apache Jenkins Server <je...@builds.apache.org>.
See <https://builds.apache.org/job/sling-trunk-1.8/3845/changes>
Changes:
[cziegeler] SLING-5993 : Improve auth requirement whiteboard implementation
[cziegeler] SLING-5795 : Reverting Allow for adding/removing individual AuthenticationRequirementHolder entries
------------------------------------------
[...truncated 136556 lines...]
[JENKINS] Archiving disabled
[JENKINS] Archiving disabled
[JENKINS] Archiving disabled
[JENKINS] Archiving disabled[INFO] ------------------------------------------------------------------------
[INFO] Reactor Summary:
[INFO]
[INFO] Apache Sling JAR Resource Bundle ................... SUCCESS [ 5.282 s]
[INFO] Apache Sling (Parent) .............................. SUCCESS [ 7.534 s]
[INFO] Apache Sling Tooling Support Install ............... SUCCESS [ 7.114 s]
[INFO] Apache Sling Provisioning Model .................... SUCCESS [ 18.601 s]
[INFO] Apache Sling Tooling Support Source ................ SUCCESS [ 3.952 s]
[INFO] Apache Sling Testing Utilities ..................... SUCCESS [01:47 min]
[INFO] Apache Sling API ................................... SUCCESS [ 10.565 s]
[INFO] Apache Sling Resource Resolver ..................... SUCCESS [ 11.616 s]
[INFO] Apache Sling System Bundle Extension: Java Transaction API SUCCESS [ 7.025 s]
[INFO] Apache Sling System Bundle Extension: XML APIs ..... SUCCESS [ 4.782 s]
[INFO] Apache Sling System Bundle Extension: Activation API SUCCESS [ 4.453 s]
[INFO] Apache Sling System Bundle Extension: WS APIs ...... SUCCESS [ 3.268 s]
[INFO] Apache Sling Dynamic Class Loader Support .......... SUCCESS [ 14.443 s]
[INFO] Apache Sling Commons FileSystem ClassLoader ........ SUCCESS [ 5.689 s]
[INFO] Apache Sling Commons Java Compiler ................. SUCCESS [ 8.562 s]
[INFO] Apache Sling JSON Library .......................... SUCCESS [ 10.809 s]
[INFO] Apache Sling SLF4J Implementation (Logback) ........ SUCCESS [01:03 min]
[INFO] Apache Sling OSGi LogService Implementation ........ SUCCESS [ 4.817 s]
[INFO] Apache Sling MIME type mapping support ............. SUCCESS [ 5.706 s]
[INFO] Apache Sling Content Detection Support ............. SUCCESS [03:04 min]
[INFO] Apache Sling Commons OSGi support .................. SUCCESS [ 11.151 s]
[INFO] Apache Sling Scheduler Support ..................... SUCCESS [ 10.429 s]
[INFO] Apache Sling Thread Dumper ......................... SUCCESS [ 6.340 s]
[INFO] Apache Sling Thread Support ........................ SUCCESS [ 10.296 s]
[INFO] Apache Sling Metrics ............................... SUCCESS [ 15.732 s]
[INFO] Apache Sling Authentication Service ................ SUCCESS [ 5.874 s]
[INFO] Apache Sling Form Based Authentication Handler ..... SUCCESS [ 8.897 s]
[INFO] Apache Sling Engine Implementation ................. SUCCESS [ 14.412 s]
[INFO] Apache Sling Repository API Bundle ................. SUCCESS [ 6.292 s]
[INFO] Apache Sling JCR Base Bundle ....................... SUCCESS [ 8.740 s]
[INFO] Apache Sling Pax Exam Utilities .................... SUCCESS [02:49 min]
[INFO] Apache Sling Initial Content Loader ................ SUCCESS [05:08 min]
[INFO] Apache Sling Jackrabbit Embedded Repository ........ SUCCESS [ 12.138 s]
[INFO] Apache Sling Jackrabbit UserManager Support ........ SUCCESS [ 7.737 s]
[INFO] Apache Sling Jackrabbit JSR-283 Access Control Manager Support SUCCESS [ 5.927 s]
[INFO] Apache Sling Wrapper Bundle for the JCR API ........ SUCCESS [ 4.453 s]
[INFO] Apache Sling JCR Resource Resolver ................. SUCCESS [02:40 min]
[INFO] Apache Sling Versioning Integration Tests .......... SUCCESS [01:48 min]
[INFO] Apache Sling JCR Repository Registration ........... SUCCESS [ 3.841 s]
[INFO] Apache Sling Simple WebDAV Access to repositories .. SUCCESS [ 3.213 s]
[INFO] Apache Sling DavEx Access to repositories .......... SUCCESS [ 4.104 s]
[INFO] Apache Sling JCR WebConsole Bundle ................. SUCCESS [ 2.390 s]
[INFO] Apache Sling JCR Oak Repository Server ............. SUCCESS [ 33.253 s]
[INFO] Apache Sling SlingRepository Integration Tests ..... SUCCESS [03:27 min]
[INFO] Apache Sling RepoInit Parser ....................... SUCCESS [ 4.735 s]
[INFO] Apache Sling RepoInit JCR module ................... SUCCESS [ 13.717 s]
[INFO] Apache Sling Servlet Resolver ...................... SUCCESS [ 4.818 s]
[INFO] Apache Sling Default GET Servlets .................. SUCCESS [ 4.613 s]
[INFO] Apache Sling Default POST Servlets ................. SUCCESS [ 6.218 s]
[INFO] Apache Sling Compat Servlets ....................... SUCCESS [ 2.398 s]
[INFO] Apache Sling Scripting Implementation API .......... SUCCESS [ 2.442 s]
[INFO] Apache Sling Scripting Core implementation ......... SUCCESS [ 46.914 s]
[INFO] Apache Sling Scripting JavaScript Support .......... SUCCESS [01:52 min]
[INFO] Apache Sling Scripting JSP Support ................. SUCCESS [ 7.957 s]
[INFO] Apache Sling JSP Tag Library ....................... SUCCESS [ 5.818 s]
[INFO] Apache Sling JSP Standard Tag Library .............. SUCCESS [ 2.602 s]
[INFO] Apache Sling Scripting Sightly Compiler ............ SUCCESS [ 18.766 s]
[INFO] Apache Sling Scripting Sightly Java Compiler ....... SUCCESS [ 12.060 s]
[INFO] Apache Sling Scripting Sightly Engine .............. SUCCESS [ 13.970 s]
[INFO] Apache Sling Scripting Sightly JavaScript Use Provider SUCCESS [ 3.457 s]
[INFO] Apache Sling Scripting Sightly Models Use Provider . SUCCESS [ 4.037 s]
[INFO] Apache Sling Scripting Sightly Read-Eval-Print Loop Environment SUCCESS [ 4.757 s]
[INFO] Apache Sling Scripting Sightly Integration Tests Content SUCCESS [ 5.656 s]
[INFO] Apache Sling Launchpad Base ........................ SUCCESS [ 18.124 s]
[INFO] Apache Sling Subsystems Base Installer ............. SUCCESS [ 3.657 s]
[INFO] Apache Sling Filesystem Resource Provider .......... SUCCESS [ 4.101 s]
[INFO] Apache Sling Installer WebConsole Plugin ........... SUCCESS [ 2.195 s]
[INFO] Apache Sling JCR Installer ......................... SUCCESS [04:02 min]
[INFO] Apache Sling Launchpad Application Builder ......... SUCCESS [01:10 min]
[INFO] Apache Sling Scripting Sightly Integration Tests ... SUCCESS [02:43 min]
[INFO] Apache Sling Scripting Sightly Reactor ............. SUCCESS [ 1.407 s]
[INFO] Apache Sling Adapter Manager Implementation ........ SUCCESS [ 4.410 s]
[INFO] Apache Sling Bundle Resource Provider .............. SUCCESS [ 2.370 s]
[INFO] Apache Sling Distributed Event Admin ............... SUCCESS [ 3.521 s]
[INFO] Apache Sling Discovery API ......................... SUCCESS [ 2.415 s]
[INFO] Apache Sling Discovery Commons ..................... SUCCESS [02:13 min]
[INFO] Apache Sling Discovery Base ........................ SUCCESS [05:55 min]
[INFO] Apache Sling Resource-Based Discovery Service ...... SUCCESS [09:07 min]
[INFO] Apache Sling Oak-Based Discovery Service ........... SUCCESS [02:35 min]
[INFO] Apache Sling Discovery Support Bundle .............. SUCCESS [ 2.191 s]
[INFO] Apache Sling Discovery Standalone Implementation ... SUCCESS [ 2.718 s]
[INFO] Apache Sling Event Support ......................... SUCCESS [36:38 min]
[INFO] Apache Sling Feature Flags ......................... SUCCESS [ 2.989 s]
[INFO] Apache Sling javax.activation bundle ............... SUCCESS [ 2.286 s]
[INFO] Apache Sling Service User Mapper ................... SUCCESS [ 4.012 s]
[INFO] Apache Sling Settings .............................. SUCCESS [ 4.432 s]
[INFO] Apache Sling Web Console Branding .................. SUCCESS [ 2.712 s]
[INFO] Apache Sling Web Console Security Provider ......... SUCCESS [ 2.843 s]
[INFO] Apache Sling Explorer .............................. SUCCESS [ 2.692 s]
[INFO] Apache Sling Health Check Core ..................... SUCCESS [05:09 min]
[INFO] Apache Sling Health Check Samples .................. SUCCESS [ 3.957 s]
[INFO] Apache Sling Health Check Support Components ....... SUCCESS [ 3.999 s]
[INFO] Apache Sling Health Check Webconsole Plugin ........ SUCCESS [ 2.411 s]
[INFO] Apache Sling Health Check JUnit Bridge ............. SUCCESS [ 3.853 s]
[INFO] Apache Sling Health Check Annotations .............. SUCCESS [ 1.967 s]
[INFO] Apache Sling Health Check Integration Tests ........ SUCCESS [ 13.570 s]
[INFO] Apache Sling Health Check Reactor POM .............. SUCCESS [ 1.865 s]
[INFO] Apache Sling Resource Access Security .............. SUCCESS [ 3.548 s]
[INFO] Apache Sling Resource Access Security Integration Tests SUCCESS [02:08 min]
[INFO] Apache Sling Models API ............................ SUCCESS [ 2.869 s]
[INFO] Apache Sling Models Implementation ................. SUCCESS [ 6.701 s]
[INFO] Apache Sling Models Integration Tests .............. SUCCESS [02:23 min]
[INFO] Apache Sling Internationalization Support .......... FAILURE [02:58 min]
[INFO] Apache Sling XSS Protection Bundle ................. SKIPPED
[INFO] Apache Sling JUnit Core ............................ SKIPPED
[INFO] Apache Sling JUnit Tests Teleporter ................ SKIPPED
[INFO] Apache Sling Resource Builder ...................... SKIPPED
[INFO] Apache Sling Servlet Helpers ....................... SKIPPED
[INFO] Apache Sling RepoInit Integration Tests ............ SKIPPED
[INFO] Apache Sling RepoInit Reactor ...................... SKIPPED
[INFO] Apache Sling Test Tools ............................ SKIPPED
[INFO] Apache Sling Testing Clients ....................... SKIPPED
[INFO] Apache Sling Testing Hamcrest ...................... SKIPPED
[INFO] Apache Sling Server Setup Tools .................... SKIPPED
[INFO] Apache Sling Testing Rules ......................... SKIPPED
[INFO] Apache Sling JUnit Scriptable Tests Provider ....... SKIPPED
[INFO] Apache Sling JUnit Health Checks ................... SKIPPED
[INFO] Apache Sling JUnit Remote Tests Runners ............ SKIPPED
[INFO] Apache Sling JUnit Performance ..................... SKIPPED
[INFO] Apache Sling Testing Mock Log Configuration ........ SKIPPED
[INFO] Apache Sling Testing Resource Resolver Mock ........ SKIPPED
[INFO] Apache Sling Testing JCR Mock ...................... SKIPPED
[INFO] Apache Sling Testing OSGi Mock ..................... SKIPPED
[INFO] Apache Sling Testing Sling Mock .................... SKIPPED
[INFO] Apache Sling Testing Sling Mock Oak-based Resource Resolver SKIPPED
[INFO] Apache Sling Testing Mocks Modules Reactor ......... SKIPPED
[INFO] Apache Sling Testing - sample bundle with integration tests SKIPPED
[INFO] Apache Sling Testing - sample module with integration tests SKIPPED
[INFO] Apache Sling Testing PaxExam ....................... SKIPPED
[INFO] Apache Sling Testing Modules Reactor ............... SKIPPED
[INFO] Apache Sling Installer ............................. SKIPPED
[INFO] Apache Sling File Installer ........................ SKIPPED
[INFO] Apache Sling Installer Configuration Admin Support . SKIPPED
[INFO] Apache Sling Deployment Package Installer .......... SKIPPED
[INFO] Apache Sling Subsystems Installer .................. SKIPPED
[INFO] Apache Sling Installer Health Checks ............... SKIPPED
[INFO] Apache Sling Installer Integration Tests ........... SKIPPED
[INFO] Apache Sling Launchpad API ......................... SKIPPED
[INFO] Apache Sling Launchpad Installer ................... SKIPPED
[INFO] Apache Sling Launchpad Content ..................... SKIPPED
[INFO] Apache Sling Validation Framework API .............. SKIPPED
[INFO] Apache Sling Validation Framework Core Implementation SKIPPED
[INFO] Apache Sling Validation Framework Testing Services . SKIPPED
[INFO] Apache Sling Validation Framework Integration Tests SKIPPED
[INFO] Apache Sling Validation Framework Examples ......... SKIPPED
[INFO] Apache Sling Validation Framework Builder .......... SKIPPED
[INFO] Apache Sling Models Validation Implementation ...... SKIPPED
[INFO] Apache Sling Launchpad Testing Services ............ SKIPPED
[INFO] Apache Sling Launchpad Testing Services WAR ........ SKIPPED
[INFO] Apache Sling Launchpad Testing Fragment Bundle ..... SKIPPED
[INFO] Apache Sling Launchpad Test Bundles ................ SKIPPED
[INFO] Apache Sling Integration Tests ..................... SKIPPED
[INFO] Apache Sling Launchpad Testing ..................... SKIPPED
[INFO] Apache Sling (Builder) ............................. SKIPPED
[INFO] ------------------------------------------------------------------------
[INFO] BUILD FAILURE
[INFO] ------------------------------------------------------------------------
[INFO] Total time: 01:53 h
[INFO] Finished at: 2016-08-24T11:26:27+00:00
[INFO] Final Memory: 279M/478M
[INFO] ------------------------------------------------------------------------
Waiting for Jenkins to finish collecting data
[ERROR] Failed to execute goal org.apache.maven.plugins:maven-failsafe-plugin:2.19.1:integration-test (default) on project org.apache.sling.i18n: Execution default of goal org.apache.maven.plugins:maven-failsafe-plugin:2.19.1:integration-test failed: The forked VM terminated without properly saying goodbye. VM crash or System.exit called?
[ERROR] Command was /bin/sh -c cd <https://builds.apache.org/job/sling-trunk-1.8/ws/trunk/bundles/extensions/i18n> && /usr/local/asfpackages/java/jdk1.8.0_102/jre/bin/java -jar <https://builds.apache.org/job/sling-trunk-1.8/ws/trunk/bundles/extensions/i18n/target/surefire/surefirebooter7610561422966829778.jar> <https://builds.apache.org/job/sling-trunk-1.8/ws/trunk/bundles/extensions/i18n/target/surefire/surefire5485034138652636978tmp> <https://builds.apache.org/job/sling-trunk-1.8/ws/trunk/bundles/extensions/i18n/target/surefire/surefire_14809337464417549086tmp>
[ERROR] -> [Help 1]
[ERROR]
[ERROR] To see the full stack trace of the errors, re-run Maven with the -e switch.
[ERROR] Re-run Maven using the -X switch to enable full debug logging.
[ERROR]
[ERROR] For more information about the errors and possible solutions, please read the following articles:
[ERROR] [Help 1] http://cwiki.apache.org/confluence/display/MAVEN/PluginExecutionException
[ERROR]
[ERROR] After correcting the problems, you can resume the build with the command
[ERROR] mvn <goals> -rf :org.apache.sling.i18n
channel stopped
Found 18 test results
Found 95 test results
Found 36 test results
Found 8 test results
Found 4 test results
Found 2 test results
Found 17 test results
Found 4 test results
Found 94 test results
Found 44 test results
Found 10 test results
Found 21 test results
Found 9 test results
Found 36 test results
Found 42 test results
Found 22 test results
Found 10 test results
Found 31 test results
Found 83 test results
Found 50 test results
Found 30 test results
Found 5 test results
Found 95 test results
Found 77 test results
Found failed test junit/org.apache.sling.event.it/RoundRobinQueueTest
Found failed test junit/org.apache.sling.event.it/RoundRobinQueueTest/testRoundRobinQueue
Found failed test junit/org.apache.sling.event.it/UnorderedQueueTest
Found failed test junit/org.apache.sling.event.it/UnorderedQueueTest/testUnorderedQueue
Found 4 test results
Found 94 test results
Found 3 test results
Found 8 test results
Found 2 test results
Found 13 test results
Found 27 test results
Found 3 test results
Found 38 test results
Found 9 test results
Found 96 test results
Found 8 test results
Found 17 test results
Found 45 test results
Found 34 test results
Found 9 test results
Found 94 test results
Found 3 test results
Found 75 test results
Found 184 test results
Found 16 test results
Found 10 test results
Found 49 test results
Found 35 test results
Found 21 test results
Found 210 test results
Found 24 test results
Found 81 test results
Found 27 test results
Found 24 test results
Found 13 test results
Found 2 test results
Found 393 test results
Found 17 test results
Found 28 test results
Found 44 test results
Found 92 test results
Found 18 test results
Found 2 test results
Jenkins build is still unstable: sling-trunk-1.8 #3844
Posted by Apache Jenkins Server <je...@builds.apache.org>.
See <https://builds.apache.org/job/sling-trunk-1.8/3844/>
Jenkins build is still unstable: sling-trunk-1.8 #3843
Posted by Apache Jenkins Server <je...@builds.apache.org>.
See <https://builds.apache.org/job/sling-trunk-1.8/changes>
Jenkins build is unstable: sling-trunk-1.8 #3842
Posted by Apache Jenkins Server <je...@builds.apache.org>.
See <https://builds.apache.org/job/sling-trunk-1.8/3842/changes>
Build failed in Jenkins: sling-trunk-1.8 #3841
Posted by Apache Jenkins Server <je...@builds.apache.org>.
See <https://builds.apache.org/job/sling-trunk-1.8/3841/changes>
Changes:
[sseifert] SLING-5982 implement support for nested configuration classes, and use native valuemap support for type conversion
------------------------------------------
[...truncated 137521 lines...]
[JENKINS] Archiving disabled
[JENKINS] Archiving disabled
[JENKINS] Archiving disabled
[JENKINS] Archiving disabled
[JENKINS] Archiving disabled
[JENKINS] Archiving disabled
[JENKINS] Archiving disabled
[JENKINS] Archiving disabled
[INFO] ------------------------------------------------------------------------
[INFO] Reactor Summary:
[INFO]
[INFO] Apache Sling JAR Resource Bundle ................... SUCCESS [ 6.833 s]
[INFO] Apache Sling (Parent) .............................. SUCCESS [ 16.196 s]
[INFO] Apache Sling Tooling Support Install ............... SUCCESS [ 14.390 s]
[INFO] Apache Sling Provisioning Model .................... SUCCESS [ 19.373 s]
[INFO] Apache Sling Tooling Support Source ................ SUCCESS [ 4.093 s]
[INFO] Apache Sling Testing Utilities ..................... SUCCESS [01:59 min]
[INFO] Apache Sling API ................................... SUCCESS [ 12.153 s]
[INFO] Apache Sling Resource Resolver ..................... SUCCESS [ 16.400 s]
[INFO] Apache Sling System Bundle Extension: Java Transaction API SUCCESS [ 4.301 s]
[INFO] Apache Sling System Bundle Extension: XML APIs ..... SUCCESS [ 3.267 s]
[INFO] Apache Sling System Bundle Extension: Activation API SUCCESS [ 3.100 s]
[INFO] Apache Sling System Bundle Extension: WS APIs ...... SUCCESS [ 3.036 s]
[INFO] Apache Sling Dynamic Class Loader Support .......... SUCCESS [ 21.787 s]
[INFO] Apache Sling Commons FileSystem ClassLoader ........ SUCCESS [ 5.863 s]
[INFO] Apache Sling Commons Java Compiler ................. SUCCESS [ 6.500 s]
[INFO] Apache Sling JSON Library .......................... SUCCESS [ 21.756 s]
[INFO] Apache Sling SLF4J Implementation (Logback) ........ SUCCESS [01:21 min]
[INFO] Apache Sling OSGi LogService Implementation ........ SUCCESS [ 5.053 s]
[INFO] Apache Sling MIME type mapping support ............. SUCCESS [ 6.855 s]
[INFO] Apache Sling Content Detection Support ............. SUCCESS [03:03 min]
[INFO] Apache Sling Commons OSGi support .................. SUCCESS [ 7.592 s]
[INFO] Apache Sling Scheduler Support ..................... SUCCESS [ 11.122 s]
[INFO] Apache Sling Thread Dumper ......................... SUCCESS [ 3.165 s]
[INFO] Apache Sling Thread Support ........................ SUCCESS [ 6.426 s]
[INFO] Apache Sling Metrics ............................... SUCCESS [ 7.179 s]
[INFO] Apache Sling Authentication Service ................ SUCCESS [ 8.284 s]
[INFO] Apache Sling Form Based Authentication Handler ..... SUCCESS [ 16.871 s]
[INFO] Apache Sling Engine Implementation ................. SUCCESS [ 19.524 s]
[INFO] Apache Sling Repository API Bundle ................. SUCCESS [ 6.231 s]
[INFO] Apache Sling JCR Base Bundle ....................... SUCCESS [ 5.855 s]
[INFO] Apache Sling Pax Exam Utilities .................... SUCCESS [02:45 min]
[INFO] Apache Sling Initial Content Loader ................ SUCCESS [05:25 min]
[INFO] Apache Sling Jackrabbit Embedded Repository ........ SUCCESS [ 14.107 s]
[INFO] Apache Sling Jackrabbit UserManager Support ........ SUCCESS [ 6.657 s]
[INFO] Apache Sling Jackrabbit JSR-283 Access Control Manager Support SUCCESS [ 4.058 s]
[INFO] Apache Sling Wrapper Bundle for the JCR API ........ SUCCESS [ 3.261 s]
[INFO] Apache Sling JCR Resource Resolver ................. SUCCESS [02:33 min]
[INFO] Apache Sling Versioning Integration Tests .......... SUCCESS [01:45 min]
[INFO] Apache Sling JCR Repository Registration ........... SUCCESS [ 4.932 s]
[INFO] Apache Sling Simple WebDAV Access to repositories .. SUCCESS [ 4.537 s]
[INFO] Apache Sling DavEx Access to repositories .......... SUCCESS [ 5.172 s]
[INFO] Apache Sling JCR WebConsole Bundle ................. SUCCESS [ 3.429 s]
[INFO] Apache Sling JCR Oak Repository Server ............. SUCCESS [ 51.588 s]
[INFO] Apache Sling SlingRepository Integration Tests ..... SUCCESS [03:42 min]
[INFO] Apache Sling RepoInit Parser ....................... SUCCESS [ 9.135 s]
[INFO] Apache Sling RepoInit JCR module ................... SUCCESS [ 19.457 s]
[INFO] Apache Sling Servlet Resolver ...................... SUCCESS [ 7.919 s]
[INFO] Apache Sling Default GET Servlets .................. SUCCESS [ 6.642 s]
[INFO] Apache Sling Default POST Servlets ................. SUCCESS [ 7.515 s]
[INFO] Apache Sling Compat Servlets ....................... SUCCESS [ 3.030 s]
[INFO] Apache Sling Scripting Implementation API .......... SUCCESS [ 3.261 s]
[INFO] Apache Sling Scripting Core implementation ......... SUCCESS [ 52.338 s]
[INFO] Apache Sling Scripting JavaScript Support .......... SUCCESS [01:52 min]
[INFO] Apache Sling Scripting JSP Support ................. SUCCESS [ 11.623 s]
[INFO] Apache Sling JSP Tag Library ....................... SUCCESS [ 13.151 s]
[INFO] Apache Sling JSP Standard Tag Library .............. SUCCESS [ 3.345 s]
[INFO] Apache Sling Scripting Sightly Compiler ............ SUCCESS [ 32.096 s]
[INFO] Apache Sling Scripting Sightly Java Compiler ....... SUCCESS [ 14.076 s]
[INFO] Apache Sling Scripting Sightly Engine .............. SUCCESS [ 15.877 s]
[INFO] Apache Sling Scripting Sightly JavaScript Use Provider SUCCESS [ 5.532 s]
[INFO] Apache Sling Scripting Sightly Models Use Provider . SUCCESS [ 3.075 s]
[INFO] Apache Sling Scripting Sightly Read-Eval-Print Loop Environment SUCCESS [ 4.368 s]
[INFO] Apache Sling Scripting Sightly Integration Tests Content SUCCESS [ 10.279 s]
[INFO] Apache Sling Launchpad Base ........................ SUCCESS [ 24.944 s]
[INFO] Apache Sling Subsystems Base Installer ............. SUCCESS [ 4.729 s]
[INFO] Apache Sling Filesystem Resource Provider .......... SUCCESS [ 3.592 s]
[INFO] Apache Sling Installer WebConsole Plugin ........... SUCCESS [ 2.976 s]
[INFO] Apache Sling JCR Installer ......................... SUCCESS [03:44 min]
[INFO] Apache Sling Launchpad Application Builder ......... SUCCESS [01:34 min]
[INFO] Apache Sling Scripting Sightly Integration Tests ... SUCCESS [02:31 min]
[INFO] Apache Sling Scripting Sightly Reactor ............. SUCCESS [ 1.619 s]
[INFO] Apache Sling Adapter Manager Implementation ........ SUCCESS [ 5.003 s]
[INFO] Apache Sling Bundle Resource Provider .............. SUCCESS [ 2.934 s]
[INFO] Apache Sling Distributed Event Admin ............... SUCCESS [ 4.790 s]
[INFO] Apache Sling Discovery API ......................... SUCCESS [ 2.866 s]
[INFO] Apache Sling Discovery Commons ..................... SUCCESS [02:13 min]
[INFO] Apache Sling Discovery Base ........................ SUCCESS [05:47 min]
[INFO] Apache Sling Resource-Based Discovery Service ...... SUCCESS [09:24 min]
[INFO] Apache Sling Oak-Based Discovery Service ........... SUCCESS [03:46 min]
[INFO] Apache Sling Discovery Support Bundle .............. SUCCESS [ 24.699 s]
[INFO] Apache Sling Discovery Standalone Implementation ... SUCCESS [ 31.137 s]
[INFO] Apache Sling Event Support ......................... SUCCESS [30:27 min]
[INFO] Apache Sling Feature Flags ......................... SUCCESS [ 3.231 s]
[INFO] Apache Sling javax.activation bundle ............... SUCCESS [ 3.245 s]
[INFO] Apache Sling Service User Mapper ................... SUCCESS [ 4.641 s]
[INFO] Apache Sling Settings .............................. SUCCESS [ 5.778 s]
[INFO] Apache Sling Web Console Branding .................. SUCCESS [ 2.801 s]
[INFO] Apache Sling Web Console Security Provider ......... SUCCESS [ 3.420 s]
[INFO] Apache Sling Explorer .............................. SUCCESS [ 3.901 s]
[INFO] Apache Sling Health Check Core ..................... SUCCESS [03:53 min]
[INFO] Apache Sling Health Check Samples .................. SUCCESS [ 7.416 s]
[INFO] Apache Sling Health Check Support Components ....... SUCCESS [ 4.618 s]
[INFO] Apache Sling Health Check Webconsole Plugin ........ SUCCESS [ 3.159 s]
[INFO] Apache Sling Health Check JUnit Bridge ............. SUCCESS [ 4.606 s]
[INFO] Apache Sling Health Check Annotations .............. SUCCESS [ 2.195 s]
[INFO] Apache Sling Health Check Integration Tests ........ SUCCESS [ 13.026 s]
[INFO] Apache Sling Health Check Reactor POM .............. SUCCESS [ 1.471 s]
[INFO] Apache Sling Resource Access Security .............. SUCCESS [ 5.338 s]
[INFO] Apache Sling Resource Access Security Integration Tests SUCCESS [01:56 min]
[INFO] Apache Sling Models API ............................ SUCCESS [ 7.088 s]
[INFO] Apache Sling Models Implementation ................. SUCCESS [ 13.590 s]
[INFO] Apache Sling Models Integration Tests .............. SUCCESS [02:00 min]
[INFO] Apache Sling Internationalization Support .......... FAILURE [02:41 min]
[INFO] Apache Sling XSS Protection Bundle ................. SKIPPED
[INFO] Apache Sling JUnit Core ............................ SKIPPED
[INFO] Apache Sling JUnit Tests Teleporter ................ SKIPPED
[INFO] Apache Sling Resource Builder ...................... SKIPPED
[INFO] Apache Sling Servlet Helpers ....................... SKIPPED
[INFO] Apache Sling RepoInit Integration Tests ............ SKIPPED
[INFO] Apache Sling RepoInit Reactor ...................... SKIPPED
[INFO] Apache Sling Test Tools ............................ SKIPPED
[INFO] Apache Sling Testing Clients ....................... SKIPPED
[INFO] Apache Sling Testing Hamcrest ...................... SKIPPED
[INFO] Apache Sling Server Setup Tools .................... SKIPPED
[INFO] Apache Sling Testing Rules ......................... SKIPPED
[INFO] Apache Sling JUnit Scriptable Tests Provider ....... SKIPPED
[INFO] Apache Sling JUnit Health Checks ................... SKIPPED
[INFO] Apache Sling JUnit Remote Tests Runners ............ SKIPPED
[INFO] Apache Sling JUnit Performance ..................... SKIPPED
[INFO] Apache Sling Testing Mock Log Configuration ........ SKIPPED
[INFO] Apache Sling Testing Resource Resolver Mock ........ SKIPPED
[INFO] Apache Sling Testing JCR Mock ...................... SKIPPED
[INFO] Apache Sling Testing OSGi Mock ..................... SKIPPED
[INFO] Apache Sling Testing Sling Mock .................... SKIPPED
[INFO] Apache Sling Testing Sling Mock Oak-based Resource Resolver SKIPPED
[INFO] Apache Sling Testing Mocks Modules Reactor ......... SKIPPED
[INFO] Apache Sling Testing - sample bundle with integration tests SKIPPED
[INFO] Apache Sling Testing - sample module with integration tests SKIPPED
[INFO] Apache Sling Testing PaxExam ....................... SKIPPED
[INFO] Apache Sling Testing Modules Reactor ............... SKIPPED
[INFO] Apache Sling Installer ............................. SKIPPED
[INFO] Apache Sling File Installer ........................ SKIPPED
[INFO] Apache Sling Installer Configuration Admin Support . SKIPPED
[INFO] Apache Sling Deployment Package Installer .......... SKIPPED
[INFO] Apache Sling Subsystems Installer .................. SKIPPED
[INFO] Apache Sling Installer Health Checks ............... SKIPPED
[INFO] Apache Sling Installer Integration Tests ........... SKIPPED
[INFO] Apache Sling Launchpad API ......................... SKIPPED
[INFO] Apache Sling Launchpad Installer ................... SKIPPED
[INFO] Apache Sling Launchpad Content ..................... SKIPPED
[INFO] Apache Sling Validation Framework API .............. SKIPPED
[INFO] Apache Sling Validation Framework Core Implementation SKIPPED
[INFO] Apache Sling Validation Framework Testing Services . SKIPPED
[INFO] Apache Sling Validation Framework Integration Tests SKIPPED
[INFO] Apache Sling Validation Framework Examples ......... SKIPPED
[INFO] Apache Sling Validation Framework Builder .......... SKIPPED
[INFO] Apache Sling Models Validation Implementation ...... SKIPPED
[INFO] Apache Sling Launchpad Testing Services ............ SKIPPED
[INFO] Apache Sling Launchpad Testing Services WAR ........ SKIPPED
[INFO] Apache Sling Launchpad Testing Fragment Bundle ..... SKIPPED
[INFO] Apache Sling Launchpad Test Bundles ................ SKIPPED
[INFO] Apache Sling Integration Tests ..................... SKIPPED
[INFO] Apache Sling Launchpad Testing ..................... SKIPPED
[INFO] Apache Sling (Builder) ............................. SKIPPED
[INFO] ------------------------------------------------------------------------
[INFO] BUILD FAILURE
[INFO] ------------------------------------------------------------------------
[INFO] Total time: 01:49 h
[INFO] Finished at: 2016-08-24T00:39:11+00:00
[INFO] Final Memory: 281M/474M
[INFO] ------------------------------------------------------------------------
Waiting for Jenkins to finish collecting data
[ERROR] Failed to execute goal org.apache.maven.plugins:maven-failsafe-plugin:2.19.1:integration-test (default) on project org.apache.sling.i18n: Execution default of goal org.apache.maven.plugins:maven-failsafe-plugin:2.19.1:integration-test failed: The forked VM terminated without properly saying goodbye. VM crash or System.exit called?
[ERROR] Command was /bin/sh -c cd <https://builds.apache.org/job/sling-trunk-1.8/ws/trunk/bundles/extensions/i18n> && /usr/local/asfpackages/java/jdk1.8.0_102/jre/bin/java -jar <https://builds.apache.org/job/sling-trunk-1.8/ws/trunk/bundles/extensions/i18n/target/surefire/surefirebooter6705273670133075209.jar> <https://builds.apache.org/job/sling-trunk-1.8/ws/trunk/bundles/extensions/i18n/target/surefire/surefire5156631423871606665tmp> <https://builds.apache.org/job/sling-trunk-1.8/ws/trunk/bundles/extensions/i18n/target/surefire/surefire_1254621117108304657tmp>
[ERROR] -> [Help 1]
[ERROR]
[ERROR] To see the full stack trace of the errors, re-run Maven with the -e switch.
[ERROR] Re-run Maven using the -X switch to enable full debug logging.
[ERROR]
[ERROR] For more information about the errors and possible solutions, please read the following articles:
[ERROR] [Help 1] http://cwiki.apache.org/confluence/display/MAVEN/PluginExecutionException
[ERROR]
[ERROR] After correcting the problems, you can resume the build with the command
[ERROR] mvn <goals> -rf :org.apache.sling.i18n
channel stopped
Found 18 test results
Found 95 test results
Found 45 test results
Found 8 test results
Found 4 test results
Found 2 test results
Found 17 test results
Found 4 test results
Found 94 test results
Found 44 test results
Found 10 test results
Found 21 test results
Found 9 test results
Found 36 test results
Found 42 test results
Found 22 test results
Found 10 test results
Found 31 test results
Found 83 test results
Found 50 test results
Found 30 test results
Found 5 test results
Found 95 test results
Found 77 test results
Found 4 test results
Found 94 test results
Found 3 test results
Found 8 test results
Found 2 test results
Found 13 test results
Found 27 test results
Found 3 test results
Found 38 test results
Found 9 test results
Found 96 test results
Found 8 test results
Found 17 test results
Found 45 test results
Found 34 test results
Found 9 test results
Found 94 test results
Found 3 test results
Found 75 test results
Found 184 test results
Found 16 test results
Found 10 test results
Found 49 test results
Found 35 test results
Found 21 test results
Found 210 test results
Found 24 test results
Found 81 test results
Found 27 test results
Found 24 test results
Found 13 test results
Found 2 test results
Found 393 test results
Found 17 test results
Found 28 test results
Found 44 test results
Found 92 test results
Found 18 test results
Found 2 test results
Jenkins build is still unstable: sling-trunk-1.8 #3840
Posted by Apache Jenkins Server <je...@builds.apache.org>.
See <https://builds.apache.org/job/sling-trunk-1.8/changes>
Jenkins build is unstable: sling-trunk-1.8 #3839
Posted by Apache Jenkins Server <je...@builds.apache.org>.
See <https://builds.apache.org/job/sling-trunk-1.8/3839/changes>
Build failed in Jenkins: sling-trunk-1.8 #3838
Posted by Apache Jenkins Server <je...@builds.apache.org>.
See <https://builds.apache.org/job/sling-trunk-1.8/3838/>
------------------------------------------
[...truncated 134335 lines...]
[JENKINS] Archiving disabled
[JENKINS] Archiving disabled
[JENKINS] Archiving disabled
[JENKINS] Archiving disabled[INFO] ------------------------------------------------------------------------
[INFO] Reactor Summary:
[INFO]
[INFO] Apache Sling JAR Resource Bundle ................... SUCCESS [ 7.294 s]
[INFO] Apache Sling (Parent) .............................. SUCCESS [ 8.070 s]
[INFO] Apache Sling Tooling Support Install ............... SUCCESS [ 10.565 s]
[INFO] Apache Sling Provisioning Model .................... SUCCESS [ 13.936 s]
[INFO] Apache Sling Tooling Support Source ................ SUCCESS [ 4.080 s]
[INFO] Apache Sling Testing Utilities ..................... SUCCESS [ 45.078 s]
[INFO] Apache Sling API ................................... SUCCESS [ 10.947 s]
[INFO] Apache Sling Resource Resolver ..................... SUCCESS [ 14.745 s]
[INFO] Apache Sling System Bundle Extension: Java Transaction API SUCCESS [ 4.728 s]
[INFO] Apache Sling System Bundle Extension: XML APIs ..... SUCCESS [ 3.315 s]
[INFO] Apache Sling System Bundle Extension: Activation API SUCCESS [ 2.764 s]
[INFO] Apache Sling System Bundle Extension: WS APIs ...... SUCCESS [ 2.806 s]
[INFO] Apache Sling Dynamic Class Loader Support .......... SUCCESS [ 14.773 s]
[INFO] Apache Sling Commons FileSystem ClassLoader ........ SUCCESS [ 4.893 s]
[INFO] Apache Sling Commons Java Compiler ................. SUCCESS [ 6.418 s]
[INFO] Apache Sling JSON Library .......................... SUCCESS [ 10.496 s]
[INFO] Apache Sling SLF4J Implementation (Logback) ........ SUCCESS [ 53.729 s]
[INFO] Apache Sling OSGi LogService Implementation ........ SUCCESS [ 4.972 s]
[INFO] Apache Sling MIME type mapping support ............. SUCCESS [ 4.942 s]
[INFO] Apache Sling Content Detection Support ............. SUCCESS [01:16 min]
[INFO] Apache Sling Commons OSGi support .................. SUCCESS [ 6.884 s]
[INFO] Apache Sling Scheduler Support ..................... SUCCESS [ 6.263 s]
[INFO] Apache Sling Thread Dumper ......................... SUCCESS [ 2.653 s]
[INFO] Apache Sling Thread Support ........................ SUCCESS [ 4.710 s]
[INFO] Apache Sling Metrics ............................... SUCCESS [ 7.661 s]
[INFO] Apache Sling Authentication Service ................ SUCCESS [ 5.637 s]
[INFO] Apache Sling Form Based Authentication Handler ..... SUCCESS [ 9.932 s]
[INFO] Apache Sling Engine Implementation ................. SUCCESS [ 12.669 s]
[INFO] Apache Sling Repository API Bundle ................. SUCCESS [ 2.929 s]
[INFO] Apache Sling JCR Base Bundle ....................... SUCCESS [ 6.419 s]
[INFO] Apache Sling Pax Exam Utilities .................... SUCCESS [01:09 min]
[INFO] Apache Sling Initial Content Loader ................ SUCCESS [01:59 min]
[INFO] Apache Sling Jackrabbit Embedded Repository ........ SUCCESS [ 11.010 s]
[INFO] Apache Sling Jackrabbit UserManager Support ........ SUCCESS [ 3.943 s]
[INFO] Apache Sling Jackrabbit JSR-283 Access Control Manager Support SUCCESS [ 3.252 s]
[INFO] Apache Sling Wrapper Bundle for the JCR API ........ SUCCESS [ 2.404 s]
[INFO] Apache Sling JCR Resource Resolver ................. SUCCESS [01:12 min]
[INFO] Apache Sling Versioning Integration Tests .......... SUCCESS [ 31.245 s]
[INFO] Apache Sling JCR Repository Registration ........... SUCCESS [ 4.811 s]
[INFO] Apache Sling Simple WebDAV Access to repositories .. SUCCESS [ 4.096 s]
[INFO] Apache Sling DavEx Access to repositories .......... SUCCESS [ 4.768 s]
[INFO] Apache Sling JCR WebConsole Bundle ................. SUCCESS [ 2.540 s]
[INFO] Apache Sling JCR Oak Repository Server ............. SUCCESS [ 27.423 s]
[INFO] Apache Sling SlingRepository Integration Tests ..... SUCCESS [01:57 min]
[INFO] Apache Sling RepoInit Parser ....................... SUCCESS [ 4.723 s]
[INFO] Apache Sling RepoInit JCR module ................... SUCCESS [ 16.385 s]
[INFO] Apache Sling Servlet Resolver ...................... SUCCESS [ 5.304 s]
[INFO] Apache Sling Default GET Servlets .................. SUCCESS [ 4.905 s]
[INFO] Apache Sling Default POST Servlets ................. SUCCESS [ 6.336 s]
[INFO] Apache Sling Compat Servlets ....................... SUCCESS [ 2.892 s]
[INFO] Apache Sling Scripting Implementation API .......... SUCCESS [ 2.504 s]
[INFO] Apache Sling Scripting Core implementation ......... SUCCESS [ 24.084 s]
[INFO] Apache Sling Scripting JavaScript Support .......... SUCCESS [ 44.722 s]
[INFO] Apache Sling Scripting JSP Support ................. SUCCESS [ 7.173 s]
[INFO] Apache Sling JSP Tag Library ....................... SUCCESS [ 6.397 s]
[INFO] Apache Sling JSP Standard Tag Library .............. SUCCESS [ 3.749 s]
[INFO] Apache Sling Scripting Sightly Compiler ............ SUCCESS [ 28.246 s]
[INFO] Apache Sling Scripting Sightly Java Compiler ....... SUCCESS [ 16.098 s]
[INFO] Apache Sling Scripting Sightly Engine .............. SUCCESS [ 17.039 s]
[INFO] Apache Sling Scripting Sightly JavaScript Use Provider SUCCESS [ 3.161 s]
[INFO] Apache Sling Scripting Sightly Models Use Provider . SUCCESS [ 2.581 s]
[INFO] Apache Sling Scripting Sightly Read-Eval-Print Loop Environment SUCCESS [ 3.056 s]
[INFO] Apache Sling Scripting Sightly Integration Tests Content SUCCESS [ 5.892 s]
[INFO] Apache Sling Launchpad Base ........................ SUCCESS [ 16.958 s]
[INFO] Apache Sling Subsystems Base Installer ............. SUCCESS [ 3.712 s]
[INFO] Apache Sling Filesystem Resource Provider .......... SUCCESS [ 3.085 s]
[INFO] Apache Sling Installer WebConsole Plugin ........... SUCCESS [ 2.891 s]
[INFO] Apache Sling JCR Installer ......................... SUCCESS [02:24 min]
[INFO] Apache Sling Launchpad Application Builder ......... SUCCESS [ 50.378 s]
[INFO] Apache Sling Scripting Sightly Integration Tests ... SUCCESS [02:21 min]
[INFO] Apache Sling Scripting Sightly Reactor ............. SUCCESS [ 1.592 s]
[INFO] Apache Sling Adapter Manager Implementation ........ SUCCESS [ 3.764 s]
[INFO] Apache Sling Bundle Resource Provider .............. SUCCESS [ 2.733 s]
[INFO] Apache Sling Distributed Event Admin ............... SUCCESS [ 3.562 s]
[INFO] Apache Sling Discovery API ......................... SUCCESS [ 2.398 s]
[INFO] Apache Sling Discovery Commons ..................... SUCCESS [01:09 min]
[INFO] Apache Sling Discovery Base ........................ SUCCESS [01:17 min]
[INFO] Apache Sling Resource-Based Discovery Service ...... SUCCESS [03:45 min]
[INFO] Apache Sling Oak-Based Discovery Service ........... SUCCESS [02:34 min]
[INFO] Apache Sling Discovery Support Bundle .............. SUCCESS [ 2.510 s]
[INFO] Apache Sling Discovery Standalone Implementation ... SUCCESS [ 3.559 s]
[INFO] Apache Sling Event Support ......................... SUCCESS [27:12 min]
[INFO] Apache Sling Feature Flags ......................... SUCCESS [ 2.888 s]
[INFO] Apache Sling javax.activation bundle ............... SUCCESS [ 2.809 s]
[INFO] Apache Sling Service User Mapper ................... SUCCESS [ 4.071 s]
[INFO] Apache Sling Settings .............................. SUCCESS [ 6.536 s]
[INFO] Apache Sling Web Console Branding .................. SUCCESS [ 2.296 s]
[INFO] Apache Sling Web Console Security Provider ......... SUCCESS [ 2.780 s]
[INFO] Apache Sling Explorer .............................. SUCCESS [ 2.673 s]
[INFO] Apache Sling Health Check Core ..................... SUCCESS [02:26 min]
[INFO] Apache Sling Health Check Samples .................. SUCCESS [ 4.829 s]
[INFO] Apache Sling Health Check Support Components ....... SUCCESS [ 3.593 s]
[INFO] Apache Sling Health Check Webconsole Plugin ........ SUCCESS [ 2.503 s]
[INFO] Apache Sling Health Check JUnit Bridge ............. SUCCESS [ 3.869 s]
[INFO] Apache Sling Health Check Annotations .............. SUCCESS [ 2.519 s]
[INFO] Apache Sling Health Check Integration Tests ........ SUCCESS [ 7.027 s]
[INFO] Apache Sling Health Check Reactor POM .............. SUCCESS [ 1.403 s]
[INFO] Apache Sling Resource Access Security .............. SUCCESS [ 8.337 s]
[INFO] Apache Sling Resource Access Security Integration Tests SUCCESS [ 49.650 s]
[INFO] Apache Sling Models API ............................ SUCCESS [ 3.124 s]
[INFO] Apache Sling Models Implementation ................. SUCCESS [ 6.728 s]
[INFO] Apache Sling Models Integration Tests .............. SUCCESS [ 57.105 s]
[INFO] Apache Sling Internationalization Support .......... FAILURE [01:20 min]
[INFO] Apache Sling XSS Protection Bundle ................. SKIPPED
[INFO] Apache Sling JUnit Core ............................ SKIPPED
[INFO] Apache Sling JUnit Tests Teleporter ................ SKIPPED
[INFO] Apache Sling Resource Builder ...................... SKIPPED
[INFO] Apache Sling Servlet Helpers ....................... SKIPPED
[INFO] Apache Sling RepoInit Integration Tests ............ SKIPPED
[INFO] Apache Sling RepoInit Reactor ...................... SKIPPED
[INFO] Apache Sling Test Tools ............................ SKIPPED
[INFO] Apache Sling Testing Clients ....................... SKIPPED
[INFO] Apache Sling Testing Hamcrest ...................... SKIPPED
[INFO] Apache Sling Server Setup Tools .................... SKIPPED
[INFO] Apache Sling Testing Rules ......................... SKIPPED
[INFO] Apache Sling JUnit Scriptable Tests Provider ....... SKIPPED
[INFO] Apache Sling JUnit Health Checks ................... SKIPPED
[INFO] Apache Sling JUnit Remote Tests Runners ............ SKIPPED
[INFO] Apache Sling JUnit Performance ..................... SKIPPED
[INFO] Apache Sling Testing Mock Log Configuration ........ SKIPPED
[INFO] Apache Sling Testing Resource Resolver Mock ........ SKIPPED
[INFO] Apache Sling Testing JCR Mock ...................... SKIPPED
[INFO] Apache Sling Testing OSGi Mock ..................... SKIPPED
[INFO] Apache Sling Testing Sling Mock .................... SKIPPED
[INFO] Apache Sling Testing Sling Mock Oak-based Resource Resolver SKIPPED
[INFO] Apache Sling Testing Mocks Modules Reactor ......... SKIPPED
[INFO] Apache Sling Testing - sample bundle with integration tests SKIPPED
[INFO] Apache Sling Testing - sample module with integration tests SKIPPED
[INFO] Apache Sling Testing PaxExam ....................... SKIPPED
[INFO] Apache Sling Testing Modules Reactor ............... SKIPPED
[INFO] Apache Sling Installer ............................. SKIPPED
[INFO] Apache Sling File Installer ........................ SKIPPED
[INFO] Apache Sling Installer Configuration Admin Support . SKIPPED
[INFO] Apache Sling Deployment Package Installer .......... SKIPPED
[INFO] Apache Sling Subsystems Installer .................. SKIPPED
[INFO] Apache Sling Installer Health Checks ............... SKIPPED
[INFO] Apache Sling Installer Integration Tests ........... SKIPPED
[INFO] Apache Sling Launchpad API ......................... SKIPPED
[INFO] Apache Sling Launchpad Installer ................... SKIPPED
[INFO] Apache Sling Launchpad Content ..................... SKIPPED
[INFO] Apache Sling Validation Framework API .............. SKIPPED
[INFO] Apache Sling Validation Framework Core Implementation SKIPPED
[INFO] Apache Sling Validation Framework Testing Services . SKIPPED
[INFO] Apache Sling Validation Framework Integration Tests SKIPPED
[INFO] Apache Sling Validation Framework Examples ......... SKIPPED
[INFO] Apache Sling Validation Framework Builder .......... SKIPPED
[INFO] Apache Sling Models Validation Implementation ...... SKIPPED
[INFO] Apache Sling Launchpad Testing Services ............ SKIPPED
[INFO] Apache Sling Launchpad Testing Services WAR ........ SKIPPED
[INFO] Apache Sling Launchpad Testing Fragment Bundle ..... SKIPPED
[INFO] Apache Sling Launchpad Test Bundles ................ SKIPPED
[INFO] Apache Sling Integration Tests ..................... SKIPPED
[INFO] Apache Sling Launchpad Testing ..................... SKIPPED
[INFO] Apache Sling (Builder) ............................. SKIPPED
[INFO] ------------------------------------------------------------------------
[INFO] BUILD FAILURE
[INFO] ------------------------------------------------------------------------
[INFO] Total time: 01:08 h
[INFO] Finished at: 2016-08-23T13:52:06+00:00
[INFO] Final Memory: 283M/477M
[INFO] ------------------------------------------------------------------------
Waiting for Jenkins to finish collecting data
[ERROR] Failed to execute goal org.apache.maven.plugins:maven-failsafe-plugin:2.19.1:integration-test (default) on project org.apache.sling.i18n: Execution default of goal org.apache.maven.plugins:maven-failsafe-plugin:2.19.1:integration-test failed: The forked VM terminated without properly saying goodbye. VM crash or System.exit called?
[ERROR] Command was /bin/sh -c cd <https://builds.apache.org/job/sling-trunk-1.8/ws/trunk/bundles/extensions/i18n> && /usr/local/asfpackages/java/jdk1.8.0_102/jre/bin/java -jar <https://builds.apache.org/job/sling-trunk-1.8/ws/trunk/bundles/extensions/i18n/target/surefire/surefirebooter2102165999862955581.jar> <https://builds.apache.org/job/sling-trunk-1.8/ws/trunk/bundles/extensions/i18n/target/surefire/surefire2831690925800337779tmp> <https://builds.apache.org/job/sling-trunk-1.8/ws/trunk/bundles/extensions/i18n/target/surefire/surefire_11222868097058755014tmp>
[ERROR] -> [Help 1]
[ERROR]
[ERROR] To see the full stack trace of the errors, re-run Maven with the -e switch.
[ERROR] Re-run Maven using the -X switch to enable full debug logging.
[ERROR]
[ERROR] For more information about the errors and possible solutions, please read the following articles:
[ERROR] [Help 1] http://cwiki.apache.org/confluence/display/MAVEN/PluginExecutionException
[ERROR]
[ERROR] After correcting the problems, you can resume the build with the command
[ERROR] mvn <goals> -rf :org.apache.sling.i18n
channel stopped
Found 18 test results
Found 95 test results
Found 45 test results
Found 8 test results
Found 4 test results
Found 2 test results
Found 17 test results
Found 4 test results
Found 94 test results
Found 44 test results
Found 10 test results
Found 21 test results
Found 9 test results
Found 36 test results
Found 42 test results
Found 22 test results
Found 10 test results
Found 31 test results
Found 83 test results
Found 50 test results
Found 30 test results
Found 5 test results
Found 95 test results
Found 77 test results
Found failed test junit/org.apache.sling.event.it/ChaosTest
Found failed test junit/org.apache.sling.event.it/ChaosTest/testDoChaos
Found 4 test results
Found 94 test results
Found 3 test results
Found 8 test results
Found 2 test results
Found 13 test results
Found 27 test results
Found 3 test results
Found 38 test results
Found 9 test results
Found 96 test results
Found 8 test results
Found 17 test results
Found 45 test results
Found 34 test results
Found 9 test results
Found 94 test results
Found 3 test results
Found 75 test results
Found failed test junit/org.apache.sling.launchpad.app/ControlListenerTest
Found failed test junit/org.apache.sling.launchpad.app/ControlListenerTest/test_start_status_stop
Found 184 test results
Found 16 test results
Found 10 test results
Found 49 test results
Found 35 test results
Found 21 test results
Found 210 test results
Found 24 test results
Found 81 test results
Found 27 test results
Found 24 test results
Found 13 test results
Found 2 test results
Found 393 test results
Found 17 test results
Found 28 test results
Found 44 test results
Found 92 test results
Found 18 test results
Found 2 test results
Jenkins build is unstable: sling-trunk-1.8 #3837
Posted by Apache Jenkins Server <je...@builds.apache.org>.
See <https://builds.apache.org/job/sling-trunk-1.8/3837/changes>
Build failed in Jenkins: sling-trunk-1.8 #3836
Posted by Apache Jenkins Server <je...@builds.apache.org>.
See <https://builds.apache.org/job/sling-trunk-1.8/3836/>
------------------------------------------
[...truncated 131061 lines...]
[JENKINS] Archiving disabled
[JENKINS] Archiving disabled
[JENKINS] Archiving disabled
[JENKINS] Archiving disabled
[JENKINS] Archiving disabled
[JENKINS] Archiving disabled
[JENKINS] Archiving disabled
[JENKINS] Archiving disabled[INFO] ------------------------------------------------------------------------
[INFO] Reactor Summary:
[INFO]
[INFO] Apache Sling JAR Resource Bundle ................... SUCCESS [ 4.033 s]
[INFO] Apache Sling (Parent) .............................. SUCCESS [ 6.835 s]
[INFO] Apache Sling Tooling Support Install ............... SUCCESS [ 8.661 s]
[INFO] Apache Sling Provisioning Model .................... SUCCESS [ 11.607 s]
[INFO] Apache Sling Tooling Support Source ................ SUCCESS [ 3.333 s]
[INFO] Apache Sling Testing Utilities ..................... SUCCESS [ 13.740 s]
[INFO] Apache Sling API ................................... SUCCESS [ 7.995 s]
[INFO] Apache Sling Resource Resolver ..................... SUCCESS [ 25.577 s]
[INFO] Apache Sling System Bundle Extension: Java Transaction API SUCCESS [ 5.844 s]
[INFO] Apache Sling System Bundle Extension: XML APIs ..... SUCCESS [ 2.565 s]
[INFO] Apache Sling System Bundle Extension: Activation API SUCCESS [ 2.476 s]
[INFO] Apache Sling System Bundle Extension: WS APIs ...... SUCCESS [ 2.443 s]
[INFO] Apache Sling Dynamic Class Loader Support .......... SUCCESS [ 9.381 s]
[INFO] Apache Sling Commons FileSystem ClassLoader ........ SUCCESS [ 4.028 s]
[INFO] Apache Sling Commons Java Compiler ................. SUCCESS [ 4.507 s]
[INFO] Apache Sling JSON Library .......................... SUCCESS [ 8.905 s]
[INFO] Apache Sling SLF4J Implementation (Logback) ........ SUCCESS [ 34.883 s]
[INFO] Apache Sling OSGi LogService Implementation ........ SUCCESS [ 3.401 s]
[INFO] Apache Sling MIME type mapping support ............. SUCCESS [ 3.983 s]
[INFO] Apache Sling Content Detection Support ............. SUCCESS [ 33.962 s]
[INFO] Apache Sling Commons OSGi support .................. SUCCESS [ 5.402 s]
[INFO] Apache Sling Scheduler Support ..................... SUCCESS [ 5.025 s]
[INFO] Apache Sling Thread Dumper ......................... SUCCESS [ 2.677 s]
[INFO] Apache Sling Thread Support ........................ SUCCESS [ 4.261 s]
[INFO] Apache Sling Metrics ............................... SUCCESS [ 5.707 s]
[INFO] Apache Sling Authentication Service ................ SUCCESS [ 6.130 s]
[INFO] Apache Sling Form Based Authentication Handler ..... SUCCESS [ 7.744 s]
[INFO] Apache Sling Engine Implementation ................. SUCCESS [ 10.603 s]
[INFO] Apache Sling Repository API Bundle ................. SUCCESS [ 2.438 s]
[INFO] Apache Sling JCR Base Bundle ....................... SUCCESS [ 4.648 s]
[INFO] Apache Sling Pax Exam Utilities .................... SUCCESS [ 28.828 s]
[INFO] Apache Sling Initial Content Loader ................ SUCCESS [ 46.496 s]
[INFO] Apache Sling Jackrabbit Embedded Repository ........ SUCCESS [ 9.319 s]
[INFO] Apache Sling Jackrabbit UserManager Support ........ SUCCESS [ 3.753 s]
[INFO] Apache Sling Jackrabbit JSR-283 Access Control Manager Support SUCCESS [ 2.619 s]
[INFO] Apache Sling Wrapper Bundle for the JCR API ........ SUCCESS [ 2.458 s]
[INFO] Apache Sling JCR Resource Resolver ................. SUCCESS [ 36.857 s]
[INFO] Apache Sling Versioning Integration Tests .......... SUCCESS [ 7.579 s]
[INFO] Apache Sling JCR Repository Registration ........... SUCCESS [ 4.446 s]
[INFO] Apache Sling Simple WebDAV Access to repositories .. SUCCESS [ 3.551 s]
[INFO] Apache Sling DavEx Access to repositories .......... SUCCESS [ 4.148 s]
[INFO] Apache Sling JCR WebConsole Bundle ................. SUCCESS [ 2.492 s]
[INFO] Apache Sling JCR Oak Repository Server ............. SUCCESS [ 20.067 s]
[INFO] Apache Sling SlingRepository Integration Tests ..... SUCCESS [ 24.751 s]
[INFO] Apache Sling RepoInit Parser ....................... SUCCESS [ 6.944 s]
[INFO] Apache Sling RepoInit JCR module ................... SUCCESS [ 13.017 s]
[INFO] Apache Sling Servlet Resolver ...................... SUCCESS [ 4.394 s]
[INFO] Apache Sling Default GET Servlets .................. SUCCESS [ 4.090 s]
[INFO] Apache Sling Default POST Servlets ................. SUCCESS [ 4.935 s]
[INFO] Apache Sling Compat Servlets ....................... SUCCESS [ 3.633 s]
[INFO] Apache Sling Scripting Implementation API .......... SUCCESS [ 2.604 s]
[INFO] Apache Sling Scripting Core implementation ......... SUCCESS [ 15.245 s]
[INFO] Apache Sling Scripting JavaScript Support .......... SUCCESS [ 14.942 s]
[INFO] Apache Sling Scripting JSP Support ................. SUCCESS [ 6.495 s]
[INFO] Apache Sling JSP Tag Library ....................... SUCCESS [ 5.966 s]
[INFO] Apache Sling JSP Standard Tag Library .............. SUCCESS [ 2.723 s]
[INFO] Apache Sling Scripting Sightly Compiler ............ SUCCESS [ 20.327 s]
[INFO] Apache Sling Scripting Sightly Java Compiler ....... SUCCESS [ 10.916 s]
[INFO] Apache Sling Scripting Sightly Engine .............. SUCCESS [ 12.635 s]
[INFO] Apache Sling Scripting Sightly JavaScript Use Provider SUCCESS [ 2.974 s]
[INFO] Apache Sling Scripting Sightly Models Use Provider . SUCCESS [ 2.599 s]
[INFO] Apache Sling Scripting Sightly Read-Eval-Print Loop Environment SUCCESS [ 2.732 s]
[INFO] Apache Sling Scripting Sightly Integration Tests Content SUCCESS [ 6.322 s]
[INFO] Apache Sling Launchpad Base ........................ SUCCESS [ 16.094 s]
[INFO] Apache Sling Subsystems Base Installer ............. SUCCESS [ 3.514 s]
[INFO] Apache Sling Filesystem Resource Provider .......... SUCCESS [ 2.924 s]
[INFO] Apache Sling Installer WebConsole Plugin ........... SUCCESS [ 2.405 s]
[INFO] Apache Sling JCR Installer ......................... SUCCESS [01:56 min]
[INFO] Apache Sling Launchpad Application Builder ......... SUCCESS [ 37.901 s]
[INFO] Apache Sling Scripting Sightly Integration Tests ... SUCCESS [01:54 min]
[INFO] Apache Sling Scripting Sightly Reactor ............. SUCCESS [ 1.510 s]
[INFO] Apache Sling Adapter Manager Implementation ........ SUCCESS [ 4.511 s]
[INFO] Apache Sling Bundle Resource Provider .............. SUCCESS [ 2.831 s]
[INFO] Apache Sling Distributed Event Admin ............... SUCCESS [ 3.799 s]
[INFO] Apache Sling Discovery API ......................... SUCCESS [ 2.497 s]
[INFO] Apache Sling Discovery Commons ..................... SUCCESS [ 45.433 s]
[INFO] Apache Sling Discovery Base ........................ SUCCESS [ 39.465 s]
[INFO] Apache Sling Resource-Based Discovery Service ...... SUCCESS [02:36 min]
[INFO] Apache Sling Oak-Based Discovery Service ........... SUCCESS [02:33 min]
[INFO] Apache Sling Discovery Support Bundle .............. SUCCESS [ 3.362 s]
[INFO] Apache Sling Discovery Standalone Implementation ... SUCCESS [ 3.793 s]
[INFO] Apache Sling Event Support ......................... SUCCESS [07:36 min]
[INFO] Apache Sling Feature Flags ......................... SUCCESS [ 2.862 s]
[INFO] Apache Sling javax.activation bundle ............... SUCCESS [ 2.702 s]
[INFO] Apache Sling Service User Mapper ................... SUCCESS [ 3.757 s]
[INFO] Apache Sling Settings .............................. SUCCESS [ 3.178 s]
[INFO] Apache Sling Web Console Branding .................. SUCCESS [ 2.236 s]
[INFO] Apache Sling Web Console Security Provider ......... SUCCESS [ 2.687 s]
[INFO] Apache Sling Explorer .............................. SUCCESS [ 2.434 s]
[INFO] Apache Sling Health Check Core ..................... SUCCESS [01:29 min]
[INFO] Apache Sling Health Check Samples .................. SUCCESS [ 4.732 s]
[INFO] Apache Sling Health Check Support Components ....... SUCCESS [ 3.725 s]
[INFO] Apache Sling Health Check Webconsole Plugin ........ SUCCESS [ 3.194 s]
[INFO] Apache Sling Health Check JUnit Bridge ............. SUCCESS [ 3.463 s]
[INFO] Apache Sling Health Check Annotations .............. SUCCESS [ 1.827 s]
[INFO] Apache Sling Health Check Integration Tests ........ SUCCESS [ 4.891 s]
[INFO] Apache Sling Health Check Reactor POM .............. SUCCESS [ 1.478 s]
[INFO] Apache Sling Resource Access Security .............. SUCCESS [ 3.045 s]
[INFO] Apache Sling Resource Access Security Integration Tests SUCCESS [ 24.791 s]
[INFO] Apache Sling Models API ............................ SUCCESS [ 2.816 s]
[INFO] Apache Sling Models Implementation ................. SUCCESS [ 5.917 s]
[INFO] Apache Sling Models Integration Tests .............. SUCCESS [ 31.612 s]
[INFO] Apache Sling Internationalization Support .......... FAILURE [ 33.714 s]
[INFO] Apache Sling XSS Protection Bundle ................. SKIPPED
[INFO] Apache Sling JUnit Core ............................ SKIPPED
[INFO] Apache Sling JUnit Tests Teleporter ................ SKIPPED
[INFO] Apache Sling Resource Builder ...................... SKIPPED
[INFO] Apache Sling Servlet Helpers ....................... SKIPPED
[INFO] Apache Sling RepoInit Integration Tests ............ SKIPPED
[INFO] Apache Sling RepoInit Reactor ...................... SKIPPED
[INFO] Apache Sling Test Tools ............................ SKIPPED
[INFO] Apache Sling Testing Clients ....................... SKIPPED
[INFO] Apache Sling Testing Hamcrest ...................... SKIPPED
[INFO] Apache Sling Server Setup Tools .................... SKIPPED
[INFO] Apache Sling Testing Rules ......................... SKIPPED
[INFO] Apache Sling JUnit Scriptable Tests Provider ....... SKIPPED
[INFO] Apache Sling JUnit Health Checks ................... SKIPPED
[INFO] Apache Sling JUnit Remote Tests Runners ............ SKIPPED
[INFO] Apache Sling JUnit Performance ..................... SKIPPED
[INFO] Apache Sling Testing Mock Log Configuration ........ SKIPPED
[INFO] Apache Sling Testing Resource Resolver Mock ........ SKIPPED
[INFO] Apache Sling Testing JCR Mock ...................... SKIPPED
[INFO] Apache Sling Testing OSGi Mock ..................... SKIPPED
[INFO] Apache Sling Testing Sling Mock .................... SKIPPED
[INFO] Apache Sling Testing Sling Mock Oak-based Resource Resolver SKIPPED
[INFO] Apache Sling Testing Mocks Modules Reactor ......... SKIPPED
[INFO] Apache Sling Testing - sample bundle with integration tests SKIPPED
[INFO] Apache Sling Testing - sample module with integration tests SKIPPED
[INFO] Apache Sling Testing PaxExam ....................... SKIPPED
[INFO] Apache Sling Testing Modules Reactor ............... SKIPPED
[INFO] Apache Sling Installer ............................. SKIPPED
[INFO] Apache Sling File Installer ........................ SKIPPED
[INFO] Apache Sling Installer Configuration Admin Support . SKIPPED
[INFO] Apache Sling Deployment Package Installer .......... SKIPPED
[INFO] Apache Sling Subsystems Installer .................. SKIPPED
[INFO] Apache Sling Installer Health Checks ............... SKIPPED
[INFO] Apache Sling Installer Integration Tests ........... SKIPPED
[INFO] Apache Sling Launchpad API ......................... SKIPPED
[INFO] Apache Sling Launchpad Installer ................... SKIPPED
[INFO] Apache Sling Launchpad Content ..................... SKIPPED
[INFO] Apache Sling Validation Framework API .............. SKIPPED
[INFO] Apache Sling Validation Framework Core Implementation SKIPPED
[INFO] Apache Sling Validation Framework Testing Services . SKIPPED
[INFO] Apache Sling Validation Framework Integration Tests SKIPPED
[INFO] Apache Sling Validation Framework Examples ......... SKIPPED
[INFO] Apache Sling Validation Framework Builder .......... SKIPPED
[INFO] Apache Sling Models Validation Implementation ...... SKIPPED
[INFO] Apache Sling Launchpad Testing Services ............ SKIPPED
[INFO] Apache Sling Launchpad Testing Services WAR ........ SKIPPED
[INFO] Apache Sling Launchpad Testing Fragment Bundle ..... SKIPPED
[INFO] Apache Sling Launchpad Test Bundles ................ SKIPPED
[INFO] Apache Sling Integration Tests ..................... SKIPPED
[INFO] Apache Sling Launchpad Testing ..................... SKIPPED
[INFO] Apache Sling (Builder) ............................. SKIPPED
[INFO] ------------------------------------------------------------------------
[INFO] BUILD FAILURE
[INFO] ------------------------------------------------------------------------
[INFO] Total time: 35:34 min
[INFO] Finished at: 2016-08-23T07:19:47+00:00
[INFO] Final Memory: 289M/463M
[INFO] ------------------------------------------------------------------------
Waiting for Jenkins to finish collecting data
[ERROR] Failed to execute goal org.apache.maven.plugins:maven-failsafe-plugin:2.19.1:integration-test (default) on project org.apache.sling.i18n: Execution default of goal org.apache.maven.plugins:maven-failsafe-plugin:2.19.1:integration-test failed: The forked VM terminated without properly saying goodbye. VM crash or System.exit called?
[ERROR] Command was /bin/sh -c cd <https://builds.apache.org/job/sling-trunk-1.8/ws/trunk/bundles/extensions/i18n> && /usr/local/asfpackages/java/jdk1.8.0_102/jre/bin/java -jar <https://builds.apache.org/job/sling-trunk-1.8/ws/trunk/bundles/extensions/i18n/target/surefire/surefirebooter6480312620000584505.jar> <https://builds.apache.org/job/sling-trunk-1.8/ws/trunk/bundles/extensions/i18n/target/surefire/surefire1721322509533707092tmp> <https://builds.apache.org/job/sling-trunk-1.8/ws/trunk/bundles/extensions/i18n/target/surefire/surefire_15059325443231929187tmp>
[ERROR] -> [Help 1]
[ERROR]
[ERROR] To see the full stack trace of the errors, re-run Maven with the -e switch.
[ERROR] Re-run Maven using the -X switch to enable full debug logging.
[ERROR]
[ERROR] For more information about the errors and possible solutions, please read the following articles:
[ERROR] [Help 1] http://cwiki.apache.org/confluence/display/MAVEN/PluginExecutionException
[ERROR]
[ERROR] After correcting the problems, you can resume the build with the command
[ERROR] mvn <goals> -rf :org.apache.sling.i18n
channel stopped
Found 18 test results
Found 95 test results
Found 45 test results
Found 8 test results
Found 4 test results
Found 2 test results
Found 17 test results
Found 4 test results
Found 94 test results
Found 44 test results
Found 10 test results
Found 21 test results
Found 9 test results
Found 36 test results
Found 42 test results
Found 22 test results
Found 10 test results
Found 31 test results
Found 83 test results
Found 50 test results
Found 30 test results
Found 5 test results
Found 95 test results
Found 77 test results
Found 4 test results
Found 94 test results
Found 3 test results
Found 8 test results
Found 2 test results
Found 13 test results
Found 27 test results
Found 3 test results
Found 38 test results
Found 9 test results
Found 96 test results
Found 8 test results
Found 17 test results
Found 45 test results
Found 34 test results
Found 9 test results
Found 94 test results
Found 3 test results
Found 75 test results
Found 184 test results
Found 16 test results
Found 10 test results
Found 49 test results
Found 35 test results
Found 21 test results
Found 210 test results
Found 24 test results
Found 81 test results
Found 27 test results
Found 24 test results
Found 13 test results
Found 2 test results
Found 393 test results
Found 17 test results
Found 28 test results
Found 44 test results
Found 92 test results
Found 18 test results
Found 2 test results
Jenkins build is still unstable: sling-trunk-1.8 #3835
Posted by Apache Jenkins Server <je...@builds.apache.org>.
See <https://builds.apache.org/job/sling-trunk-1.8/3835/>
Jenkins build is still unstable: sling-trunk-1.8 #3834
Posted by Apache Jenkins Server <je...@builds.apache.org>.
See <https://builds.apache.org/job/sling-trunk-1.8/changes>
Jenkins build is still unstable: sling-trunk-1.8 #3833
Posted by Apache Jenkins Server <je...@builds.apache.org>.
See <https://builds.apache.org/job/sling-trunk-1.8/changes>
Jenkins build is unstable: sling-trunk-1.8 #3832
Posted by Apache Jenkins Server <je...@builds.apache.org>.
See <https://builds.apache.org/job/sling-trunk-1.8/3832/changes>
Build failed in Jenkins: sling-trunk-1.8 #3831
Posted by Apache Jenkins Server <je...@builds.apache.org>.
See <https://builds.apache.org/job/sling-trunk-1.8/3831/changes>
Changes:
[radu] SLING-4560 - XSSAPI#getValidHref is empty for valid Bengali or Hindi characters
* applied patch submitted by Lars Krapf to only extend the character classes accepted
by the OWASP URL regexes, instead of completely changing them like in r1756802
[cziegeler] SLING-5986 : Improve shutdown time when system is stopping
------------------------------------------
[...truncated 134427 lines...]
[JENKINS] Archiving disabled
[JENKINS] Archiving disabled
[JENKINS] Archiving disabled
[JENKINS] Archiving disabled
[JENKINS] Archiving disabled
[JENKINS] Archiving disabled[INFO] ------------------------------------------------------------------------
[INFO] Reactor Summary:
[INFO]
[INFO] Apache Sling JAR Resource Bundle ................... SUCCESS [ 10.337 s]
[INFO] Apache Sling (Parent) .............................. SUCCESS [ 16.039 s]
[INFO] Apache Sling Tooling Support Install ............... SUCCESS [ 21.846 s]
[INFO] Apache Sling Provisioning Model .................... SUCCESS [ 36.117 s]
[INFO] Apache Sling Tooling Support Source ................ SUCCESS [ 15.873 s]
[INFO] Apache Sling Testing Utilities ..................... SUCCESS [01:43 min]
[INFO] Apache Sling API ................................... SUCCESS [ 38.069 s]
[INFO] Apache Sling Resource Resolver ..................... SUCCESS [ 39.393 s]
[INFO] Apache Sling System Bundle Extension: Java Transaction API SUCCESS [ 30.724 s]
[INFO] Apache Sling System Bundle Extension: XML APIs ..... SUCCESS [ 27.866 s]
[INFO] Apache Sling System Bundle Extension: Activation API SUCCESS [ 7.639 s]
[INFO] Apache Sling System Bundle Extension: WS APIs ...... SUCCESS [ 12.545 s]
[INFO] Apache Sling Dynamic Class Loader Support .......... SUCCESS [ 27.828 s]
[INFO] Apache Sling Commons FileSystem ClassLoader ........ SUCCESS [ 16.973 s]
[INFO] Apache Sling Commons Java Compiler ................. SUCCESS [ 9.866 s]
[INFO] Apache Sling JSON Library .......................... SUCCESS [ 19.084 s]
[INFO] Apache Sling SLF4J Implementation (Logback) ........ SUCCESS [01:13 min]
[INFO] Apache Sling OSGi LogService Implementation ........ SUCCESS [ 11.350 s]
[INFO] Apache Sling MIME type mapping support ............. SUCCESS [ 12.831 s]
[INFO] Apache Sling Content Detection Support ............. SUCCESS [02:56 min]
[INFO] Apache Sling Commons OSGi support .................. SUCCESS [ 17.726 s]
[INFO] Apache Sling Scheduler Support ..................... SUCCESS [ 13.486 s]
[INFO] Apache Sling Thread Dumper ......................... SUCCESS [ 8.994 s]
[INFO] Apache Sling Thread Support ........................ SUCCESS [ 11.507 s]
[INFO] Apache Sling Metrics ............................... SUCCESS [ 10.937 s]
[INFO] Apache Sling Authentication Service ................ SUCCESS [ 17.011 s]
[INFO] Apache Sling Form Based Authentication Handler ..... SUCCESS [ 18.447 s]
[INFO] Apache Sling Engine Implementation ................. SUCCESS [ 23.965 s]
[INFO] Apache Sling Repository API Bundle ................. SUCCESS [ 5.889 s]
[INFO] Apache Sling JCR Base Bundle ....................... SUCCESS [ 7.863 s]
[INFO] Apache Sling Pax Exam Utilities .................... SUCCESS [02:25 min]
[INFO] Apache Sling Initial Content Loader ................ SUCCESS [04:26 min]
[INFO] Apache Sling Jackrabbit Embedded Repository ........ SUCCESS [ 20.114 s]
[INFO] Apache Sling Jackrabbit UserManager Support ........ SUCCESS [ 14.822 s]
[INFO] Apache Sling Jackrabbit JSR-283 Access Control Manager Support SUCCESS [ 15.922 s]
[INFO] Apache Sling Wrapper Bundle for the JCR API ........ SUCCESS [ 10.755 s]
[INFO] Apache Sling JCR Resource Resolver ................. SUCCESS [02:31 min]
[INFO] Apache Sling Versioning Integration Tests .......... SUCCESS [01:34 min]
[INFO] Apache Sling JCR Repository Registration ........... SUCCESS [ 17.119 s]
[INFO] Apache Sling Simple WebDAV Access to repositories .. SUCCESS [ 11.113 s]
[INFO] Apache Sling DavEx Access to repositories .......... SUCCESS [ 23.793 s]
[INFO] Apache Sling JCR WebConsole Bundle ................. SUCCESS [ 6.209 s]
[INFO] Apache Sling JCR Oak Repository Server ............. SUCCESS [ 53.051 s]
[INFO] Apache Sling SlingRepository Integration Tests ..... SUCCESS [03:16 min]
[INFO] Apache Sling RepoInit Parser ....................... SUCCESS [ 10.195 s]
[INFO] Apache Sling RepoInit JCR module ................... SUCCESS [ 16.562 s]
[INFO] Apache Sling Servlet Resolver ...................... SUCCESS [ 14.568 s]
[INFO] Apache Sling Default GET Servlets .................. SUCCESS [ 21.237 s]
[INFO] Apache Sling Default POST Servlets ................. SUCCESS [ 12.970 s]
[INFO] Apache Sling Compat Servlets ....................... SUCCESS [ 5.707 s]
[INFO] Apache Sling Scripting Implementation API .......... SUCCESS [ 4.858 s]
[INFO] Apache Sling Scripting Core implementation ......... SUCCESS [ 52.477 s]
[INFO] Apache Sling Scripting JavaScript Support .......... SUCCESS [01:45 min]
[INFO] Apache Sling Scripting JSP Support ................. SUCCESS [ 13.325 s]
[INFO] Apache Sling JSP Tag Library ....................... SUCCESS [ 12.702 s]
[INFO] Apache Sling JSP Standard Tag Library .............. SUCCESS [ 4.178 s]
[INFO] Apache Sling Scripting Sightly Compiler ............ SUCCESS [ 32.694 s]
[INFO] Apache Sling Scripting Sightly Java Compiler ....... SUCCESS [ 15.747 s]
[INFO] Apache Sling Scripting Sightly Engine .............. SUCCESS [ 18.602 s]
[INFO] Apache Sling Scripting Sightly JavaScript Use Provider SUCCESS [ 5.299 s]
[INFO] Apache Sling Scripting Sightly Models Use Provider . SUCCESS [ 8.651 s]
[INFO] Apache Sling Scripting Sightly Read-Eval-Print Loop Environment SUCCESS [ 5.325 s]
[INFO] Apache Sling Scripting Sightly Integration Tests Content SUCCESS [ 10.043 s]
[INFO] Apache Sling Launchpad Base ........................ SUCCESS [ 27.215 s]
[INFO] Apache Sling Subsystems Base Installer ............. SUCCESS [ 7.815 s]
[INFO] Apache Sling Filesystem Resource Provider .......... SUCCESS [ 6.250 s]
[INFO] Apache Sling Installer WebConsole Plugin ........... SUCCESS [ 4.569 s]
[INFO] Apache Sling JCR Installer ......................... SUCCESS [03:35 min]
[INFO] Apache Sling Launchpad Application Builder ......... SUCCESS [01:31 min]
[INFO] Apache Sling Scripting Sightly Integration Tests ... SUCCESS [02:31 min]
[INFO] Apache Sling Scripting Sightly Reactor ............. SUCCESS [ 6.880 s]
[INFO] Apache Sling Adapter Manager Implementation ........ SUCCESS [ 10.738 s]
[INFO] Apache Sling Bundle Resource Provider .............. SUCCESS [ 17.942 s]
[INFO] Apache Sling Distributed Event Admin ............... SUCCESS [ 12.101 s]
[INFO] Apache Sling Discovery API ......................... SUCCESS [ 10.649 s]
[INFO] Apache Sling Discovery Commons ..................... SUCCESS [02:12 min]
[INFO] Apache Sling Discovery Base ........................ SUCCESS [04:13 min]
[INFO] Apache Sling Resource-Based Discovery Service ...... SUCCESS [07:48 min]
[INFO] Apache Sling Oak-Based Discovery Service ........... SUCCESS [02:47 min]
[INFO] Apache Sling Discovery Support Bundle .............. SUCCESS [ 5.661 s]
[INFO] Apache Sling Discovery Standalone Implementation ... SUCCESS [ 7.445 s]
[INFO] Apache Sling Event Support ......................... SUCCESS [27:20 min]
[INFO] Apache Sling Feature Flags ......................... SUCCESS [ 5.312 s]
[INFO] Apache Sling javax.activation bundle ............... SUCCESS [ 3.703 s]
[INFO] Apache Sling Service User Mapper ................... SUCCESS [ 5.338 s]
[INFO] Apache Sling Settings .............................. SUCCESS [ 5.332 s]
[INFO] Apache Sling Web Console Branding .................. SUCCESS [ 2.648 s]
[INFO] Apache Sling Web Console Security Provider ......... SUCCESS [ 5.592 s]
[INFO] Apache Sling Explorer .............................. SUCCESS [ 4.421 s]
[INFO] Apache Sling Health Check Core ..................... SUCCESS [03:47 min]
[INFO] Apache Sling Health Check Samples .................. SUCCESS [ 10.567 s]
[INFO] Apache Sling Health Check Support Components ....... SUCCESS [ 6.999 s]
[INFO] Apache Sling Health Check Webconsole Plugin ........ SUCCESS [ 5.069 s]
[INFO] Apache Sling Health Check JUnit Bridge ............. SUCCESS [ 6.573 s]
[INFO] Apache Sling Health Check Annotations .............. SUCCESS [ 3.085 s]
[INFO] Apache Sling Health Check Integration Tests ........ SUCCESS [ 15.352 s]
[INFO] Apache Sling Health Check Reactor POM .............. SUCCESS [ 2.314 s]
[INFO] Apache Sling Resource Access Security .............. SUCCESS [ 3.839 s]
[INFO] Apache Sling Resource Access Security Integration Tests SUCCESS [01:57 min]
[INFO] Apache Sling Models API ............................ SUCCESS [ 5.366 s]
[INFO] Apache Sling Models Implementation ................. SUCCESS [ 11.796 s]
[INFO] Apache Sling Models Integration Tests .............. SUCCESS [01:57 min]
[INFO] Apache Sling Internationalization Support .......... FAILURE [02:14 min]
[INFO] Apache Sling XSS Protection Bundle ................. SKIPPED
[INFO] Apache Sling JUnit Core ............................ SKIPPED
[INFO] Apache Sling JUnit Tests Teleporter ................ SKIPPED
[INFO] Apache Sling Resource Builder ...................... SKIPPED
[INFO] Apache Sling Servlet Helpers ....................... SKIPPED
[INFO] Apache Sling RepoInit Integration Tests ............ SKIPPED
[INFO] Apache Sling RepoInit Reactor ...................... SKIPPED
[INFO] Apache Sling Test Tools ............................ SKIPPED
[INFO] Apache Sling Testing Clients ....................... SKIPPED
[INFO] Apache Sling Testing Hamcrest ...................... SKIPPED
[INFO] Apache Sling Server Setup Tools .................... SKIPPED
[INFO] Apache Sling Testing Rules ......................... SKIPPED
[INFO] Apache Sling JUnit Scriptable Tests Provider ....... SKIPPED
[INFO] Apache Sling JUnit Health Checks ................... SKIPPED
[INFO] Apache Sling JUnit Remote Tests Runners ............ SKIPPED
[INFO] Apache Sling JUnit Performance ..................... SKIPPED
[INFO] Apache Sling Testing Mock Log Configuration ........ SKIPPED
[INFO] Apache Sling Testing Resource Resolver Mock ........ SKIPPED
[INFO] Apache Sling Testing JCR Mock ...................... SKIPPED
[INFO] Apache Sling Testing OSGi Mock ..................... SKIPPED
[INFO] Apache Sling Testing Sling Mock .................... SKIPPED
[INFO] Apache Sling Testing Sling Mock Oak-based Resource Resolver SKIPPED
[INFO] Apache Sling Testing Mocks Modules Reactor ......... SKIPPED
[INFO] Apache Sling Testing - sample bundle with integration tests SKIPPED
[INFO] Apache Sling Testing - sample module with integration tests SKIPPED
[INFO] Apache Sling Testing PaxExam ....................... SKIPPED
[INFO] Apache Sling Testing Modules Reactor ............... SKIPPED
[INFO] Apache Sling Installer ............................. SKIPPED
[INFO] Apache Sling File Installer ........................ SKIPPED
[INFO] Apache Sling Installer Configuration Admin Support . SKIPPED
[INFO] Apache Sling Deployment Package Installer .......... SKIPPED
[INFO] Apache Sling Subsystems Installer .................. SKIPPED
[INFO] Apache Sling Installer Health Checks ............... SKIPPED
[INFO] Apache Sling Installer Integration Tests ........... SKIPPED
[INFO] Apache Sling Launchpad API ......................... SKIPPED
[INFO] Apache Sling Launchpad Installer ................... SKIPPED
[INFO] Apache Sling Launchpad Content ..................... SKIPPED
[INFO] Apache Sling Validation Framework API .............. SKIPPED
[INFO] Apache Sling Validation Framework Core Implementation SKIPPED
[INFO] Apache Sling Validation Framework Testing Services . SKIPPED
[INFO] Apache Sling Validation Framework Integration Tests SKIPPED
[INFO] Apache Sling Validation Framework Examples ......... SKIPPED
[INFO] Apache Sling Validation Framework Builder .......... SKIPPED
[INFO] Apache Sling Models Validation Implementation ...... SKIPPED
[INFO] Apache Sling Launchpad Testing Services ............ SKIPPED
[INFO] Apache Sling Launchpad Testing Services WAR ........ SKIPPED
[INFO] Apache Sling Launchpad Testing Fragment Bundle ..... SKIPPED
[INFO] Apache Sling Launchpad Test Bundles ................ SKIPPED
[INFO] Apache Sling Integration Tests ..................... SKIPPED
[INFO] Apache Sling Launchpad Testing ..................... SKIPPED
[INFO] Apache Sling (Builder) ............................. SKIPPED
[INFO] ------------------------------------------------------------------------
[INFO] BUILD FAILURE
[INFO] ------------------------------------------------------------------------
[INFO] Total time: 01:54 h
[INFO] Finished at: 2016-08-22T15:10:51+00:00
[INFO] Final Memory: 281M/476M
[INFO] ------------------------------------------------------------------------
Waiting for Jenkins to finish collecting data
[ERROR] Failed to execute goal org.apache.maven.plugins:maven-failsafe-plugin:2.19.1:integration-test (default) on project org.apache.sling.i18n: Execution default of goal org.apache.maven.plugins:maven-failsafe-plugin:2.19.1:integration-test failed: The forked VM terminated without properly saying goodbye. VM crash or System.exit called?
[ERROR] Command was /bin/sh -c cd <https://builds.apache.org/job/sling-trunk-1.8/ws/trunk/bundles/extensions/i18n> && /usr/local/asfpackages/java/jdk1.8.0_102/jre/bin/java -jar <https://builds.apache.org/job/sling-trunk-1.8/ws/trunk/bundles/extensions/i18n/target/surefire/surefirebooter2566557809862638553.jar> <https://builds.apache.org/job/sling-trunk-1.8/ws/trunk/bundles/extensions/i18n/target/surefire/surefire3550362457393871412tmp> <https://builds.apache.org/job/sling-trunk-1.8/ws/trunk/bundles/extensions/i18n/target/surefire/surefire_17057142365943544897tmp>
[ERROR] -> [Help 1]
[ERROR]
[ERROR] To see the full stack trace of the errors, re-run Maven with the -e switch.
[ERROR] Re-run Maven using the -X switch to enable full debug logging.
[ERROR]
[ERROR] For more information about the errors and possible solutions, please read the following articles:
[ERROR] [Help 1] http://cwiki.apache.org/confluence/display/MAVEN/PluginExecutionException
[ERROR]
[ERROR] After correcting the problems, you can resume the build with the command
[ERROR] mvn <goals> -rf :org.apache.sling.i18n
channel stopped
Found 18 test results
Found 95 test results
Found 45 test results
Found 8 test results
Found 4 test results
Found 2 test results
Found 17 test results
Found 4 test results
Found 94 test results
Found 44 test results
Found failed test junit/org.apache.sling.commons.log.logback.integration/ITConfigFragments
Found failed test junit/org.apache.sling.commons.log.logback.integration/ITConfigFragments/testConfigProviderWithListener
Found 10 test results
Found 21 test results
Found 9 test results
Found 36 test results
Found 42 test results
Found 22 test results
Found 10 test results
Found 31 test results
Found 83 test results
Found 50 test results
Found 30 test results
Found 5 test results
Found 95 test results
Found 77 test results
Found 4 test results
Found 94 test results
Found 3 test results
Found 8 test results
Found 2 test results
Found 13 test results
Found 27 test results
Found 3 test results
Found 38 test results
Found 9 test results
Found 96 test results
Found 8 test results
Found 17 test results
Found 45 test results
Found 34 test results
Found 9 test results
Found 94 test results
Found 3 test results
Found 75 test results
Found 184 test results
Found 16 test results
Found 10 test results
Found 49 test results
Found 35 test results
Found 21 test results
Found 210 test results
Found 24 test results
Found 81 test results
Found 27 test results
Found 24 test results
Found 13 test results
Found 2 test results
Found 393 test results
Found 17 test results
Found 28 test results
Found 44 test results
Found 92 test results
Found 18 test results
Found 2 test results
Jenkins build is unstable: sling-trunk-1.8 #3830
Posted by Apache Jenkins Server <je...@builds.apache.org>.
See <https://builds.apache.org/job/sling-trunk-1.8/3830/changes>
Build failed in Jenkins: sling-trunk-1.8 #3829
Posted by Apache Jenkins Server <je...@builds.apache.org>.
See <https://builds.apache.org/job/sling-trunk-1.8/3829/changes>
Changes:
[bdelacretaz] SLING-5888 - clearer (I think) log messages
------------------------------------------
[...truncated 141232 lines...]
[JENKINS] Archiving disabled
[JENKINS] Archiving disabled
[JENKINS] Archiving disabled
[JENKINS] Archiving disabled[INFO] ------------------------------------------------------------------------
[INFO] Reactor Summary:
[INFO]
[INFO] Apache Sling JAR Resource Bundle ................... SUCCESS [ 5.472 s]
[INFO] Apache Sling (Parent) .............................. SUCCESS [ 7.608 s]
[INFO] Apache Sling Tooling Support Install ............... SUCCESS [ 11.431 s]
[INFO] Apache Sling Provisioning Model .................... SUCCESS [ 16.808 s]
[INFO] Apache Sling Tooling Support Source ................ SUCCESS [ 5.471 s]
[INFO] Apache Sling Testing Utilities ..................... SUCCESS [ 43.055 s]
[INFO] Apache Sling API ................................... SUCCESS [ 12.629 s]
[INFO] Apache Sling Resource Resolver ..................... SUCCESS [ 15.861 s]
[INFO] Apache Sling System Bundle Extension: Java Transaction API SUCCESS [ 4.764 s]
[INFO] Apache Sling System Bundle Extension: XML APIs ..... SUCCESS [ 2.894 s]
[INFO] Apache Sling System Bundle Extension: Activation API SUCCESS [ 3.795 s]
[INFO] Apache Sling System Bundle Extension: WS APIs ...... SUCCESS [ 3.652 s]
[INFO] Apache Sling Dynamic Class Loader Support .......... SUCCESS [ 19.881 s]
[INFO] Apache Sling Commons FileSystem ClassLoader ........ SUCCESS [ 6.324 s]
[INFO] Apache Sling Commons Java Compiler ................. SUCCESS [ 6.646 s]
[INFO] Apache Sling JSON Library .......................... SUCCESS [ 11.127 s]
[INFO] Apache Sling SLF4J Implementation (Logback) ........ SUCCESS [ 51.370 s]
[INFO] Apache Sling OSGi LogService Implementation ........ SUCCESS [ 7.085 s]
[INFO] Apache Sling MIME type mapping support ............. SUCCESS [ 6.492 s]
[INFO] Apache Sling Content Detection Support ............. SUCCESS [01:18 min]
[INFO] Apache Sling Commons OSGi support .................. SUCCESS [ 12.919 s]
[INFO] Apache Sling Scheduler Support ..................... SUCCESS [ 9.700 s]
[INFO] Apache Sling Thread Dumper ......................... SUCCESS [ 5.970 s]
[INFO] Apache Sling Thread Support ........................ SUCCESS [ 6.861 s]
[INFO] Apache Sling Metrics ............................... SUCCESS [ 9.407 s]
[INFO] Apache Sling Authentication Service ................ SUCCESS [ 9.759 s]
[INFO] Apache Sling Form Based Authentication Handler ..... SUCCESS [ 15.299 s]
[INFO] Apache Sling Engine Implementation ................. SUCCESS [ 20.325 s]
[INFO] Apache Sling Repository API Bundle ................. SUCCESS [ 5.783 s]
[INFO] Apache Sling JCR Base Bundle ....................... SUCCESS [ 10.744 s]
[INFO] Apache Sling Pax Exam Utilities .................... SUCCESS [01:15 min]
[INFO] Apache Sling Initial Content Loader ................ SUCCESS [02:09 min]
[INFO] Apache Sling Jackrabbit Embedded Repository ........ SUCCESS [ 14.289 s]
[INFO] Apache Sling Jackrabbit UserManager Support ........ SUCCESS [ 5.543 s]
[INFO] Apache Sling Jackrabbit JSR-283 Access Control Manager Support SUCCESS [ 3.648 s]
[INFO] Apache Sling Wrapper Bundle for the JCR API ........ SUCCESS [ 6.270 s]
[INFO] Apache Sling JCR Resource Resolver ................. SUCCESS [01:26 min]
[INFO] Apache Sling Versioning Integration Tests .......... SUCCESS [ 36.760 s]
[INFO] Apache Sling JCR Repository Registration ........... SUCCESS [ 6.663 s]
[INFO] Apache Sling Simple WebDAV Access to repositories .. SUCCESS [ 4.848 s]
[INFO] Apache Sling DavEx Access to repositories .......... SUCCESS [ 6.924 s]
[INFO] Apache Sling JCR WebConsole Bundle ................. SUCCESS [ 2.774 s]
[INFO] Apache Sling JCR Oak Repository Server ............. SUCCESS [ 33.061 s]
[INFO] Apache Sling SlingRepository Integration Tests ..... SUCCESS [01:59 min]
[INFO] Apache Sling RepoInit Parser ....................... SUCCESS [ 5.586 s]
[INFO] Apache Sling RepoInit JCR module ................... SUCCESS [ 23.553 s]
[INFO] Apache Sling Servlet Resolver ...................... SUCCESS [ 5.818 s]
[INFO] Apache Sling Default GET Servlets .................. SUCCESS [ 8.234 s]
[INFO] Apache Sling Default POST Servlets ................. SUCCESS [ 6.271 s]
[INFO] Apache Sling Compat Servlets ....................... SUCCESS [ 3.226 s]
[INFO] Apache Sling Scripting Implementation API .......... SUCCESS [ 3.417 s]
[INFO] Apache Sling Scripting Core implementation ......... SUCCESS [ 27.885 s]
[INFO] Apache Sling Scripting JavaScript Support .......... SUCCESS [ 48.899 s]
[INFO] Apache Sling Scripting JSP Support ................. SUCCESS [ 7.276 s]
[INFO] Apache Sling JSP Tag Library ....................... SUCCESS [ 6.712 s]
[INFO] Apache Sling JSP Standard Tag Library .............. SUCCESS [ 3.131 s]
[INFO] Apache Sling Scripting Sightly Compiler ............ SUCCESS [ 29.627 s]
[INFO] Apache Sling Scripting Sightly Java Compiler ....... SUCCESS [ 16.501 s]
[INFO] Apache Sling Scripting Sightly Engine .............. SUCCESS [ 19.269 s]
[INFO] Apache Sling Scripting Sightly JavaScript Use Provider SUCCESS [ 3.743 s]
[INFO] Apache Sling Scripting Sightly Models Use Provider . SUCCESS [ 3.419 s]
[INFO] Apache Sling Scripting Sightly Read-Eval-Print Loop Environment SUCCESS [ 2.997 s]
[INFO] Apache Sling Scripting Sightly Integration Tests Content SUCCESS [ 5.858 s]
[INFO] Apache Sling Launchpad Base ........................ SUCCESS [ 18.554 s]
[INFO] Apache Sling Subsystems Base Installer ............. SUCCESS [ 3.933 s]
[INFO] Apache Sling Filesystem Resource Provider .......... SUCCESS [ 2.983 s]
[INFO] Apache Sling Installer WebConsole Plugin ........... SUCCESS [ 2.696 s]
[INFO] Apache Sling JCR Installer ......................... SUCCESS [02:31 min]
[INFO] Apache Sling Launchpad Application Builder ......... SUCCESS [01:00 min]
[INFO] Apache Sling Scripting Sightly Integration Tests ... SUCCESS [02:44 min]
[INFO] Apache Sling Scripting Sightly Reactor ............. SUCCESS [ 2.015 s]
[INFO] Apache Sling Adapter Manager Implementation ........ SUCCESS [ 4.674 s]
[INFO] Apache Sling Bundle Resource Provider .............. SUCCESS [ 3.296 s]
[INFO] Apache Sling Distributed Event Admin ............... SUCCESS [ 3.874 s]
[INFO] Apache Sling Discovery API ......................... SUCCESS [ 2.338 s]
[INFO] Apache Sling Discovery Commons ..................... SUCCESS [01:16 min]
[INFO] Apache Sling Discovery Base ........................ SUCCESS [01:24 min]
[INFO] Apache Sling Resource-Based Discovery Service ...... SUCCESS [04:02 min]
[INFO] Apache Sling Oak-Based Discovery Service ........... SUCCESS [02:37 min]
[INFO] Apache Sling Discovery Support Bundle .............. SUCCESS [ 2.658 s]
[INFO] Apache Sling Discovery Standalone Implementation ... SUCCESS [ 3.710 s]
[INFO] Apache Sling Event Support ......................... SUCCESS [27:59 min]
[INFO] Apache Sling Feature Flags ......................... SUCCESS [ 14.287 s]
[INFO] Apache Sling javax.activation bundle ............... SUCCESS [ 5.800 s]
[INFO] Apache Sling Service User Mapper ................... SUCCESS [ 6.116 s]
[INFO] Apache Sling Settings .............................. SUCCESS [ 6.982 s]
[INFO] Apache Sling Web Console Branding .................. SUCCESS [ 8.681 s]
[INFO] Apache Sling Web Console Security Provider ......... SUCCESS [ 9.590 s]
[INFO] Apache Sling Explorer .............................. SUCCESS [ 13.337 s]
[INFO] Apache Sling Health Check Core ..................... SUCCESS [02:54 min]
[INFO] Apache Sling Health Check Samples .................. SUCCESS [ 39.303 s]
[INFO] Apache Sling Health Check Support Components ....... SUCCESS [ 13.562 s]
[INFO] Apache Sling Health Check Webconsole Plugin ........ SUCCESS [ 13.881 s]
[INFO] Apache Sling Health Check JUnit Bridge ............. SUCCESS [ 13.428 s]
[INFO] Apache Sling Health Check Annotations .............. SUCCESS [ 8.118 s]
[INFO] Apache Sling Health Check Integration Tests ........ SUCCESS [ 18.887 s]
[INFO] Apache Sling Health Check Reactor POM .............. SUCCESS [ 11.419 s]
[INFO] Apache Sling Resource Access Security .............. SUCCESS [ 23.830 s]
[INFO] Apache Sling Resource Access Security Integration Tests SUCCESS [01:16 min]
[INFO] Apache Sling Models API ............................ SUCCESS [ 9.774 s]
[INFO] Apache Sling Models Implementation ................. SUCCESS [ 18.777 s]
[INFO] Apache Sling Models Integration Tests .............. SUCCESS [01:22 min]
[INFO] Apache Sling Internationalization Support .......... FAILURE [01:49 min]
[INFO] Apache Sling XSS Protection Bundle ................. SKIPPED
[INFO] Apache Sling JUnit Core ............................ SKIPPED
[INFO] Apache Sling JUnit Tests Teleporter ................ SKIPPED
[INFO] Apache Sling Resource Builder ...................... SKIPPED
[INFO] Apache Sling Servlet Helpers ....................... SKIPPED
[INFO] Apache Sling RepoInit Integration Tests ............ SKIPPED
[INFO] Apache Sling RepoInit Reactor ...................... SKIPPED
[INFO] Apache Sling Test Tools ............................ SKIPPED
[INFO] Apache Sling Testing Clients ....................... SKIPPED
[INFO] Apache Sling Testing Hamcrest ...................... SKIPPED
[INFO] Apache Sling Server Setup Tools .................... SKIPPED
[INFO] Apache Sling Testing Rules ......................... SKIPPED
[INFO] Apache Sling JUnit Scriptable Tests Provider ....... SKIPPED
[INFO] Apache Sling JUnit Health Checks ................... SKIPPED
[INFO] Apache Sling JUnit Remote Tests Runners ............ SKIPPED
[INFO] Apache Sling JUnit Performance ..................... SKIPPED
[INFO] Apache Sling Testing Mock Log Configuration ........ SKIPPED
[INFO] Apache Sling Testing Resource Resolver Mock ........ SKIPPED
[INFO] Apache Sling Testing JCR Mock ...................... SKIPPED
[INFO] Apache Sling Testing OSGi Mock ..................... SKIPPED
[INFO] Apache Sling Testing Sling Mock .................... SKIPPED
[INFO] Apache Sling Testing Sling Mock Oak-based Resource Resolver SKIPPED
[INFO] Apache Sling Testing Mocks Modules Reactor ......... SKIPPED
[INFO] Apache Sling Testing - sample bundle with integration tests SKIPPED
[INFO] Apache Sling Testing - sample module with integration tests SKIPPED
[INFO] Apache Sling Testing PaxExam ....................... SKIPPED
[INFO] Apache Sling Testing Modules Reactor ............... SKIPPED
[INFO] Apache Sling Installer ............................. SKIPPED
[INFO] Apache Sling File Installer ........................ SKIPPED
[INFO] Apache Sling Installer Configuration Admin Support . SKIPPED
[INFO] Apache Sling Deployment Package Installer .......... SKIPPED
[INFO] Apache Sling Subsystems Installer .................. SKIPPED
[INFO] Apache Sling Installer Health Checks ............... SKIPPED
[INFO] Apache Sling Installer Integration Tests ........... SKIPPED
[INFO] Apache Sling Launchpad API ......................... SKIPPED
[INFO] Apache Sling Launchpad Installer ................... SKIPPED
[INFO] Apache Sling Launchpad Content ..................... SKIPPED
[INFO] Apache Sling Validation Framework API .............. SKIPPED
[INFO] Apache Sling Validation Framework Core Implementation SKIPPED
[INFO] Apache Sling Validation Framework Testing Services . SKIPPED
[INFO] Apache Sling Validation Framework Integration Tests SKIPPED
[INFO] Apache Sling Validation Framework Examples ......... SKIPPED
[INFO] Apache Sling Validation Framework Builder .......... SKIPPED
[INFO] Apache Sling Models Validation Implementation ...... SKIPPED
[INFO] Apache Sling Launchpad Testing Services ............ SKIPPED
[INFO] Apache Sling Launchpad Testing Services WAR ........ SKIPPED
[INFO] Apache Sling Launchpad Testing Fragment Bundle ..... SKIPPED
[INFO] Apache Sling Launchpad Test Bundles ................ SKIPPED
[INFO] Apache Sling Integration Tests ..................... SKIPPED
[INFO] Apache Sling Launchpad Testing ..................... SKIPPED
[INFO] Apache Sling (Builder) ............................. SKIPPED
[INFO] ------------------------------------------------------------------------
[INFO] BUILD FAILURE
[INFO] ------------------------------------------------------------------------
[INFO] Total time: 01:23 h
[INFO] Finished at: 2016-08-22T09:36:34+00:00
[INFO] Final Memory: 281M/454M
[INFO] ------------------------------------------------------------------------
Waiting for Jenkins to finish collecting data
[ERROR] Failed to execute goal org.apache.maven.plugins:maven-failsafe-plugin:2.19.1:integration-test (default) on project org.apache.sling.i18n: Execution default of goal org.apache.maven.plugins:maven-failsafe-plugin:2.19.1:integration-test failed: The forked VM terminated without properly saying goodbye. VM crash or System.exit called?
[ERROR] Command was /bin/sh -c cd <https://builds.apache.org/job/sling-trunk-1.8/ws/trunk/bundles/extensions/i18n> && /usr/local/asfpackages/java/jdk1.8.0_102/jre/bin/java -jar <https://builds.apache.org/job/sling-trunk-1.8/ws/trunk/bundles/extensions/i18n/target/surefire/surefirebooter2536937627721977603.jar> <https://builds.apache.org/job/sling-trunk-1.8/ws/trunk/bundles/extensions/i18n/target/surefire/surefire8219829105576951452tmp> <https://builds.apache.org/job/sling-trunk-1.8/ws/trunk/bundles/extensions/i18n/target/surefire/surefire_13808900008337195713tmp>
[ERROR] -> [Help 1]
[ERROR]
[ERROR] To see the full stack trace of the errors, re-run Maven with the -e switch.
[ERROR] Re-run Maven using the -X switch to enable full debug logging.
[ERROR]
[ERROR] For more information about the errors and possible solutions, please read the following articles:
[ERROR] [Help 1] http://cwiki.apache.org/confluence/display/MAVEN/PluginExecutionException
[ERROR]
[ERROR] After correcting the problems, you can resume the build with the command
[ERROR] mvn <goals> -rf :org.apache.sling.i18n
channel stopped
Found 18 test results
Found 95 test results
Found 45 test results
Found 8 test results
Found 4 test results
Found 2 test results
Found 17 test results
Found 4 test results
Found 94 test results
Found 44 test results
Found 10 test results
Found 21 test results
Found 9 test results
Found 36 test results
Found 42 test results
Found 22 test results
Found 10 test results
Found 31 test results
Found 83 test results
Found 50 test results
Found 30 test results
Found 5 test results
Found 95 test results
Found 77 test results
Found failed test junit/org.apache.sling.event.it/ChaosTest
Found failed test junit/org.apache.sling.event.it/ChaosTest/testDoChaos
Found 4 test results
Found 94 test results
Found 3 test results
Found 8 test results
Found 2 test results
Found 13 test results
Found 27 test results
Found 3 test results
Found 38 test results
Found failed test junit/org.apache.sling.installer.provider.jcr.impl/RootFolderMoveListenerTest
Found failed test junit/org.apache.sling.installer.provider.jcr.impl/RootFolderMoveListenerTest/testMove
Found 9 test results
Found 96 test results
Found 8 test results
Found 17 test results
Found 45 test results
Found 34 test results
Found 9 test results
Found 94 test results
Found 3 test results
Found 75 test results
Found 184 test results
Found 16 test results
Found 10 test results
Found 49 test results
Found 35 test results
Found 21 test results
Found 210 test results
Found 24 test results
Found 81 test results
Found 27 test results
Found 24 test results
Found 13 test results
Found 2 test results
Found 393 test results
Found 17 test results
Found 28 test results
Found 44 test results
Found 92 test results
Found 18 test results
Found 2 test results