You are viewing a plain text version of this content. The canonical link for it is here.
Posted to commits@tomee.apache.org by Apache Jenkins Server <je...@builds.apache.org> on 2026/09/30 12:20:38 UTC
Build failed in Jenkins: TomEE » tomee-10-build-full-tck #119
See <https://ci-builds.apache.org/job/Tomee/job/tomee-10-build-full-tck/119/display/redirect?page=changes>
Changes:
[github] TOMEE-4677 - [tomee-10.x]: Bump tomcat.version from 10.1.59 to 10.1.60 (#2967)
[github] TOMEE-4718 - [tomee-10.x]: Bump version.myfaces from 4.0.3 to 4.0.4 (#2977)
[github] TOMEE-4694 - [tomee-10.x]: Bump version.activemq from 6.2.9 to 6.2.10 (#2979)
[github] TOMEE-4719 - [tomee-10.x]: Bump org.bitbucket.b_c:jose4j from 0.9.6 to 0.9.7 (#2984)
[github] TOMEE-4720 - [tomee-10.x]: Bump org.yaml:snakeyaml from 2.6 to 2.7 (#2973)
[github] [tomee-10.x]: Bump org.apache.maven.plugin-tools:maven-plugin-annotations from 3.15.2 to 3.16.0 (#2980)
[github] [tomee-10.x]: Bump org.apache:apache from 39 to 40 (#2969)
[github] [tomee-10.x]: Bump version.hibernate.orm from 6.6.56.Final to 6.6.58.Final (#2985)
[github] [tomee-10.x]: Bump org.mockito:mockito-core from 5.23.0 to 5.24.0 (#2970)
------------------------------------------
[...truncated 910.57 KiB...]
[INFO] TomEE :: Connector Examples :: Connector in EAR :: Connector Impl 10.2.1-SNAPSHOT SUCCESS [ 0.322 s]
[INFO] TomEE :: Connector Examples :: Connector in EAR :: RAR Packaging 10.2.1-SNAPSHOT SUCCESS [ 0.681 s]
[INFO] TomEE :: Connector Examples :: Connector in EAR :: Sample WAR 10.2.1-SNAPSHOT SUCCESS [ 0.189 s]
[INFO] TomEE :: Connector Examples :: Connector in EAR :: EAR Packaging 10.2.1-SNAPSHOT SUCCESS [ 0.473 s]
[INFO] TomEE :: Connector Examples :: Connector in EAR :: Functional Tests 10.2.1-SNAPSHOT SUCCESS [ 0.892 s]
[INFO] TomEE :: Connector Examples :: Connector in WAR 10.2.1-SNAPSHOT SUCCESS [ 0.633 s]
[INFO] TomEE :: Examples :: Cucumber JVM 10.2.1-SNAPSHOT .. SUCCESS [ 0.701 s]
[INFO] TomEE :: Examples :: Expanded support for Env Entries 10.2.1-SNAPSHOT SUCCESS [ 0.305 s]
[INFO] TomEE :: Examples :: Datasource Ciphered Password 10.2.1-SNAPSHOT SUCCESS [ 0.300 s]
[INFO] TomEE :: Examples :: Datasource Definition 10.2.1-SNAPSHOT SUCCESS [ 0.322 s]
[INFO] TomEE :: Examples :: Datasource Versioning 10.2.1-SNAPSHOT SUCCESS [ 0.885 s]
[INFO] TomEE :: Examples :: Decorators 10.2.1-SNAPSHOT .... SUCCESS [ 0.295 s]
[INFO] TomEE :: Examples :: Dynamic DAO Implementation 10.2.1-SNAPSHOT SUCCESS [ 0.274 s]
[INFO] TomEE :: Examples :: Dynamic Datasource Routing 10.2.1-SNAPSHOT SUCCESS [ 0.361 s]
[INFO] TomEE :: Examples :: Dynamic Implementation 10.2.1-SNAPSHOT SUCCESS [ 0.247 s]
[INFO] TomEE :: Examples :: Dynamic MBean Proxy 10.2.1-SNAPSHOT SUCCESS [ 0.294 s]
[INFO] TomEE :: Examples :: Ear Testing 10.2.1-SNAPSHOT ... SUCCESS [ 0.010 s]
[INFO] TomEE :: Examples :: Ear Testing :: Business Model 10.2.1-SNAPSHOT SUCCESS [ 0.090 s]
[INFO] TomEE :: Examples :: Ear Testing :: Business Logic 10.2.1-SNAPSHOT SUCCESS [ 0.300 s]
[INFO] TomEE :: Web Examples :: EJB Examples War 10.2.1-SNAPSHOT SUCCESS [ 0.239 s]
[INFO] TomEE :: Web Examples :: EJB Remote Call 10.2.1-SNAPSHOT SUCCESS [ 0.242 s]
[INFO] TomEE :: Web Examples :: EJB Remote Call 10.2.1-SNAPSHOT SUCCESS [ 0.153 s]
[INFO] TomEE :: Web Examples :: EJB WebService 10.2.1-SNAPSHOT SUCCESS [ 0.080 s]
[INFO] TomEE :: Arquillian Adaptors Parent :: OpenEJB Container 10.3.0-SNAPSHOT SUCCESS [ 1.741 s]
[INFO] TomEE :: Examples :: Groovy CDI 10.2.1-SNAPSHOT .... SUCCESS [ 1.136 s]
[INFO] TomEE :: Examples :: Groovy JPA 10.2.1-SNAPSHOT .... SUCCESS [ 0.900 s]
[INFO] TomEE :: Examples :: Hello World - Weblogic 10.2.1-SNAPSHOT SUCCESS [ 0.227 s]
[INFO] TomEE :: Examples :: @Resource jakarta.jms.ConnectionFactory 10.2.1-SNAPSHOT SUCCESS [ 0.485 s]
[INFO] TomEE :: Examples :: @Resource DataSource Injection 10.2.1-SNAPSHOT SUCCESS [ 0.207 s]
[INFO] TomEE :: Examples :: @EJB Injection 10.2.1-SNAPSHOT SUCCESS [ 0.246 s]
[INFO] TomEE :: Examples :: @PersistenceContext EntityManager Injection 10.2.1-SNAPSHOT SUCCESS [ 0.236 s]
[INFO] TomEE :: Examples :: @Resource env-entry Injection 10.2.1-SNAPSHOT SUCCESS [ 0.220 s]
[INFO] TomEE :: Examples :: Interceptors 10.2.1-SNAPSHOT .. SUCCESS [ 0.249 s]
[INFO] TomEE :: Examples :: JakartaMail API 10.2.1-SNAPSHOT SUCCESS [ 0.792 s]
[INFO] TomEE :: Examples :: Jakarta Mail API with Velocity 10.2.1-SNAPSHOT SUCCESS [ 1.215 s]
[INFO] TomEE :: Web Examples :: Java Modules (Simple REST resource) 10.2.1-SNAPSHOT SUCCESS [ 1.391 s]
[INFO] TomEE :: Examples :: JAXRS Filter 10.2.1-SNAPSHOT .. SUCCESS [ 0.669 s]
[INFO] TomEE :: Examples :: JAXRS JSON Provider with Jettison 10.2.1-SNAPSHOT FAILURE [ 0.096 s]
[INFO] TomEE :: Examples :: JPA with EclipseLink 10.2.1-SNAPSHOT SKIPPED
[INFO] TomEE :: Utils :: Core Hibernate 10.3.0-SNAPSHOT ... SKIPPED
[INFO] TomEE :: Examples :: JPA with Hibernate 10.2.1-SNAPSHOT SKIPPED
[INFO] TomEE :: Examples :: JPA with Hibernate and arquillian 10.2.1-SNAPSHOT SKIPPED
[INFO] TomEE :: Examples :: JPA @Enumerated 10.2.1-SNAPSHOT SKIPPED
[INFO] TomEE :: Web Examples :: JSF - CDI and EJB 10.2.1-SNAPSHOT SKIPPED
[INFO] TomEE :: Examples :: JUnit 5 :: Application Composer 10.2.1-SNAPSHOT SKIPPED
[INFO] TomEE :: Examples :: JUnit 5 :: Multiple TomEE with Arquillian 10.2.1-SNAPSHOT SKIPPED
[INFO] TomEE :: Examples :: JUnit 5 :: Simple Websockets with Arquillian 10.2.1-SNAPSHOT SKIPPED
[INFO] TomEE :: Examples :: @EJB Lookup 10.2.1-SNAPSHOT ... SKIPPED
[INFO] TomEE :: Examples :: EJB Lookup with descriptor 10.2.1-SNAPSHOT SKIPPED
[INFO] TomEE :: Examples :: Movies Complete (Meta) 10.2.1-SNAPSHOT SKIPPED
[INFO] TomEE :: Examples :: Movies Complete 10.2.1-SNAPSHOT SKIPPED
[INFO] TomEE :: Examples :: MicroProfile Config 10.2.1-SNAPSHOT SKIPPED
[INFO] TomEE :: Examples :: MicroProfile Config Source Database 10.2.1-SNAPSHOT SKIPPED
[INFO] TomEE :: Examples :: Microprofile Fault Tolerance :: Fallback 10.2.1-SNAPSHOT SKIPPED
[INFO] TomEE :: Examples :: Microprofile Fault Tolerance :: Retry 10.2.1-SNAPSHOT SKIPPED
[INFO] TomEE :: Examples :: Microprofile Fault Tolerance :: Timeout 10.2.1-SNAPSHOT SKIPPED
[INFO] TomEE :: Examples :: MicroProfile JWT Bean Validation 10.2.1-SNAPSHOT SKIPPED
[INFO] TomEE :: Examples :: MicroProfile JWT Bean Validation, Strongly-typed Annotations 10.2.1-SNAPSHOT SKIPPED
[INFO] TomEE :: Examples :: Microprofile Metrics Counted 10.2.1-SNAPSHOT SKIPPED
[INFO] TomEE :: Examples :: Microprofile Metrics Histogram 10.2.1-SNAPSHOT SKIPPED
[INFO] TomEE :: Examples :: Microprofile Metrics Timed 10.2.1-SNAPSHOT SKIPPED
[INFO] TomEE :: Examples :: MicroProfile Metrics Gauge 10.2.1-SNAPSHOT SKIPPED
[INFO] TomEE :: Examples :: MicroProfile Metrics Metered 10.2.1-SNAPSHOT SKIPPED
[INFO] TomEE :: Examples :: MP REST JWT JWK 10.2.1-SNAPSHOT SKIPPED
[INFO] TomEE :: Examples :: MP REST JWT PRINCIPAL 10.2.1-SNAPSHOT SKIPPED
[INFO] TomEE :: Examples :: MP REST JWT Public Key 10.2.1-SNAPSHOT SKIPPED
[INFO] TomEE :: Examples :: Microprofile REST Client 10.2.1-SNAPSHOT SKIPPED
[INFO] TomEE :: Examples :: Custom HealthCheck 10.2.1-SNAPSHOT SKIPPED
[INFO] TomEE :: Examples :: Microprofile OpenAPI Reader 10.2.1-SNAPSHOT SKIPPED
[INFO] TomEE :: Examples :: MTOM 10.2.1-SNAPSHOT .......... SKIPPED
[INFO] TomEE :: Examples :: Multiple JPA providers 10.2.1-SNAPSHOT SKIPPED
[INFO] TomEE :: Examples :: Multiple Arquillian Adapters 10.2.1-SNAPSHOT SKIPPED
[INFO] TomEE :: Examples :: Multiple TomEE with Arquillian 10.2.1-SNAPSHOT SKIPPED
[INFO] TomEE :: Examples :: Persistence Fragment 10.2.1-SNAPSHOT SKIPPED
[INFO] TomEE :: Web Examples :: Pojo WS 10.2.1-SNAPSHOT ... SKIPPED
[INFO] TomEE :: Examples :: Quartz 10.2.1-SNAPSHOT ........ SKIPPED
[INFO] TomEE :: Examples :: Quartz :: Quartz Resource Adapter 10.2.1-SNAPSHOT SKIPPED
[INFO] TomEE :: Examples :: Quartz :: Quartz Beans 10.2.1-SNAPSHOT SKIPPED
[INFO] TomEE :: Examples :: DataSource Realm 10.2.1-SNAPSHOT SKIPPED
[INFO] TomEE :: Examples :: Reloadable Persistence Unit Properties 10.2.1-SNAPSHOT SKIPPED
[INFO] TomEE :: Web Examples :: Resource Declared In A Webapp 10.2.1-SNAPSHOT SKIPPED
[INFO] TomEE :: Examples :: REST, Mockito and Application Composer 10.2.1-SNAPSHOT SKIPPED
[INFO] TomEE :: Examples :: REST and Application Composer 10.2.1-SNAPSHOT SKIPPED
[INFO] TomEE :: Examples :: REST CDI 10.2.1-SNAPSHOT ...... SKIPPED
[INFO] TomEE :: Examples :: JAXRS and JAAS 10.2.1-SNAPSHOT SKIPPED
[INFO] TomEE :: Examples :: REST and EJB 10.2.1-SNAPSHOT .. SKIPPED
[INFO] TomEE :: Web Examples :: REST Example 10.2.1-SNAPSHOT SKIPPED
[INFO] TomEE :: Web Examples :: REST Example With Application 10.2.1-SNAPSHOT SKIPPED
[INFO] TomEE :: Examples :: REST XML JSON 10.2.1-SNAPSHOT . SKIPPED
[INFO] TomEE :: Examples :: Basic Scala 10.2.1-SNAPSHOT ... SKIPPED
[INFO] TomEE :: Examples :: ScheduleExpression 10.2.1-SNAPSHOT SKIPPED
[INFO] TomEE :: Examples :: @Schedule Events 10.2.1-SNAPSHOT SKIPPED
[INFO] TomEE :: Examples :: @Schedule Methods (Meta) 10.2.1-SNAPSHOT SKIPPED
[INFO] TomEE :: Examples :: @Schedule Methods 10.2.1-SNAPSHOT SKIPPED
[INFO] TomEE :: Examples :: Server Events 10.2.1-SNAPSHOT . SKIPPED
[INFO] TomEE :: Examples :: Serverless Builder 10.2.1-SNAPSHOT SKIPPED
[INFO] TomEE :: Examples :: Serverless Apache TomEE WebProfile 10.2.1-SNAPSHOT SKIPPED
[INFO] TomEE :: Examples :: Serverless Apache TomEE MicroProfile 10.2.1-SNAPSHOT SKIPPED
[INFO] TomEE :: Examples :: Serverless Apache TomEE Plume 10.2.1-SNAPSHOT SKIPPED
[INFO] TomEE :: Examples :: Serverless Apache TomEE Plus 10.2.1-SNAPSHOT SKIPPED
[INFO] TomEE :: Examples :: Singleton startup ordering 10.2.1-SNAPSHOT SKIPPED
[INFO] TomEE :: Examples :: Simple CDI Interceptor 10.2.1-SNAPSHOT SKIPPED
[INFO] TomEE :: Examples :: Simple EAR 10.3.0-SNAPSHOT .... SKIPPED
[INFO] TomEE :: Examples :: Simple EAR :: Business Model 10.3.0-SNAPSHOT SKIPPED
[INFO] TomEE :: Examples :: Simple EAR :: Business Logic 10.3.0-SNAPSHOT SKIPPED
[INFO] TomEE :: Examples :: Simple EAR :: Webapp 10.3.0-SNAPSHOT SKIPPED
[INFO] TomEE :: Examples :: Simple EAR :: EAR Packaging 10.3.0-SNAPSHOT SKIPPED
[INFO] TomEE :: Examples :: Simple EAR :: Functional Tests 10.3.0-SNAPSHOT SKIPPED
[INFO] TomEE :: Examples :: Simple CMP2 Entity 10.2.1-SNAPSHOT SKIPPED
[INFO] TomEE :: Examples :: Simple JMS 10.2.1-SNAPSHOT .... SKIPPED
[INFO] TomEE :: Examples :: Simple JMS Context 10.2.1-SNAPSHOT SKIPPED
[INFO] TomEE :: Examples :: Simple MDB With a CDI Injection 10.2.1-SNAPSHOT SKIPPED
[INFO] TomEE :: Examples :: Simple MDB Example 10.2.1-SNAPSHOT SKIPPED
[INFO] TomEE :: Examples :: Simple MDB Using Deployment Descriptor Example 10.2.1-SNAPSHOT SKIPPED
[INFO] TomEE :: Examples :: Simple Remote tomcat-users.xml 10.2.1-SNAPSHOT SKIPPED
[INFO] TomEE :: Examples :: Simple REST 10.2.1-SNAPSHOT ... SKIPPED
[INFO] TomEE :: Examples :: Simple Singleton 10.2.1-SNAPSHOT SKIPPED
[INFO] TomEE :: Examples :: Simple Stateful Pojo 10.2.1-SNAPSHOT SKIPPED
[INFO] TomEE :: Examples :: Simple Stateful Pojo Callbacks 10.2.1-SNAPSHOT SKIPPED
[INFO] TomEE :: Examples :: Simple Stateless Pojo 10.2.1-SNAPSHOT SKIPPED
[INFO] TomEE :: Examples :: Simple Stateless Pojo Callbacks 10.2.1-SNAPSHOT SKIPPED
[INFO] TomEE :: Examples :: Simple Stateless With Deployment Descriptor 10.2.1-SNAPSHOT SKIPPED
[INFO] TomEE :: Examples :: Simple Webservice 10.2.1-SNAPSHOT SKIPPED
[INFO] TomEE :: Examples :: Simple Webservice Without Interface 10.2.1-SNAPSHOT SKIPPED
[INFO] TomEE :: Examples :: Async Servlet 10.2.1-SNAPSHOT . SKIPPED
[INFO] TomEE :: Web Examples :: Struts 10.2.1-SNAPSHOT .... SKIPPED
[INFO] TomEE :: Examples :: Telephone Stateful Pojo 10.2.1-SNAPSHOT SKIPPED
[INFO] TomEE :: Examples :: TestCase Injection 10.2.1-SNAPSHOT SKIPPED
[INFO] TomEE :: Examples :: Testing Security (Meta) 10.2.1-SNAPSHOT SKIPPED
[INFO] TomEE :: Examples :: Testing Security 10.2.1-SNAPSHOT SKIPPED
[INFO] TomEE :: Examples :: Testing Security 10.2.1-SNAPSHOT SKIPPED
[INFO] TomEE :: Examples :: Testing Security Service Provider 10.2.1-SNAPSHOT SKIPPED
[INFO] TomEE :: Examples :: Testing Security Script Service Provider 10.2.1-SNAPSHOT SKIPPED
[INFO] TomEE :: Examples :: Testing Transactions 10.2.1-SNAPSHOT SKIPPED
[INFO] TomEE :: Examples :: Testing Transactions BMT 10.2.1-SNAPSHOT SKIPPED
[INFO] TomEE :: TomEE :: IBM MQ AMQ Portability Examples :: MDB Example 1.0 SKIPPED
[INFO] TomEE :: Examples :: Transaction Rollback 10.2.1-SNAPSHOT SKIPPED
[INFO] TomEE :: Examples :: Troubleshooting 10.2.1-SNAPSHOT SKIPPED
[INFO] TomEE :: Examples :: Webservice Attachments 10.2.1-SNAPSHOT SKIPPED
[INFO] TomEE :: Examples :: Webservice Inheritance 10.2.1-SNAPSHOT SKIPPED
[INFO] TomEE :: Web Examples :: EJB WebService with Security 10.2.1-SNAPSHOT SKIPPED
[INFO] TomEE :: Web Examples :: EJB WebService with SSL Client Certificate 10.2.1-SNAPSHOT SKIPPED
[INFO] TomEE :: Web Examples :: EJB WebService with WS-Security 10.2.1-SNAPSHOT SKIPPED
[INFO] TomEE :: Web Examples :: EJB WebService WS Security with resources.xml 10.2.1-SNAPSHOT SKIPPED
[INFO] TomEE :: Examples :: Web Service Handlers 10.2.1-SNAPSHOT SKIPPED
[INFO] TomEE :: Examples :: @WebService Holder 10.2.1-SNAPSHOT SKIPPED
[INFO] TomEE :: Web Examples :: Moviefun 10.2.1-SNAPSHOT .. SKIPPED
[INFO] TomEE :: Web Examples :: Moviefun Rest 10.2.1-SNAPSHOT SKIPPED
[INFO] TomEE :: Examples :: Resources/JMX Example 10.2.1-SNAPSHOT SKIPPED
[INFO] TomEE :: Examples :: Resources/JMX Example :: EJB Module 10.2.1-SNAPSHOT SKIPPED
[INFO] TomEE :: Examples :: Resources/JMX Example :: EAR Module 10.2.1-SNAPSHOT SKIPPED
[INFO] TomEE :: Examples :: WebSocket with tls and basic auth Example 10.2.1-SNAPSHOT SKIPPED
[INFO] TomEE :: Examples :: Concurrency utilities example 10.2.1-SNAPSHOT SKIPPED
[INFO] TomEE :: Examples :: Microprofile JSONB Configuration 10.2.1-SNAPSHOT SKIPPED
[INFO] TomEE :: Examples :: Microprofile JSONB Custom Serializer/Deserializer 10.2.1-SNAPSHOT SKIPPED
[INFO] TomEE :: Examples :: Azure deployment example 10.2.1-SNAPSHOT SKIPPED
[INFO] TomEE :: Examples :: XA Datasource configuration and usage 10.2.1-SNAPSHOT SKIPPED
[INFO] TomEE :: Examples :: Websocket JMS 10.2.1-SNAPSHOT . SKIPPED
[INFO] TomEE :: Web Examples :: Multi-Broker 10.2.1-SNAPSHOT SKIPPED
[INFO] TomEE :: Examples :: Jakarta Security tomcat-user.xml Identity Store 10.2.1-SNAPSHOT SKIPPED
[INFO] TomEE :: Examples :: Jakarta Security custom Identity Store 10.2.1-SNAPSHOT SKIPPED
[INFO] TomEE :: Examples :: Jakarta Security OpenID Connect 10.2.1-SNAPSHOT SKIPPED
[INFO] TomEE :: Examples :: Jakarta Security Passkey (WebAuthn) as a 2nd factor 10.3.0-SNAPSHOT SKIPPED
[INFO] TomEE :: Examples :: Jakarta Security Passkey 2FA (programmatic SecurityContext.authenticate) 10.3.0-SNAPSHOT SKIPPED
[INFO] TomEE :: Examples 10.3.0-SNAPSHOT .................. SKIPPED
[INFO] TomEE :: Assembly :: All In One EJB Lite jar 10.3.0-SNAPSHOT SKIPPED
[INFO] TomEE :: Utils :: TomEE Webapps-based Deployer EJB 10.3.0-SNAPSHOT SKIPPED
[INFO] TomEE :: TCK 10.3.0-SNAPSHOT ....................... SKIPPED
[INFO] TomEE :: TCK :: Common 10.3.0-SNAPSHOT ............. SKIPPED
[INFO] TomEE :: TCK :: CDI Embedded 10.3.0-SNAPSHOT ....... SKIPPED
[INFO] TomEE :: TCK :: CDI TomEE 10.3.0-SNAPSHOT .......... SKIPPED
[INFO] TomEE :: TCK :: CDI TCK Signature Tests 10.3.0-SNAPSHOT SKIPPED
[INFO] TomEE :: TCK :: Bean Validation Embedded 10.3.0-SNAPSHOT SKIPPED
[INFO] TomEE :: TCK :: Bean Validation TomEE 10.3.0-SNAPSHOT SKIPPED
[INFO] TomEE :: TCK :: Bean Validation TCK Signature tests 10.3.0-SNAPSHOT SKIPPED
[INFO] TomEE :: TCK :: JSON-P Standalone 10.3.0-SNAPSHOT .. SKIPPED
[INFO] TomEE :: TCK :: JSON-P Signature Tests 10.3.0-SNAPSHOT SKIPPED
[INFO] TomEE :: TCK :: JSON-B Standalone 10.3.0-SNAPSHOT .. SKIPPED
[INFO] TomEE :: TCK :: JSON-B Signature Tests 10.3.0-SNAPSHOT SKIPPED
[INFO] TomEE :: TCK :: Concurrency Standalone 10.3.0-SNAPSHOT SKIPPED
[INFO] TomEE :: TCK :: Concurrency Signature Tests 10.3.0-SNAPSHOT SKIPPED
[INFO] TomEE :: TCK :: MicroProfile 10.3.0-SNAPSHOT ....... SKIPPED
[INFO] TomEE :: TCK :: MicroProfile Config TCK 10.3.0-SNAPSHOT SKIPPED
[INFO] TomEE :: TCK :: MicroProfile JWT TCK 10.3.0-SNAPSHOT SKIPPED
[INFO] TomEE :: TCK :: MicroProfile Health TCK 10.3.0-SNAPSHOT SKIPPED
[INFO] TomEE :: TCK :: MicroProfile Metrics TCK 10.3.0-SNAPSHOT SKIPPED
[INFO] TomEE :: TCK :: MicroProfile Rest Client TCK 10.3.0-SNAPSHOT SKIPPED
[INFO] TomEE :: TCK :: MicroProfile Open API TCK 10.3.0-SNAPSHOT SKIPPED
[INFO] TomEE :: TCK :: MicroProfile Fault Tolerance TCK 10.3.0-SNAPSHOT SKIPPED
[INFO] TomEE :: TCK :: MicroProfile Open Telemetry TCK 10.3.0-SNAPSHOT SKIPPED
[INFO] TomEE :: TCK :: JAX-RS TCK 10.3.0-SNAPSHOT ......... SKIPPED
[INFO] TomEE :: TCK :: JAX-RS TCK :: Tests 10.3.0-SNAPSHOT SKIPPED
[INFO] TomEE :: Arquillian Adaptors Parent :: Embedded Adaptor 10.3.0-SNAPSHOT SKIPPED
[INFO] TomEE :: TCK :: JAX-RS TCK :: Tests Embedded 10.3.0-SNAPSHOT SKIPPED
[INFO] TomEE :: TCK :: JAX-RS TCK :: Signature Test 10.3.0-SNAPSHOT SKIPPED
[INFO] TomEE :: Arquillian Adaptors Parent :: Tests 10.3.0-SNAPSHOT SKIPPED
[INFO] TomEE :: Arquillian Adaptors Parent :: Tests :: Web Profile 10.3.0-SNAPSHOT SKIPPED
[INFO] TomEE :: Arquillian Adaptors Parent :: Tests :: JAXRS 10.3.0-SNAPSHOT SKIPPED
[INFO] TomEE :: Arquillian Adaptors Parent :: Tests :: JAXWS 10.3.0-SNAPSHOT SKIPPED
[INFO] TomEE :: Arquillian Adaptors Parent :: Tests :: JMS 10.3.0-SNAPSHOT SKIPPED
[INFO] TomEE :: Arquillian Adaptors Parent :: Tests :: Configuration Tests 10.3.0-SNAPSHOT SKIPPED
[INFO] TomEE :: Arquillian Adaptors Parent :: Sample :: Moviefun 10.3.0-SNAPSHOT SKIPPED
[INFO] TomEE :: Arquillian Adaptors Parent :: Arquillian TCK 10.3.0-SNAPSHOT SKIPPED
[INFO] TomEE :: Arquillian :: Functional Tests 10.3.0-SNAPSHOT SKIPPED
[INFO] TomEE :: Arquillian :: Functional Tests :: Spring CXF Test 10.3.0-SNAPSHOT SKIPPED
[INFO] TomEE :: Utils :: Provisionning 10.3.0-SNAPSHOT .... SKIPPED
[INFO] TomEE :: Utils :: Log4j2 10.3.0-SNAPSHOT ........... SKIPPED
[INFO] TomEE :: TomEE :: webaccess 10.3.0-SNAPSHOT ........ SKIPPED
[INFO] TomEE :: TomEE :: Overlay Runner 10.3.0-SNAPSHOT ... SKIPPED
[INFO] ------------------------------------------------------------------------
[INFO] BUILD FAILURE
[INFO] ------------------------------------------------------------------------
[INFO] Total time: 10:28 min
[INFO] Finished at: 2026-09-30T12:20:33Z
[INFO] ------------------------------------------------------------------------
[WARNING]
[WARNING] Plugin validation issues were detected in 10 plugin(s)
[WARNING]
[WARNING] * org.apache.maven.plugins:maven-jar-plugin:3.0.2
[WARNING] * org.apache.maven.plugins:maven-assembly-plugin:2.4.1
[WARNING] * org.apache.maven.plugins:maven-compiler-plugin:3.14.1
[WARNING] * org.apache.maven.plugins:maven-compiler-plugin:3.10.1
[WARNING] * org.apache.tomee.patch:tomee-patch-plugin:0.10
[WARNING] * org.apache.felix:maven-bundle-plugin:6.1.0
[WARNING] * org.apache.maven.plugins:maven-resources-plugin:3.3.0
[WARNING] * org.apache.openjpa:openjpa-maven-plugin:4.1.1
[WARNING] * org.apache.maven.plugins:maven-surefire-plugin:3.5.3
[WARNING] * org.apache.maven.plugins:maven-war-plugin:3.3.2
[WARNING]
[WARNING] For more or less details, use 'maven.plugin.validation' property with one of the values (case insensitive): [BRIEF, DEFAULT, VERBOSE]
[WARNING]
[ERROR] Failed to execute goal on project jaxrs-json-provider-jettison: Could not resolve dependencies for project org.superbiz:jaxrs-json-provider-jettison:war:10.2.1-SNAPSHOT: The following artifacts could not be resolved: org.apache.tomee.bom:tomee-microprofile:jar:10.2.1-SNAPSHOT (absent): Could not find artifact org.apache.tomee.bom:tomee-microprofile:jar:10.2.1-SNAPSHOT -> [Help 1]
[ERROR]
[ERROR] To see the full stack trace of the errors, re-run Maven with the -e switch.
[ERROR] Re-run Maven using the -X switch to enable full debug logging.
[ERROR]
[ERROR] For more information about the errors and possible solutions, please read the following articles:
[ERROR] [Help 1] http://cwiki.apache.org/confluence/display/MAVEN/DependencyResolutionException
[ERROR]
[ERROR] After correcting the problems, you can resume the build with the command
[ERROR] mvn <args> -rf :jaxrs-json-provider-jettison
Build step 'Execute shell' marked build as failure
INFO: Processing JUnit
INFO: [JUnit] - No test report file(s) were found with the pattern '**/target/surefire-reports/TEST-*.xml' relative to '<https://ci-builds.apache.org/job/Tomee/job/tomee-10-build-full-tck/ws/'> for the testing framework 'JUnit'.
Did you enter a pattern relative to (and within) the workspace directory?
Did you generate the result report(s) for 'JUnit'?"
WARNING: All test reports are empty.
[Checks API] No suitable checks publisher found.
INFO: Setting the build status to SUCCESS
Jenkins build is back to normal : TomEE » tomee-10-build-full-tck #124
Posted by Apache Jenkins Server <je...@builds.apache.org>.
See <https://ci-builds.apache.org/job/Tomee/job/tomee-10-build-full-tck/124/display/redirect?page=changes>
Build failed in Jenkins: TomEE » tomee-10-build-full-tck #123
Posted by Apache Jenkins Server <je...@builds.apache.org>.
See <https://ci-builds.apache.org/job/Tomee/job/tomee-10-build-full-tck/123/display/redirect?page=changes>
Changes:
[github] TOMEE-4712 - activate MDB endpoints when the bean is started instead of deployed (#2951) (#3014)
[github] TOMEE-4716 - deploy MicroProfile Health at the context root regardless of declared JAX-RS applications (#2960) (#3015)
------------------------------------------
[...truncated 112.23 MiB...]
01-Oct-2026 16:54:59.668 INFO [http-nio-46519-exec-3] org.apache.tomee.microprofile.metrics.VendorMetrics.afterApplicationDeployed Class name: org.apache.openejb.monitoring.ManagedMBean
01-Oct-2026 16:54:59.669 INFO [http-nio-46519-exec-3] org.apache.tomee.microprofile.metrics.VendorMetrics.afterApplicationDeployed Adding vendor metrics for openejb.management:J2EEServer=openejb,J2EEApplication=<empty>,j2eeType=Resource,name=UserDatabase
01-Oct-2026 16:54:59.669 INFO [http-nio-46519-exec-3] org.apache.tomee.microprofile.metrics.VendorMetrics.afterApplicationDeployed Class name: UserDatabase
01-Oct-2026 16:54:59.670 INFO [http-nio-46519-exec-3] org.apache.tomee.microprofile.metrics.VendorMetrics.afterApplicationDeployed Adding vendor metrics for openejb.management:J2EEServer=openejb,J2EEApplication=<empty>,EJBModule=openejb,SingletonSessionBean=openejb/Deployer,name=openejb/Deployer,j2eeType=Invocations
01-Oct-2026 16:54:59.670 INFO [http-nio-46519-exec-3] org.apache.tomee.microprofile.metrics.VendorMetrics.afterApplicationDeployed Class name: org.apache.openejb.monitoring.ManagedMBean
01-Oct-2026 16:54:59.671 INFO [http-nio-46519-exec-3] org.apache.tomee.microprofile.metrics.VendorMetrics.afterApplicationDeployed Adding vendor metrics for openejb.management:ObjectType=containers,DataSource=Default Singleton Container
01-Oct-2026 16:54:59.671 INFO [http-nio-46519-exec-3] org.apache.tomee.microprofile.metrics.VendorMetrics.afterApplicationDeployed Class name: org.apache.openejb.assembler.monitoring.JMXContainer
01-Oct-2026 16:54:59.671 INFO [http-nio-46519-exec-3] org.apache.openejb.assembler.classic.Assembler.createApplication Deployed Application(path=<https://ci-builds.apache.org/job/Tomee/job/tomee-10-build-full-tck/ws/tck/microprofile-tck/opentelemetry/target/workdir/0/0c0dc24a-574b-4838-9a74-432b5be397ed)>
01-Oct-2026 16:54:59.918 INFO [http-nio-46519-exec-3] org.apache.openejb.util.OptionsLog.info Using 'tomee.mp.scan=all'
01-Oct-2026 16:54:59.923 INFO [http-nio-46519-exec-3] org.apache.openejb.util.OptionsLog.info Using 'tomee.mp.scan=all'
01-Oct-2026 16:54:59.929 INFO [http-nio-46519-exec-3] org.apache.tomee.microprofile.openapi.MicroProfileOpenApiRegistration.onStartup Registering OpenAPI servlet on /openapi for application /0c0dc24a-574b-4838-9a74-432b5be397ed
01-Oct-2026 16:55:00.006 INFO [http-nio-46519-exec-3] org.apache.jasper.servlet.TldScanner.scanJars At least one JAR was scanned for TLDs yet contained no TLDs. Enable debug logging for this logger for a complete list of JARs that were scanned but no TLDs were found in them. Skipping unneeded JARs during scanning can improve startup time and JSP compilation time.
01-Oct-2026 16:55:00.052 INFO [http-nio-46519-exec-3] org.apache.openejb.util.OptionsLog.info Using 'tomee.mp.scan=all'
01-Oct-2026 16:55:00.978 INFO [http-nio-46519-exec-3] org.apache.openejb.util.OptionsLog.info Using 'openejb.cxf-rs.cache-application=false'
01-Oct-2026 16:55:01.011 INFO [http-nio-46519-exec-3] org.apache.openejb.server.cxf.rs.CxfRsHttpListener.logApplication Application{path='http://localhost:46519/0c0dc24a-574b-4838-9a74-432b5be397ed/', class=org.eclipse.microprofile.telemetry.tracing.tck.TestApplication$RestApplication, resources=2, providers=6, invalids=0}
01-Oct-2026 16:55:01.012 INFO [http-nio-46519-exec-3] org.apache.openejb.server.cxf.rs.CxfRsHttpListener.logApplication Resource{clazz=org.eclipse.microprofile.telemetry.tracing.tck.TestApplication$TestEndpoint, discovered=true, singleton=false}
01-Oct-2026 16:55:01.013 INFO [http-nio-46519-exec-3] org.apache.openejb.server.cxf.rs.CxfRsHttpListener.logApplication Resource{clazz=org.apache.tomee.microprofile.health.MicroProfileHealthChecksEndpoint, discovered=false, singleton=false}
01-Oct-2026 16:55:01.013 INFO [http-nio-46519-exec-3] org.apache.openejb.server.cxf.rs.CxfRsHttpListener.logApplication Provider{clazz=org.apache.tomee.microprofile.opentelemetry.MPOpenTelemetryFilterRegistration, discovered=true, singleton=false}
01-Oct-2026 16:55:01.013 INFO [http-nio-46519-exec-3] org.apache.openejb.server.cxf.rs.CxfRsHttpListener.logApplication Provider{clazz=org.apache.tomee.microprofile.jwt.bval.ValidationInterceptorsFeature, discovered=true, singleton=false}
01-Oct-2026 16:55:01.013 INFO [http-nio-46519-exec-3] org.apache.openejb.server.cxf.rs.CxfRsHttpListener.logApplication Provider{clazz=org.apache.tomee.microprofile.metrics.MetricsFilterRegistration, discovered=true, singleton=false}
01-Oct-2026 16:55:01.014 INFO [http-nio-46519-exec-3] org.apache.openejb.server.cxf.rs.CxfRsHttpListener.logApplication Provider{clazz=org.apache.tomee.microprofile.jwt.MPJWTFilter$MPJWTExceptionMapper, discovered=true, singleton=false}
01-Oct-2026 16:55:01.014 INFO [http-nio-46519-exec-3] org.apache.openejb.server.cxf.rs.CxfRsHttpListener.logApplication Provider{clazz=io.smallrye.opentelemetry.implementation.rest.OpenTelemetryClientFilter, discovered=true, singleton=false}
01-Oct-2026 16:55:01.014 INFO [http-nio-46519-exec-3] org.apache.openejb.server.cxf.rs.CxfRsHttpListener.logApplication Provider{clazz=org.apache.tomee.microprofile.jwt.jaxrs.MPJWTSecurityAnnotationsInterceptorsFeature, discovered=true, singleton=false}
01-Oct-2026 16:55:01.310 INFO [http-nio-46519-exec-3] org.apache.openejb.util.OptionsLog.info Using 'tomee.mp.scan=all'
01-Oct-2026 16:55:01.529 INFO [http-nio-46519-exec-3] org.apache.openejb.util.OptionsLog.info Using 'tomee.mp.scan=all'
01-Oct-2026 16:55:01.537 INFO [http-nio-46519-exec-3] org.apache.openejb.util.OptionsLog.info Using 'tomee.mp.scan=all'
01-Oct-2026 16:55:01.555 INFO [http-nio-46519-exec-3] org.apache.openejb.util.OptionsLog.info Using 'tomee.mp.scan=all'
01-Oct-2026 16:55:01.561 INFO [http-nio-46519-exec-3] org.apache.openejb.util.OptionsLog.info Using 'tomee.mp.scan=all'
01-Oct-2026 16:55:01.583 INFO [http-nio-46519-exec-3] org.apache.openejb.util.OptionsLog.info Using 'tomee.mp.scan=all'
01-Oct-2026 16:55:01.588 INFO [http-nio-46519-exec-3] org.apache.openejb.util.OptionsLog.info Using 'tomee.mp.scan=all'
01-Oct-2026 16:55:01.602 INFO [http-nio-46519-exec-3] org.apache.openejb.util.OptionsLog.info Using 'tomee.mp.scan=all'
01-Oct-2026 16:55:01.606 INFO [http-nio-46519-exec-3] org.apache.openejb.util.OptionsLog.info Using 'tomee.mp.scan=all'
01-Oct-2026 16:55:01.617 INFO [http-nio-46519-exec-3] org.apache.openejb.util.OptionsLog.info Using 'tomee.mp.scan=all'
01-Oct-2026 16:55:01.624 INFO [http-nio-46519-exec-3] org.apache.openejb.server.cxf.rs.CxfRsHttpListener.deployApplication Using readers:
01-Oct-2026 16:55:01.624 INFO [http-nio-46519-exec-3] org.apache.openejb.server.cxf.rs.CxfRsHttpListener.deployApplication org.apache.cxf.jaxrs.provider.EntityPartProvider@73da9922
01-Oct-2026 16:55:01.624 INFO [http-nio-46519-exec-3] org.apache.openejb.server.cxf.rs.CxfRsHttpListener.deployApplication org.apache.cxf.jaxrs.provider.PrimitiveTextProvider@72050790
01-Oct-2026 16:55:01.624 INFO [http-nio-46519-exec-3] org.apache.openejb.server.cxf.rs.CxfRsHttpListener.deployApplication org.apache.cxf.jaxrs.provider.FormEncodingProvider@3d97114d
01-Oct-2026 16:55:01.624 INFO [http-nio-46519-exec-3] org.apache.openejb.server.cxf.rs.CxfRsHttpListener.deployApplication org.apache.cxf.jaxrs.provider.MultipartProvider@68744115
01-Oct-2026 16:55:01.624 INFO [http-nio-46519-exec-3] org.apache.openejb.server.cxf.rs.CxfRsHttpListener.deployApplication org.apache.cxf.jaxrs.provider.SourceProvider@79d2d7b9
01-Oct-2026 16:55:01.625 INFO [http-nio-46519-exec-3] org.apache.openejb.server.cxf.rs.CxfRsHttpListener.deployApplication org.apache.cxf.jaxrs.provider.JAXBElementTypedProvider@5ee64228
01-Oct-2026 16:55:01.625 INFO [http-nio-46519-exec-3] org.apache.openejb.server.cxf.rs.CxfRsHttpListener.deployApplication org.apache.cxf.jaxrs.provider.JAXBElementProvider@5bfe2dc0
01-Oct-2026 16:55:01.625 INFO [http-nio-46519-exec-3] org.apache.openejb.server.cxf.rs.CxfRsHttpListener.deployApplication org.apache.openejb.server.cxf.rs.johnzon.TomEEJsonbProvider@751f377c
01-Oct-2026 16:55:01.625 INFO [http-nio-46519-exec-3] org.apache.openejb.server.cxf.rs.CxfRsHttpListener.deployApplication org.apache.openejb.server.cxf.rs.johnzon.TomEEJsonpProvider@7051eb51
01-Oct-2026 16:55:01.625 INFO [http-nio-46519-exec-3] org.apache.openejb.server.cxf.rs.CxfRsHttpListener.deployApplication org.apache.cxf.jaxrs.provider.StringTextProvider@87a445d
01-Oct-2026 16:55:01.625 INFO [http-nio-46519-exec-3] org.apache.openejb.server.cxf.rs.CxfRsHttpListener.deployApplication org.apache.cxf.jaxrs.provider.BinaryDataProvider@3d149426
01-Oct-2026 16:55:01.626 INFO [http-nio-46519-exec-3] org.apache.openejb.server.cxf.rs.CxfRsHttpListener.deployApplication org.apache.cxf.jaxrs.provider.DataSourceProvider@67f72d93
01-Oct-2026 16:55:01.626 INFO [http-nio-46519-exec-3] org.apache.openejb.server.cxf.rs.CxfRsHttpListener.deployApplication Using writers:
01-Oct-2026 16:55:01.626 INFO [http-nio-46519-exec-3] org.apache.openejb.server.cxf.rs.CxfRsHttpListener.deployApplication org.apache.cxf.jaxrs.provider.EntityPartProvider@73da9922
01-Oct-2026 16:55:01.626 INFO [http-nio-46519-exec-3] org.apache.openejb.server.cxf.rs.CxfRsHttpListener.deployApplication org.apache.cxf.jaxrs.provider.JAXBElementTypedProvider@5ee64228
01-Oct-2026 16:55:01.626 INFO [http-nio-46519-exec-3] org.apache.openejb.server.cxf.rs.CxfRsHttpListener.deployApplication org.apache.johnzon.jaxrs.WadlDocumentMessageBodyWriter@1883595f
01-Oct-2026 16:55:01.627 INFO [http-nio-46519-exec-3] org.apache.openejb.server.cxf.rs.CxfRsHttpListener.deployApplication org.apache.cxf.jaxrs.provider.StringTextProvider@87a445d
01-Oct-2026 16:55:01.627 INFO [http-nio-46519-exec-3] org.apache.openejb.server.cxf.rs.CxfRsHttpListener.deployApplication org.apache.cxf.jaxrs.nio.NioMessageBodyWriter@4281bebe
01-Oct-2026 16:55:01.627 INFO [http-nio-46519-exec-3] org.apache.openejb.server.cxf.rs.CxfRsHttpListener.deployApplication org.apache.cxf.jaxrs.provider.PrimitiveTextProvider@72050790
01-Oct-2026 16:55:01.627 INFO [http-nio-46519-exec-3] org.apache.openejb.server.cxf.rs.CxfRsHttpListener.deployApplication org.apache.cxf.jaxrs.provider.FormEncodingProvider@3d97114d
01-Oct-2026 16:55:01.628 INFO [http-nio-46519-exec-3] org.apache.openejb.server.cxf.rs.CxfRsHttpListener.deployApplication org.apache.cxf.jaxrs.provider.MultipartProvider@68744115
01-Oct-2026 16:55:01.628 INFO [http-nio-46519-exec-3] org.apache.openejb.server.cxf.rs.CxfRsHttpListener.deployApplication org.apache.cxf.jaxrs.provider.SourceProvider@79d2d7b9
01-Oct-2026 16:55:01.628 INFO [http-nio-46519-exec-3] org.apache.openejb.server.cxf.rs.CxfRsHttpListener.deployApplication org.apache.cxf.jaxrs.provider.JAXBElementProvider@5bfe2dc0
01-Oct-2026 16:55:01.628 INFO [http-nio-46519-exec-3] org.apache.openejb.server.cxf.rs.CxfRsHttpListener.deployApplication org.apache.openejb.server.cxf.rs.johnzon.TomEEJsonbProvider@751f377c
01-Oct-2026 16:55:01.629 INFO [http-nio-46519-exec-3] org.apache.openejb.server.cxf.rs.CxfRsHttpListener.deployApplication org.apache.openejb.server.cxf.rs.johnzon.TomEEJsonpProvider@7051eb51
01-Oct-2026 16:55:01.629 INFO [http-nio-46519-exec-3] org.apache.openejb.server.cxf.rs.CxfRsHttpListener.deployApplication org.apache.cxf.jaxrs.provider.BinaryDataProvider@3d149426
01-Oct-2026 16:55:01.629 INFO [http-nio-46519-exec-3] org.apache.openejb.server.cxf.rs.CxfRsHttpListener.deployApplication org.apache.cxf.jaxrs.provider.DataSourceProvider@67f72d93
01-Oct-2026 16:55:01.629 INFO [http-nio-46519-exec-3] org.apache.openejb.server.cxf.rs.CxfRsHttpListener.deployApplication Using exception mappers:
01-Oct-2026 16:55:01.630 INFO [http-nio-46519-exec-3] org.apache.openejb.server.cxf.rs.CxfRsHttpListener.deployApplication org.apache.cxf.jaxrs.impl.WebApplicationExceptionMapper@2a534534
01-Oct-2026 16:55:01.630 INFO [http-nio-46519-exec-3] org.apache.openejb.server.cxf.rs.CxfRsHttpListener.deployApplication org.apache.tomee.microprofile.jwt.MPJWTFilter$MPJWTExceptionMapper@3d70af9
01-Oct-2026 16:55:01.631 INFO [http-nio-46519-exec-3] org.apache.openejb.server.cxf.rs.CxfRsHttpListener.deployApplication org.apache.openejb.server.cxf.rs.EJBExceptionMapper@7e1f52d5
01-Oct-2026 16:55:01.631 INFO [http-nio-46519-exec-3] org.apache.openejb.server.cxf.rs.CxfRsHttpListener.deployApplication org.apache.cxf.jaxrs.validation.ValidationExceptionMapper@723b5131
01-Oct-2026 16:55:01.634 INFO [http-nio-46519-exec-3] org.apache.openejb.server.cxf.rs.CxfRsHttpListener.logEndpoints REST Application: http://localhost:46519/0c0dc24a-574b-4838-9a74-432b5be397ed/ -> org.eclipse.microprofile.telemetry.tracing.tck.TestApplication$RestApplication@1cbf259f
01-Oct-2026 16:55:01.641 INFO [http-nio-46519-exec-3] org.apache.openejb.server.cxf.rs.CxfRsHttpListener.logEndpoints Service URI: http://localhost:46519/0c0dc24a-574b-4838-9a74-432b5be397ed/health -> Pojo org.apache.tomee.microprofile.health.MicroProfileHealthChecksEndpoint
01-Oct-2026 16:55:01.641 INFO [http-nio-46519-exec-3] org.apache.openejb.server.cxf.rs.CxfRsHttpListener.logEndpoints GET http://localhost:46519/0c0dc24a-574b-4838-9a74-432b5be397ed/health -> Response getChecks()
01-Oct-2026 16:55:01.641 INFO [http-nio-46519-exec-3] org.apache.openejb.server.cxf.rs.CxfRsHttpListener.logEndpoints GET http://localhost:46519/0c0dc24a-574b-4838-9a74-432b5be397ed/health/live -> Response getLiveChecks()
01-Oct-2026 16:55:01.641 INFO [http-nio-46519-exec-3] org.apache.openejb.server.cxf.rs.CxfRsHttpListener.logEndpoints GET http://localhost:46519/0c0dc24a-574b-4838-9a74-432b5be397ed/health/ready -> Response getReadyChecks()
01-Oct-2026 16:55:01.642 INFO [http-nio-46519-exec-3] org.apache.openejb.server.cxf.rs.CxfRsHttpListener.logEndpoints GET http://localhost:46519/0c0dc24a-574b-4838-9a74-432b5be397ed/health/started -> Response getStartedChecks()
01-Oct-2026 16:55:01.642 INFO [http-nio-46519-exec-3] org.apache.openejb.server.cxf.rs.CxfRsHttpListener.logEndpoints Service URI: http://localhost:46519/0c0dc24a-574b-4838-9a74-432b5be397ed/rest -> Pojo org.eclipse.microprofile.telemetry.tracing.tck.TestApplication$TestEndpoint
01-Oct-2026 16:55:01.643 INFO [http-nio-46519-exec-3] org.apache.openejb.server.cxf.rs.CxfRsHttpListener.logEndpoints GET http://localhost:46519/0c0dc24a-574b-4838-9a74-432b5be397ed/rest -> String hello()
01-Oct-2026 16:55:02.994 INFO [http-nio-46519-exec-6] org.apache.openejb.util.OptionsLog.info Using 'openejb.internal.beans.security.enabled=false'
01-Oct-2026 16:55:02.995 INFO [http-nio-46519-exec-6] org.apache.openejb.assembler.classic.Assembler.destroyApplication Undeploying app: <https://ci-builds.apache.org/job/Tomee/job/tomee-10-build-full-tck/ws/tck/microprofile-tck/opentelemetry/target/workdir/0/0c0dc24a-574b-4838-9a74-432b5be397ed>
Oct 01, 2026 4:55:02 PM org.apache.openejb.client.EventLogger log
INFO: RemoteInitialContextCreated{providerUri=http://localhost:46519/tomee/ejb}
01-Oct-2026 16:55:03.191 INFO [main] jdk.internal.reflect.DelegatingMethodAccessorImpl.invoke A valid shutdown command was received via the shutdown port. Stopping the Server instance.
01-Oct-2026 16:55:03.195 INFO [main] jdk.internal.reflect.DelegatingMethodAccessorImpl.invoke Pausing ProtocolHandler ["http-nio-46519"]
Oct 01, 2026 4:55:03 PM org.apache.openejb.arquillian.common.TomEEContainer undeploy
INFO: cleaning <https://ci-builds.apache.org/job/Tomee/job/tomee-10-build-full-tck/ws/tck/microprofile-tck/opentelemetry/target/workdir/0/0c0dc24a-574b-4838-9a74-432b5be397ed.war>
Oct 01, 2026 4:55:03 PM org.apache.openejb.arquillian.common.TomEEContainer undeploy
INFO: cleaning <https://ci-builds.apache.org/job/Tomee/job/tomee-10-build-full-tck/ws/tck/microprofile-tck/opentelemetry/target/workdir/0/0c0dc24a-574b-4838-9a74-432b5be397ed>
01-Oct-2026 16:55:03.201 INFO [main] jdk.internal.reflect.DelegatingMethodAccessorImpl.invoke Stopping service [Catalina]
01-Oct-2026 16:55:03.203 INFO [main] jdk.internal.reflect.DelegatingMethodAccessorImpl.invoke Stopping ProtocolHandler ["http-nio-46519"]
01-Oct-2026 16:55:03.208 INFO [main] org.apache.openejb.server.SimpleServiceManager.stop Stopping server services
01-Oct-2026 16:55:03.223 INFO [main] org.apache.openejb.assembler.classic.Assembler.destroyApplication Undeploying app: openejb
01-Oct-2026 16:55:03.225 SEVERE [main] org.apache.openejb.core.singleton.SingletonInstanceManager.undeploy Unable to unregister MBean openejb.management:J2EEServer=openejb,J2EEApplication=<empty>,EJBModule=openejb,SingletonSessionBean=openejb/Deployer,name=openejb/Deployer,j2eeType=Invocations
01-Oct-2026 16:55:03.242 INFO [main] jdk.internal.reflect.DelegatingMethodAccessorImpl.invoke Destroying ProtocolHandler ["http-nio-46519"]
[INFO] Tests run: 1, Failures: 0, Errors: 0, Skipped: 0, Time elapsed: 14.63 s -- in org.eclipse.microprofile.telemetry.tracing.tck.TestApplication
[INFO]
[INFO] Results:
[INFO]
[INFO] Tests run: 21, Failures: 0, Errors: 0, Skipped: 0
[INFO]
[JENKINS] Recording test results
[INFO]
[INFO] --- jar:3.0.2:jar (default-jar) @ microprofile-opentelemetry-tck ---
[INFO] Building jar: <https://ci-builds.apache.org/job/Tomee/job/tomee-10-build-full-tck/ws/tck/microprofile-tck/opentelemetry/target/microprofile-opentelemetry-tck-10.3.0-SNAPSHOT.jar>
[INFO]
[INFO] --- install:3.2.0:install (default-install) @ microprofile-opentelemetry-tck ---
[INFO] Installing <https://ci-builds.apache.org/job/Tomee/job/tomee-10-build-full-tck/ws/tck/microprofile-tck/opentelemetry/pom.xml> to /home/jenkins/.m2/repository/org/apache/tomee/microprofile-opentelemetry-tck/10.3.0-SNAPSHOT/microprofile-opentelemetry-tck-10.3.0-SNAPSHOT.pom
[INFO] Installing <https://ci-builds.apache.org/job/Tomee/job/tomee-10-build-full-tck/ws/tck/microprofile-tck/opentelemetry/target/microprofile-opentelemetry-tck-10.3.0-SNAPSHOT.jar> to /home/jenkins/.m2/repository/org/apache/tomee/microprofile-opentelemetry-tck/10.3.0-SNAPSHOT/microprofile-opentelemetry-tck-10.3.0-SNAPSHOT.jar
[INFO]
[INFO] ----------------------< org.apache.tomee:jax-rs >-----------------------
[INFO] Building TomEE :: TCK :: JAX-RS TCK 10.3.0-SNAPSHOT [24/27]
[INFO] from jax-rs/pom.xml
[INFO] --------------------------------[ pom ]---------------------------------
[INFO]
[INFO] --- clean:3.5.0:clean (default-clean) @ jax-rs ---
[INFO] Deleting <https://ci-builds.apache.org/job/Tomee/job/tomee-10-build-full-tck/ws/tck/jax-rs/target>
[INFO]
[INFO] --- enforcer:3.6.3:enforce (enforce-maven-version) @ jax-rs ---
[INFO]
[INFO] --- enforcer:3.6.3:enforce (enforce-java-version) @ jax-rs ---
[INFO]
[INFO] --- antrun:3.2.0:run (default) @ jax-rs ---
[INFO] Executing tasks
[INFO] [get] Getting: https://download.eclipse.org/ee4j/jakartaee-tck/jakartaee10/staged/eftl/jakarta-restful-ws-tck-3.1.5.zip
[INFO] [get] To: <https://ci-builds.apache.org/job/Tomee/job/tomee-10-build-full-tck/ws/tck/jax-rs/jakarta-restful-ws-tck-3.1.5.zip>
[INFO] [get] Error opening connection java.io.FileNotFoundException: https://download.eclipse.org/ee4j/jakartaee-tck/jakartaee10/staged/eftl/jakarta-restful-ws-tck-3.1.5.zip
[INFO] [get] Error opening connection java.io.FileNotFoundException: https://download.eclipse.org/ee4j/jakartaee-tck/jakartaee10/staged/eftl/jakarta-restful-ws-tck-3.1.5.zip
[INFO] [get] Error opening connection java.io.FileNotFoundException: https://download.eclipse.org/ee4j/jakartaee-tck/jakartaee10/staged/eftl/jakarta-restful-ws-tck-3.1.5.zip
[INFO] [get] Can't get https://download.eclipse.org/ee4j/jakartaee-tck/jakartaee10/staged/eftl/jakarta-restful-ws-tck-3.1.5.zip to <https://ci-builds.apache.org/job/Tomee/job/tomee-10-build-full-tck/ws/tck/jax-rs/jakarta-restful-ws-tck-3.1.5.zip>
[INFO]
[INFO] ------------------------------------------------------------------------
[INFO] Skipping TomEE :: TCK :: JAX-RS TCK :: Tests
[INFO] This project has been banned from the build due to previous failures.
[INFO] ------------------------------------------------------------------------
[INFO]
[INFO] ------------------------------------------------------------------------
[INFO] Skipping TomEE :: TCK :: JAX-RS TCK :: Tests Embedded
[INFO] This project has been banned from the build due to previous failures.
[INFO] ------------------------------------------------------------------------
[INFO]
[INFO] ------------------------------------------------------------------------
[INFO] Skipping TomEE :: TCK :: JAX-RS TCK :: Signature Test
[INFO] This project has been banned from the build due to previous failures.
[INFO] ------------------------------------------------------------------------
[INFO] ------------------------------------------------------------------------
[INFO] Reactor Summary for TomEE :: TCK 10.3.0-SNAPSHOT:
[INFO]
[INFO] TomEE :: TCK ....................................... SUCCESS [ 9.540 s]
[INFO] TomEE :: TCK :: Common ............................. SUCCESS [ 23.989 s]
[INFO] TomEE :: TCK :: CDI Embedded ....................... SUCCESS [ 17.653 s]
[INFO] TomEE :: TCK :: CDI TomEE .......................... SUCCESS [ 11.014 s]
[INFO] TomEE :: TCK :: CDI TCK Signature Tests ............ SUCCESS [ 5.855 s]
[INFO] TomEE :: TCK :: Bean Validation Embedded ........... SUCCESS [01:46 min]
[INFO] TomEE :: TCK :: Bean Validation TomEE .............. SUCCESS [10:52 min]
[INFO] TomEE :: TCK :: Bean Validation TCK Signature tests SUCCESS [ 7.586 s]
[INFO] TomEE :: TCK :: JSON-P Standalone .................. SUCCESS [ 5.689 s]
[INFO] TomEE :: TCK :: JSON-P Signature Tests ............. SUCCESS [ 5.913 s]
[INFO] TomEE :: TCK :: JSON-B Standalone .................. SUCCESS [ 6.161 s]
[INFO] TomEE :: TCK :: JSON-B Signature Tests ............. SUCCESS [ 5.958 s]
[INFO] TomEE :: TCK :: Concurrency Standalone ............. SUCCESS [04:01 min]
[INFO] TomEE :: TCK :: Concurrency Signature Tests ........ SUCCESS [ 25.976 s]
[INFO] TomEE :: TCK :: MicroProfile ....................... SUCCESS [ 3.185 s]
[INFO] TomEE :: TCK :: MicroProfile Config TCK ............ SUCCESS [06:17 min]
[INFO] TomEE :: TCK :: MicroProfile JWT TCK ............... SUCCESS [08:40 min]
[INFO] TomEE :: TCK :: MicroProfile Health TCK ............ SUCCESS [14:56 min]
[INFO] TomEE :: TCK :: MicroProfile Metrics TCK ........... SUCCESS [33:03 min]
[INFO] TomEE :: TCK :: MicroProfile Rest Client TCK ....... SUCCESS [05:17 min]
[INFO] TomEE :: TCK :: MicroProfile Open API TCK .......... SUCCESS [16:04 min]
[INFO] TomEE :: TCK :: MicroProfile Fault Tolerance TCK ... SUCCESS [24:20 min]
[INFO] TomEE :: TCK :: MicroProfile Open Telemetry TCK .... SUCCESS [14:10 min]
[INFO] TomEE :: TCK :: JAX-RS TCK ......................... FAILURE [ 2.648 s]
[INFO] TomEE :: TCK :: JAX-RS TCK :: Tests ................ SKIPPED
[INFO] TomEE :: TCK :: JAX-RS TCK :: Tests Embedded ....... SKIPPED
[INFO] TomEE :: TCK :: JAX-RS TCK :: Signature Test ....... SKIPPED
[INFO] ------------------------------------------------------------------------
[INFO] BUILD FAILURE
[INFO] ------------------------------------------------------------------------
[INFO] Total time: 02:32 h
[INFO] Finished at: 2026-10-01T16:55:49Z
[INFO] ------------------------------------------------------------------------
[WARNING] The requested profile "all-adapters" could not be activated because it does not exist.
[WARNING] The requested profile "jsonb-tck" could not be activated because it does not exist.
[WARNING] The requested profile "jsonp-tck" could not be activated because it does not exist.
Waiting for Jenkins to finish collecting data
[ERROR] Failed to execute goal org.apache.maven.plugins:maven-antrun-plugin:3.2.0:run (default) on project jax-rs: An Ant BuildException has occurred: Can't get https://download.eclipse.org/ee4j/jakartaee-tck/jakartaee10/staged/eftl/jakarta-restful-ws-tck-3.1.5.zip to <https://ci-builds.apache.org/job/Tomee/job/tomee-10-build-full-tck/ws/tck/jax-rs/jakarta-restful-ws-tck-3.1.5.zip>
[ERROR] around Ant part ...<get skipexisting="true" src="https://download.eclipse.org/ee4j/jakartaee-tck/jakartaee10/staged/eftl/jakarta-restful-ws-tck-3.1.5.zip" dest="jakarta-restful-ws-tck-3.1.5.zip" />... @ 4:183 in <https://ci-builds.apache.org/job/Tomee/job/tomee-10-build-full-tck/ws/tck/jax-rs/target/antrun/build-main.xml>
[ERROR] -> [Help 1]
[ERROR]
[ERROR] To see the full stack trace of the errors, re-run Maven with the -e switch.
[ERROR] Re-run Maven using the -X switch to enable full debug logging.
[ERROR]
[ERROR] For more information about the errors and possible solutions, please read the following articles:
[ERROR] [Help 1] http://cwiki.apache.org/confluence/display/MAVEN/MojoExecutionException
[ERROR]
[ERROR] After correcting the problems, you can resume the build with the command
[ERROR] mvn <goals> -rf :jax-rs
[JENKINS] Archiving <https://ci-builds.apache.org/job/Tomee/job/tomee-10-build-full-tck/ws/tck/microprofile-tck/health/pom.xml> to org.apache.tomee/microprofile-health-tck/10.3.0-SNAPSHOT/microprofile-health-tck-10.3.0-SNAPSHOT.pom
[JENKINS] Archiving <https://ci-builds.apache.org/job/Tomee/job/tomee-10-build-full-tck/ws/tck/microprofile-tck/health/target/microprofile-health-tck-10.3.0-SNAPSHOT.jar> to org.apache.tomee/microprofile-health-tck/10.3.0-SNAPSHOT/microprofile-health-tck-10.3.0-SNAPSHOT.jar
[JENKINS] Archiving <https://ci-builds.apache.org/job/Tomee/job/tomee-10-build-full-tck/ws/tck/jax-rs/jax-rs-tests-embedded/pom.xml> to org.apache.tomee/jax-rs-tests-embedded/10.3.0-SNAPSHOT/jax-rs-tests-embedded-10.3.0-SNAPSHOT.pom
[JENKINS] Archiving <https://ci-builds.apache.org/job/Tomee/job/tomee-10-build-full-tck/ws/tck/microprofile-tck/jwt/pom.xml> to org.apache.tomee/microprofile-jwt-tck/10.3.0-SNAPSHOT/microprofile-jwt-tck-10.3.0-SNAPSHOT.pom
[JENKINS] Archiving <https://ci-builds.apache.org/job/Tomee/job/tomee-10-build-full-tck/ws/tck/microprofile-tck/jwt/target/microprofile-jwt-tck-10.3.0-SNAPSHOT.jar> to org.apache.tomee/microprofile-jwt-tck/10.3.0-SNAPSHOT/microprofile-jwt-tck-10.3.0-SNAPSHOT.jar
[JENKINS] Archiving <https://ci-builds.apache.org/job/Tomee/job/tomee-10-build-full-tck/ws/tck/bval-tomee/pom.xml> to org.apache.tomee/bval-tomee/10.3.0-SNAPSHOT/bval-tomee-10.3.0-SNAPSHOT.pom
[JENKINS] Archiving <https://ci-builds.apache.org/job/Tomee/job/tomee-10-build-full-tck/ws/tck/bval-tomee/target/bval-tomee-10.3.0-SNAPSHOT.jar> to org.apache.tomee/bval-tomee/10.3.0-SNAPSHOT/bval-tomee-10.3.0-SNAPSHOT.jar
[JENKINS] Archiving <https://ci-builds.apache.org/job/Tomee/job/tomee-10-build-full-tck/ws/tck/jax-rs/jax-rs-tests/pom.xml> to org.apache.tomee/jax-rs-tests/10.3.0-SNAPSHOT/jax-rs-tests-10.3.0-SNAPSHOT.pom
[JENKINS] Archiving <https://ci-builds.apache.org/job/Tomee/job/tomee-10-build-full-tck/ws/tck/jax-rs/pom.xml> to org.apache.tomee/jax-rs/10.3.0-SNAPSHOT/jax-rs-10.3.0-SNAPSHOT.pom
[JENKINS] Archiving <https://ci-builds.apache.org/job/Tomee/job/tomee-10-build-full-tck/ws/tck/pom.xml> to org.apache.tomee/tck/10.3.0-SNAPSHOT/tck-10.3.0-SNAPSHOT.pom
[JENKINS] Archiving <https://ci-builds.apache.org/job/Tomee/job/tomee-10-build-full-tck/ws/tck/bval-signature-test/pom.xml> to org.apache.tomee/bval-signature-test/10.3.0-SNAPSHOT/bval-signature-test-10.3.0-SNAPSHOT.pom
[JENKINS] Archiving <https://ci-builds.apache.org/job/Tomee/job/tomee-10-build-full-tck/ws/tck/bval-signature-test/target/bval-signature-test-10.3.0-SNAPSHOT.jar> to org.apache.tomee/bval-signature-test/10.3.0-SNAPSHOT/bval-signature-test-10.3.0-SNAPSHOT.jar
[JENKINS] Archiving <https://ci-builds.apache.org/job/Tomee/job/tomee-10-build-full-tck/ws/tck/cdi-signature-test/pom.xml> to org.apache.tomee/cdi-signature-test/10.3.0-SNAPSHOT/cdi-signature-test-10.3.0-SNAPSHOT.pom
[JENKINS] Archiving <https://ci-builds.apache.org/job/Tomee/job/tomee-10-build-full-tck/ws/tck/cdi-signature-test/target/cdi-signature-test-10.3.0-SNAPSHOT.jar> to org.apache.tomee/cdi-signature-test/10.3.0-SNAPSHOT/cdi-signature-test-10.3.0-SNAPSHOT.jar
[JENKINS] Archiving <https://ci-builds.apache.org/job/Tomee/job/tomee-10-build-full-tck/ws/tck/jsonp-standalone/pom.xml> to org.apache.tomee/jsonp-standalone/10.3.0-SNAPSHOT/jsonp-standalone-10.3.0-SNAPSHOT.pom
[JENKINS] Archiving <https://ci-builds.apache.org/job/Tomee/job/tomee-10-build-full-tck/ws/tck/jsonp-standalone/target/jsonp-standalone-10.3.0-SNAPSHOT.jar> to org.apache.tomee/jsonp-standalone/10.3.0-SNAPSHOT/jsonp-standalone-10.3.0-SNAPSHOT.jar
[JENKINS] Archiving <https://ci-builds.apache.org/job/Tomee/job/tomee-10-build-full-tck/ws/tck/microprofile-tck/metrics/pom.xml> to org.apache.tomee/microprofile-metrics-tck/10.3.0-SNAPSHOT/microprofile-metrics-tck-10.3.0-SNAPSHOT.pom
[JENKINS] Archiving <https://ci-builds.apache.org/job/Tomee/job/tomee-10-build-full-tck/ws/tck/microprofile-tck/metrics/target/microprofile-metrics-tck-10.3.0-SNAPSHOT.jar> to org.apache.tomee/microprofile-metrics-tck/10.3.0-SNAPSHOT/microprofile-metrics-tck-10.3.0-SNAPSHOT.jar
[JENKINS] Archiving <https://ci-builds.apache.org/job/Tomee/job/tomee-10-build-full-tck/ws/tck/cdi-tomee/pom.xml> to org.apache.tomee/cdi-tomee/10.3.0-SNAPSHOT/cdi-tomee-10.3.0-SNAPSHOT.pom
[JENKINS] Archiving <https://ci-builds.apache.org/job/Tomee/job/tomee-10-build-full-tck/ws/tck/cdi-tomee/target/cdi-tomee-10.3.0-SNAPSHOT.jar> to org.apache.tomee/cdi-tomee/10.3.0-SNAPSHOT/cdi-tomee-10.3.0-SNAPSHOT.jar
[JENKINS] Archiving <https://ci-builds.apache.org/job/Tomee/job/tomee-10-build-full-tck/ws/tck/tck-common/pom.xml> to org.apache.tomee/tck-common/10.3.0-SNAPSHOT/tck-common-10.3.0-SNAPSHOT.pom
[JENKINS] Archiving <https://ci-builds.apache.org/job/Tomee/job/tomee-10-build-full-tck/ws/tck/tck-common/target/tck-common-10.3.0-SNAPSHOT.jar> to org.apache.tomee/tck-common/10.3.0-SNAPSHOT/tck-common-10.3.0-SNAPSHOT.jar
[JENKINS] Archiving <https://ci-builds.apache.org/job/Tomee/job/tomee-10-build-full-tck/ws/tck/microprofile-tck/openapi/pom.xml> to org.apache.tomee/microprofile-openapi-tck/10.3.0-SNAPSHOT/microprofile-openapi-tck-10.3.0-SNAPSHOT.pom
[JENKINS] Archiving <https://ci-builds.apache.org/job/Tomee/job/tomee-10-build-full-tck/ws/tck/microprofile-tck/openapi/target/microprofile-openapi-tck-10.3.0-SNAPSHOT.jar> to org.apache.tomee/microprofile-openapi-tck/10.3.0-SNAPSHOT/microprofile-openapi-tck-10.3.0-SNAPSHOT.jar
[JENKINS] Archiving <https://ci-builds.apache.org/job/Tomee/job/tomee-10-build-full-tck/ws/tck/bval-embedded/pom.xml> to org.apache.tomee/bval-embedded/10.3.0-SNAPSHOT/bval-embedded-10.3.0-SNAPSHOT.pom
[JENKINS] Archiving <https://ci-builds.apache.org/job/Tomee/job/tomee-10-build-full-tck/ws/tck/bval-embedded/target/bval-embedded-10.3.0-SNAPSHOT.jar> to org.apache.tomee/bval-embedded/10.3.0-SNAPSHOT/bval-embedded-10.3.0-SNAPSHOT.jar
[JENKINS] Archiving <https://ci-builds.apache.org/job/Tomee/job/tomee-10-build-full-tck/ws/tck/cdi-embedded/pom.xml> to org.apache.tomee/cdi-embedded/10.3.0-SNAPSHOT/cdi-embedded-10.3.0-SNAPSHOT.pom
[JENKINS] Archiving <https://ci-builds.apache.org/job/Tomee/job/tomee-10-build-full-tck/ws/tck/cdi-embedded/target/cdi-embedded-10.3.0-SNAPSHOT.jar> to org.apache.tomee/cdi-embedded/10.3.0-SNAPSHOT/cdi-embedded-10.3.0-SNAPSHOT.jar
[JENKINS] Archiving <https://ci-builds.apache.org/job/Tomee/job/tomee-10-build-full-tck/ws/tck/jax-rs/jax-rs-signature-test/pom.xml> to org.apache.tomee/jax-rs-signature-test/10.3.0-SNAPSHOT/jax-rs-signature-test-10.3.0-SNAPSHOT.pom
[JENKINS] Archiving <https://ci-builds.apache.org/job/Tomee/job/tomee-10-build-full-tck/ws/tck/microprofile-tck/opentelemetry/pom.xml> to org.apache.tomee/microprofile-opentelemetry-tck/10.3.0-SNAPSHOT/microprofile-opentelemetry-tck-10.3.0-SNAPSHOT.pom
[JENKINS] Archiving <https://ci-builds.apache.org/job/Tomee/job/tomee-10-build-full-tck/ws/tck/microprofile-tck/opentelemetry/target/microprofile-opentelemetry-tck-10.3.0-SNAPSHOT.jar> to org.apache.tomee/microprofile-opentelemetry-tck/10.3.0-SNAPSHOT/microprofile-opentelemetry-tck-10.3.0-SNAPSHOT.jar
[JENKINS] Archiving <https://ci-builds.apache.org/job/Tomee/job/tomee-10-build-full-tck/ws/tck/jsonb-signature-test/pom.xml> to org.apache.tomee/jsonb-signature-test/10.3.0-SNAPSHOT/jsonb-signature-test-10.3.0-SNAPSHOT.pom
[JENKINS] Archiving <https://ci-builds.apache.org/job/Tomee/job/tomee-10-build-full-tck/ws/tck/jsonb-signature-test/target/jsonb-signature-test-10.3.0-SNAPSHOT.jar> to org.apache.tomee/jsonb-signature-test/10.3.0-SNAPSHOT/jsonb-signature-test-10.3.0-SNAPSHOT.jar
[JENKINS] Archiving <https://ci-builds.apache.org/job/Tomee/job/tomee-10-build-full-tck/ws/tck/jsonb-standalone/pom.xml> to org.apache.tomee/jsonb-standalone/10.3.0-SNAPSHOT/jsonb-standalone-10.3.0-SNAPSHOT.pom
[JENKINS] Archiving <https://ci-builds.apache.org/job/Tomee/job/tomee-10-build-full-tck/ws/tck/jsonb-standalone/target/jsonb-standalone-10.3.0-SNAPSHOT.jar> to org.apache.tomee/jsonb-standalone/10.3.0-SNAPSHOT/jsonb-standalone-10.3.0-SNAPSHOT.jar
[JENKINS] Archiving <https://ci-builds.apache.org/job/Tomee/job/tomee-10-build-full-tck/ws/tck/jsonp-signature-test/pom.xml> to org.apache.tomee/jsonp-signature-test/10.3.0-SNAPSHOT/jsonp-signature-test-10.3.0-SNAPSHOT.pom
[JENKINS] Archiving <https://ci-builds.apache.org/job/Tomee/job/tomee-10-build-full-tck/ws/tck/jsonp-signature-test/target/jsonp-signature-test-10.3.0-SNAPSHOT.jar> to org.apache.tomee/jsonp-signature-test/10.3.0-SNAPSHOT/jsonp-signature-test-10.3.0-SNAPSHOT.jar
[JENKINS] Archiving <https://ci-builds.apache.org/job/Tomee/job/tomee-10-build-full-tck/ws/tck/microprofile-tck/pom.xml> to org.apache.tomee/microprofile-tck/10.3.0-SNAPSHOT/microprofile-tck-10.3.0-SNAPSHOT.pom
[JENKINS] Archiving <https://ci-builds.apache.org/job/Tomee/job/tomee-10-build-full-tck/ws/tck/microprofile-tck/rest-client/pom.xml> to org.apache.tomee/microprofile-rest-client-tck/10.3.0-SNAPSHOT/microprofile-rest-client-tck-10.3.0-SNAPSHOT.pom
[JENKINS] Archiving <https://ci-builds.apache.org/job/Tomee/job/tomee-10-build-full-tck/ws/tck/microprofile-tck/rest-client/target/microprofile-rest-client-tck-10.3.0-SNAPSHOT.jar> to org.apache.tomee/microprofile-rest-client-tck/10.3.0-SNAPSHOT/microprofile-rest-client-tck-10.3.0-SNAPSHOT.jar
[JENKINS] Archiving <https://ci-builds.apache.org/job/Tomee/job/tomee-10-build-full-tck/ws/tck/microprofile-tck/fault-tolerance/pom.xml> to org.apache.tomee/microprofile-fault-tolerance-tck/10.3.0-SNAPSHOT/microprofile-fault-tolerance-tck-10.3.0-SNAPSHOT.pom
[JENKINS] Archiving <https://ci-builds.apache.org/job/Tomee/job/tomee-10-build-full-tck/ws/tck/microprofile-tck/fault-tolerance/target/microprofile-fault-tolerance-tck-10.3.0-SNAPSHOT.jar> to org.apache.tomee/microprofile-fault-tolerance-tck/10.3.0-SNAPSHOT/microprofile-fault-tolerance-tck-10.3.0-SNAPSHOT.jar
[JENKINS] Archiving <https://ci-builds.apache.org/job/Tomee/job/tomee-10-build-full-tck/ws/tck/microprofile-tck/config/pom.xml> to org.apache.tomee/microprofile-config-tck/10.3.0-SNAPSHOT/microprofile-config-tck-10.3.0-SNAPSHOT.pom
[JENKINS] Archiving <https://ci-builds.apache.org/job/Tomee/job/tomee-10-build-full-tck/ws/tck/microprofile-tck/config/target/microprofile-config-tck-10.3.0-SNAPSHOT.jar> to org.apache.tomee/microprofile-config-tck/10.3.0-SNAPSHOT/microprofile-config-tck-10.3.0-SNAPSHOT.jar
[JENKINS] Archiving <https://ci-builds.apache.org/job/Tomee/job/tomee-10-build-full-tck/ws/tck/concurrency-standalone/pom.xml> to org.apache.tomee/concurrency-standalone/10.3.0-SNAPSHOT/concurrency-standalone-10.3.0-SNAPSHOT.pom
[JENKINS] Archiving <https://ci-builds.apache.org/job/Tomee/job/tomee-10-build-full-tck/ws/tck/concurrency-standalone/target/concurrency-standalone-10.3.0-SNAPSHOT.jar> to org.apache.tomee/concurrency-standalone/10.3.0-SNAPSHOT/concurrency-standalone-10.3.0-SNAPSHOT.jar
[JENKINS] Archiving <https://ci-builds.apache.org/job/Tomee/job/tomee-10-build-full-tck/ws/tck/concurrency-signature-test/pom.xml> to org.apache.tomee/concurrency-signature-test/10.3.0-SNAPSHOT/concurrency-signature-test-10.3.0-SNAPSHOT.pom
[JENKINS] Archiving <https://ci-builds.apache.org/job/Tomee/job/tomee-10-build-full-tck/ws/tck/concurrency-signature-test/target/concurrency-signature-test-10.3.0-SNAPSHOT.jar> to org.apache.tomee/concurrency-signature-test/10.3.0-SNAPSHOT/concurrency-signature-test-10.3.0-SNAPSHOT.jar
No mail will be sent out, as 'TomEE » tomee-10-build-full-tck » TomEE :: TCK :: JAX-RS TCK :: Tests Embedded #123' does not have a result yet. Please make sure you set a proper result in case of pipeline/build scripts.
No mail will be sent out, as 'TomEE » tomee-10-build-full-tck » TomEE :: TCK :: JAX-RS TCK :: Tests #123' does not have a result yet. Please make sure you set a proper result in case of pipeline/build scripts.
Sending e-mails to: commits@tomee.apache.org
No mail will be sent out, as 'TomEE » tomee-10-build-full-tck » TomEE :: TCK :: JAX-RS TCK :: Signature Test #123' does not have a result yet. Please make sure you set a proper result in case of pipeline/build scripts.
channel stopped
INFO: Processing JUnit
INFO: [JUnit] - 118 test report file(s) were found with the pattern '**/target/surefire-reports/TEST-*.xml' relative to '<https://ci-builds.apache.org/job/Tomee/job/tomee-10-build-full-tck/ws/'> for the testing framework 'JUnit'.
[Checks API] No suitable checks publisher found.
INFO: Setting the build status to SUCCESS
Build failed in Jenkins: TomEE » tomee-10-build-full-tck #122
Posted by Apache Jenkins Server <je...@builds.apache.org>.
See <https://ci-builds.apache.org/job/Tomee/job/tomee-10-build-full-tck/122/display/redirect?page=changes>
Changes:
[github] Minor: Regenerated BOMs for 36721d39ee8bf2ba5681284c55f1ddc6e559a71a (#2987)
------------------------------------------
[...truncated 111.92 MiB...]
01-Oct-2026 14:04:45.897 INFO [http-nio-36857-exec-3] org.apache.tomee.microprofile.metrics.VendorMetrics.afterApplicationDeployed Class name: UserDatabase
01-Oct-2026 14:04:45.898 INFO [http-nio-36857-exec-3] org.apache.tomee.microprofile.metrics.VendorMetrics.afterApplicationDeployed Adding vendor metrics for openejb.management:J2EEServer=openejb,J2EEApplication=<empty>,EJBModule=openejb,SingletonSessionBean=openejb/Deployer,name=openejb/Deployer,j2eeType=Invocations
01-Oct-2026 14:04:45.898 INFO [http-nio-36857-exec-3] org.apache.tomee.microprofile.metrics.VendorMetrics.afterApplicationDeployed Class name: org.apache.openejb.monitoring.ManagedMBean
01-Oct-2026 14:04:45.899 INFO [http-nio-36857-exec-3] org.apache.tomee.microprofile.metrics.VendorMetrics.afterApplicationDeployed Adding vendor metrics for openejb.management:J2EEServer=openejb,J2EEApplication=<empty>,EJBModule=file_<https://ci-builds.apache.org/job/Tomee/job/tomee-10-build-full-tck/ws/tck/microprofile-tck/opentelemetry/target/workdir/0/e32442a3-9768-4689-85c2-95bcb2ae83bf/,StatelessSessionBean=e32442a3-9768-4689-85c2-95bcb2ae83bf.Comp,j2eeType=Invocations,name=e32442a3-9768-4689-85c2-95bcb2ae83bf.Comp>
01-Oct-2026 14:04:45.899 INFO [http-nio-36857-exec-3] org.apache.tomee.microprofile.metrics.VendorMetrics.afterApplicationDeployed Class name: org.apache.openejb.monitoring.ManagedMBean
01-Oct-2026 14:04:45.899 INFO [http-nio-36857-exec-3] org.apache.tomee.microprofile.metrics.VendorMetrics.afterApplicationDeployed Adding vendor metrics for openejb.management:ObjectType=containers,DataSource=Default Singleton Container
01-Oct-2026 14:04:45.900 INFO [http-nio-36857-exec-3] org.apache.tomee.microprofile.metrics.VendorMetrics.afterApplicationDeployed Class name: org.apache.openejb.assembler.monitoring.JMXContainer
01-Oct-2026 14:04:45.900 INFO [http-nio-36857-exec-3] org.apache.openejb.assembler.classic.Assembler.createApplication Deployed Application(path=<https://ci-builds.apache.org/job/Tomee/job/tomee-10-build-full-tck/ws/tck/microprofile-tck/opentelemetry/target/workdir/0/e32442a3-9768-4689-85c2-95bcb2ae83bf)>
01-Oct-2026 14:04:46.160 INFO [http-nio-36857-exec-3] org.apache.openejb.util.OptionsLog.info Using 'tomee.mp.scan=all'
01-Oct-2026 14:04:46.165 INFO [http-nio-36857-exec-3] org.apache.openejb.util.OptionsLog.info Using 'tomee.mp.scan=all'
01-Oct-2026 14:04:46.172 INFO [http-nio-36857-exec-3] org.apache.tomee.microprofile.openapi.MicroProfileOpenApiRegistration.onStartup Registering OpenAPI servlet on /openapi for application /e32442a3-9768-4689-85c2-95bcb2ae83bf
01-Oct-2026 14:04:46.236 INFO [http-nio-36857-exec-3] org.apache.jasper.servlet.TldScanner.scanJars At least one JAR was scanned for TLDs yet contained no TLDs. Enable debug logging for this logger for a complete list of JARs that were scanned but no TLDs were found in them. Skipping unneeded JARs during scanning can improve startup time and JSP compilation time.
01-Oct-2026 14:04:46.289 INFO [http-nio-36857-exec-3] org.apache.openejb.util.OptionsLog.info Using 'tomee.mp.scan=all'
01-Oct-2026 14:04:47.146 INFO [http-nio-36857-exec-3] org.apache.openejb.util.OptionsLog.info Using 'openejb.cxf-rs.cache-application=false'
01-Oct-2026 14:04:47.181 INFO [http-nio-36857-exec-3] org.apache.openejb.server.cxf.rs.CxfRsHttpListener.logApplication Application{path='http://localhost:36857/e32442a3-9768-4689-85c2-95bcb2ae83bf/', class=org.eclipse.microprofile.telemetry.tracing.tck.TestApplication$RestApplication, resources=2, providers=6, invalids=0}
01-Oct-2026 14:04:47.182 INFO [http-nio-36857-exec-3] org.apache.openejb.server.cxf.rs.CxfRsHttpListener.logApplication Resource{clazz=org.apache.tomee.microprofile.health.MicroProfileHealthChecksEndpoint, discovered=true, singleton=false}
01-Oct-2026 14:04:47.183 INFO [http-nio-36857-exec-3] org.apache.openejb.server.cxf.rs.CxfRsHttpListener.logApplication Resource{clazz=org.eclipse.microprofile.telemetry.tracing.tck.TestApplication$TestEndpoint, discovered=true, singleton=false}
01-Oct-2026 14:04:47.183 INFO [http-nio-36857-exec-3] org.apache.openejb.server.cxf.rs.CxfRsHttpListener.logApplication Provider{clazz=org.apache.tomee.microprofile.opentelemetry.MPOpenTelemetryFilterRegistration, discovered=true, singleton=false}
01-Oct-2026 14:04:47.183 INFO [http-nio-36857-exec-3] org.apache.openejb.server.cxf.rs.CxfRsHttpListener.logApplication Provider{clazz=io.smallrye.opentelemetry.implementation.rest.OpenTelemetryClientFilter, discovered=true, singleton=false}
01-Oct-2026 14:04:47.184 INFO [http-nio-36857-exec-3] org.apache.openejb.server.cxf.rs.CxfRsHttpListener.logApplication Provider{clazz=org.apache.tomee.microprofile.jwt.jaxrs.MPJWTSecurityAnnotationsInterceptorsFeature, discovered=true, singleton=false}
01-Oct-2026 14:04:47.184 INFO [http-nio-36857-exec-3] org.apache.openejb.server.cxf.rs.CxfRsHttpListener.logApplication Provider{clazz=org.apache.tomee.microprofile.metrics.MetricsFilterRegistration, discovered=true, singleton=false}
01-Oct-2026 14:04:47.184 INFO [http-nio-36857-exec-3] org.apache.openejb.server.cxf.rs.CxfRsHttpListener.logApplication Provider{clazz=org.apache.tomee.microprofile.jwt.bval.ValidationInterceptorsFeature, discovered=true, singleton=false}
01-Oct-2026 14:04:47.185 INFO [http-nio-36857-exec-3] org.apache.openejb.server.cxf.rs.CxfRsHttpListener.logApplication Provider{clazz=org.apache.tomee.microprofile.jwt.MPJWTFilter$MPJWTExceptionMapper, discovered=true, singleton=false}
01-Oct-2026 14:04:47.465 INFO [http-nio-36857-exec-3] org.apache.openejb.util.OptionsLog.info Using 'tomee.mp.scan=all'
01-Oct-2026 14:04:47.643 INFO [http-nio-36857-exec-3] org.apache.openejb.util.OptionsLog.info Using 'tomee.mp.scan=all'
01-Oct-2026 14:04:47.690 INFO [http-nio-36857-exec-3] org.apache.openejb.util.OptionsLog.info Using 'tomee.mp.scan=all'
01-Oct-2026 14:04:47.696 INFO [http-nio-36857-exec-3] org.apache.openejb.util.OptionsLog.info Using 'tomee.mp.scan=all'
01-Oct-2026 14:04:47.713 INFO [http-nio-36857-exec-3] org.apache.openejb.util.OptionsLog.info Using 'tomee.mp.scan=all'
01-Oct-2026 14:04:47.716 INFO [http-nio-36857-exec-3] org.apache.openejb.util.OptionsLog.info Using 'tomee.mp.scan=all'
01-Oct-2026 14:04:47.728 INFO [http-nio-36857-exec-3] org.apache.openejb.util.OptionsLog.info Using 'tomee.mp.scan=all'
01-Oct-2026 14:04:47.731 INFO [http-nio-36857-exec-3] org.apache.openejb.util.OptionsLog.info Using 'tomee.mp.scan=all'
01-Oct-2026 14:04:47.748 INFO [http-nio-36857-exec-3] org.apache.openejb.util.OptionsLog.info Using 'tomee.mp.scan=all'
01-Oct-2026 14:04:47.752 INFO [http-nio-36857-exec-3] org.apache.openejb.util.OptionsLog.info Using 'tomee.mp.scan=all'
01-Oct-2026 14:04:47.766 INFO [http-nio-36857-exec-3] org.apache.openejb.server.cxf.rs.CxfRsHttpListener.deployApplication Using readers:
01-Oct-2026 14:04:47.767 INFO [http-nio-36857-exec-3] org.apache.openejb.server.cxf.rs.CxfRsHttpListener.deployApplication org.apache.cxf.jaxrs.provider.EntityPartProvider@6c45c8fc
01-Oct-2026 14:04:47.767 INFO [http-nio-36857-exec-3] org.apache.openejb.server.cxf.rs.CxfRsHttpListener.deployApplication org.apache.cxf.jaxrs.provider.PrimitiveTextProvider@533590f5
01-Oct-2026 14:04:47.767 INFO [http-nio-36857-exec-3] org.apache.openejb.server.cxf.rs.CxfRsHttpListener.deployApplication org.apache.cxf.jaxrs.provider.FormEncodingProvider@3a2886b2
01-Oct-2026 14:04:47.767 INFO [http-nio-36857-exec-3] org.apache.openejb.server.cxf.rs.CxfRsHttpListener.deployApplication org.apache.cxf.jaxrs.provider.MultipartProvider@1386b04e
01-Oct-2026 14:04:47.767 INFO [http-nio-36857-exec-3] org.apache.openejb.server.cxf.rs.CxfRsHttpListener.deployApplication org.apache.cxf.jaxrs.provider.SourceProvider@35e055ed
01-Oct-2026 14:04:47.767 INFO [http-nio-36857-exec-3] org.apache.openejb.server.cxf.rs.CxfRsHttpListener.deployApplication org.apache.cxf.jaxrs.provider.JAXBElementTypedProvider@77207985
01-Oct-2026 14:04:47.768 INFO [http-nio-36857-exec-3] org.apache.openejb.server.cxf.rs.CxfRsHttpListener.deployApplication org.apache.cxf.jaxrs.provider.JAXBElementProvider@9436cc5
01-Oct-2026 14:04:47.768 INFO [http-nio-36857-exec-3] org.apache.openejb.server.cxf.rs.CxfRsHttpListener.deployApplication org.apache.openejb.server.cxf.rs.johnzon.TomEEJsonbProvider@248e3c76
01-Oct-2026 14:04:47.768 INFO [http-nio-36857-exec-3] org.apache.openejb.server.cxf.rs.CxfRsHttpListener.deployApplication org.apache.openejb.server.cxf.rs.johnzon.TomEEJsonpProvider@6cbf0304
01-Oct-2026 14:04:47.768 INFO [http-nio-36857-exec-3] org.apache.openejb.server.cxf.rs.CxfRsHttpListener.deployApplication org.apache.cxf.jaxrs.provider.StringTextProvider@c4654c6
01-Oct-2026 14:04:47.768 INFO [http-nio-36857-exec-3] org.apache.openejb.server.cxf.rs.CxfRsHttpListener.deployApplication org.apache.cxf.jaxrs.provider.BinaryDataProvider@224b2d84
01-Oct-2026 14:04:47.768 INFO [http-nio-36857-exec-3] org.apache.openejb.server.cxf.rs.CxfRsHttpListener.deployApplication org.apache.cxf.jaxrs.provider.DataSourceProvider@5d86b300
01-Oct-2026 14:04:47.768 INFO [http-nio-36857-exec-3] org.apache.openejb.server.cxf.rs.CxfRsHttpListener.deployApplication Using writers:
01-Oct-2026 14:04:47.769 INFO [http-nio-36857-exec-3] org.apache.openejb.server.cxf.rs.CxfRsHttpListener.deployApplication org.apache.cxf.jaxrs.provider.EntityPartProvider@6c45c8fc
01-Oct-2026 14:04:47.769 INFO [http-nio-36857-exec-3] org.apache.openejb.server.cxf.rs.CxfRsHttpListener.deployApplication org.apache.cxf.jaxrs.provider.JAXBElementTypedProvider@77207985
01-Oct-2026 14:04:47.769 INFO [http-nio-36857-exec-3] org.apache.openejb.server.cxf.rs.CxfRsHttpListener.deployApplication org.apache.johnzon.jaxrs.WadlDocumentMessageBodyWriter@49352c97
01-Oct-2026 14:04:47.769 INFO [http-nio-36857-exec-3] org.apache.openejb.server.cxf.rs.CxfRsHttpListener.deployApplication org.apache.cxf.jaxrs.provider.StringTextProvider@c4654c6
01-Oct-2026 14:04:47.769 INFO [http-nio-36857-exec-3] org.apache.openejb.server.cxf.rs.CxfRsHttpListener.deployApplication org.apache.cxf.jaxrs.nio.NioMessageBodyWriter@776bb113
01-Oct-2026 14:04:47.770 INFO [http-nio-36857-exec-3] org.apache.openejb.server.cxf.rs.CxfRsHttpListener.deployApplication org.apache.cxf.jaxrs.provider.PrimitiveTextProvider@533590f5
01-Oct-2026 14:04:47.770 INFO [http-nio-36857-exec-3] org.apache.openejb.server.cxf.rs.CxfRsHttpListener.deployApplication org.apache.cxf.jaxrs.provider.FormEncodingProvider@3a2886b2
01-Oct-2026 14:04:47.770 INFO [http-nio-36857-exec-3] org.apache.openejb.server.cxf.rs.CxfRsHttpListener.deployApplication org.apache.cxf.jaxrs.provider.MultipartProvider@1386b04e
01-Oct-2026 14:04:47.770 INFO [http-nio-36857-exec-3] org.apache.openejb.server.cxf.rs.CxfRsHttpListener.deployApplication org.apache.cxf.jaxrs.provider.SourceProvider@35e055ed
01-Oct-2026 14:04:47.771 INFO [http-nio-36857-exec-3] org.apache.openejb.server.cxf.rs.CxfRsHttpListener.deployApplication org.apache.cxf.jaxrs.provider.JAXBElementProvider@9436cc5
01-Oct-2026 14:04:47.771 INFO [http-nio-36857-exec-3] org.apache.openejb.server.cxf.rs.CxfRsHttpListener.deployApplication org.apache.openejb.server.cxf.rs.johnzon.TomEEJsonbProvider@248e3c76
01-Oct-2026 14:04:47.771 INFO [http-nio-36857-exec-3] org.apache.openejb.server.cxf.rs.CxfRsHttpListener.deployApplication org.apache.openejb.server.cxf.rs.johnzon.TomEEJsonpProvider@6cbf0304
01-Oct-2026 14:04:47.771 INFO [http-nio-36857-exec-3] org.apache.openejb.server.cxf.rs.CxfRsHttpListener.deployApplication org.apache.cxf.jaxrs.provider.BinaryDataProvider@224b2d84
01-Oct-2026 14:04:47.771 INFO [http-nio-36857-exec-3] org.apache.openejb.server.cxf.rs.CxfRsHttpListener.deployApplication org.apache.cxf.jaxrs.provider.DataSourceProvider@5d86b300
01-Oct-2026 14:04:47.772 INFO [http-nio-36857-exec-3] org.apache.openejb.server.cxf.rs.CxfRsHttpListener.deployApplication Using exception mappers:
01-Oct-2026 14:04:47.772 INFO [http-nio-36857-exec-3] org.apache.openejb.server.cxf.rs.CxfRsHttpListener.deployApplication org.apache.cxf.jaxrs.impl.WebApplicationExceptionMapper@747e0813
01-Oct-2026 14:04:47.772 INFO [http-nio-36857-exec-3] org.apache.openejb.server.cxf.rs.CxfRsHttpListener.deployApplication org.apache.tomee.microprofile.jwt.MPJWTFilter$MPJWTExceptionMapper@1cb4696b
01-Oct-2026 14:04:47.772 INFO [http-nio-36857-exec-3] org.apache.openejb.server.cxf.rs.CxfRsHttpListener.deployApplication org.apache.openejb.server.cxf.rs.EJBExceptionMapper@64ec7c37
01-Oct-2026 14:04:47.772 INFO [http-nio-36857-exec-3] org.apache.openejb.server.cxf.rs.CxfRsHttpListener.deployApplication org.apache.cxf.jaxrs.validation.ValidationExceptionMapper@55c149b6
01-Oct-2026 14:04:47.776 INFO [http-nio-36857-exec-3] org.apache.openejb.server.cxf.rs.CxfRsHttpListener.logEndpoints REST Application: http://localhost:36857/e32442a3-9768-4689-85c2-95bcb2ae83bf/ -> org.eclipse.microprofile.telemetry.tracing.tck.TestApplication$RestApplication@7ffd4e16
01-Oct-2026 14:04:47.783 INFO [http-nio-36857-exec-3] org.apache.openejb.server.cxf.rs.CxfRsHttpListener.logEndpoints Service URI: http://localhost:36857/e32442a3-9768-4689-85c2-95bcb2ae83bf/health -> Pojo org.apache.tomee.microprofile.health.MicroProfileHealthChecksEndpoint
01-Oct-2026 14:04:47.784 INFO [http-nio-36857-exec-3] org.apache.openejb.server.cxf.rs.CxfRsHttpListener.logEndpoints GET http://localhost:36857/e32442a3-9768-4689-85c2-95bcb2ae83bf/health -> Response getChecks()
01-Oct-2026 14:04:47.784 INFO [http-nio-36857-exec-3] org.apache.openejb.server.cxf.rs.CxfRsHttpListener.logEndpoints GET http://localhost:36857/e32442a3-9768-4689-85c2-95bcb2ae83bf/health/live -> Response getLiveChecks()
01-Oct-2026 14:04:47.784 INFO [http-nio-36857-exec-3] org.apache.openejb.server.cxf.rs.CxfRsHttpListener.logEndpoints GET http://localhost:36857/e32442a3-9768-4689-85c2-95bcb2ae83bf/health/ready -> Response getReadyChecks()
01-Oct-2026 14:04:47.785 INFO [http-nio-36857-exec-3] org.apache.openejb.server.cxf.rs.CxfRsHttpListener.logEndpoints GET http://localhost:36857/e32442a3-9768-4689-85c2-95bcb2ae83bf/health/started -> Response getStartedChecks()
01-Oct-2026 14:04:47.785 INFO [http-nio-36857-exec-3] org.apache.openejb.server.cxf.rs.CxfRsHttpListener.logEndpoints Service URI: http://localhost:36857/e32442a3-9768-4689-85c2-95bcb2ae83bf/rest -> Pojo org.eclipse.microprofile.telemetry.tracing.tck.TestApplication$TestEndpoint
01-Oct-2026 14:04:47.785 INFO [http-nio-36857-exec-3] org.apache.openejb.server.cxf.rs.CxfRsHttpListener.logEndpoints GET http://localhost:36857/e32442a3-9768-4689-85c2-95bcb2ae83bf/rest -> String hello()
Oct 01, 2026 2:04:49 PM org.apache.openejb.client.EventLogger log
INFO: RemoteInitialContextCreated{providerUri=http://localhost:36857/tomee/ejb}
01-Oct-2026 14:04:49.298 INFO [http-nio-36857-exec-6] org.apache.openejb.util.OptionsLog.info Using 'openejb.internal.beans.security.enabled=false'
01-Oct-2026 14:04:49.299 INFO [http-nio-36857-exec-6] org.apache.openejb.assembler.classic.Assembler.destroyApplication Undeploying app: <https://ci-builds.apache.org/job/Tomee/job/tomee-10-build-full-tck/ws/tck/microprofile-tck/opentelemetry/target/workdir/0/e32442a3-9768-4689-85c2-95bcb2ae83bf>
Oct 01, 2026 2:04:49 PM org.apache.openejb.arquillian.common.TomEEContainer undeploy
INFO: cleaning <https://ci-builds.apache.org/job/Tomee/job/tomee-10-build-full-tck/ws/tck/microprofile-tck/opentelemetry/target/workdir/0/e32442a3-9768-4689-85c2-95bcb2ae83bf.war>
Oct 01, 2026 2:04:49 PM org.apache.openejb.arquillian.common.TomEEContainer undeploy
INFO: cleaning <https://ci-builds.apache.org/job/Tomee/job/tomee-10-build-full-tck/ws/tck/microprofile-tck/opentelemetry/target/workdir/0/e32442a3-9768-4689-85c2-95bcb2ae83bf>
01-Oct-2026 14:04:49.511 INFO [main] jdk.internal.reflect.DelegatingMethodAccessorImpl.invoke A valid shutdown command was received via the shutdown port. Stopping the Server instance.
01-Oct-2026 14:04:49.513 INFO [main] jdk.internal.reflect.DelegatingMethodAccessorImpl.invoke Pausing ProtocolHandler ["http-nio-36857"]
01-Oct-2026 14:04:49.519 INFO [main] jdk.internal.reflect.DelegatingMethodAccessorImpl.invoke Stopping service [Catalina]
01-Oct-2026 14:04:49.521 INFO [main] jdk.internal.reflect.DelegatingMethodAccessorImpl.invoke Stopping ProtocolHandler ["http-nio-36857"]
01-Oct-2026 14:04:49.526 INFO [main] org.apache.openejb.server.SimpleServiceManager.stop Stopping server services
01-Oct-2026 14:04:49.534 INFO [main] org.apache.openejb.assembler.classic.Assembler.destroyApplication Undeploying app: openejb
01-Oct-2026 14:04:49.536 SEVERE [main] org.apache.openejb.core.singleton.SingletonInstanceManager.undeploy Unable to unregister MBean openejb.management:J2EEServer=openejb,J2EEApplication=<empty>,EJBModule=openejb,SingletonSessionBean=openejb/Deployer,name=openejb/Deployer,j2eeType=Invocations
01-Oct-2026 14:04:49.551 INFO [main] jdk.internal.reflect.DelegatingMethodAccessorImpl.invoke Destroying ProtocolHandler ["http-nio-36857"]
[INFO] Tests run: 1, Failures: 0, Errors: 0, Skipped: 0, Time elapsed: 14.51 s -- in org.eclipse.microprofile.telemetry.tracing.tck.TestApplication
[INFO]
[INFO] Results:
[INFO]
[INFO] Tests run: 21, Failures: 0, Errors: 0, Skipped: 0
[INFO]
[JENKINS] Recording test results
[INFO]
[INFO] --- jar:3.0.2:jar (default-jar) @ microprofile-opentelemetry-tck ---
[INFO] Building jar: <https://ci-builds.apache.org/job/Tomee/job/tomee-10-build-full-tck/ws/tck/microprofile-tck/opentelemetry/target/microprofile-opentelemetry-tck-10.3.0-SNAPSHOT.jar>
[INFO]
[INFO] --- install:3.2.0:install (default-install) @ microprofile-opentelemetry-tck ---
[INFO] Installing <https://ci-builds.apache.org/job/Tomee/job/tomee-10-build-full-tck/ws/tck/microprofile-tck/opentelemetry/pom.xml> to /home/jenkins/.m2/repository/org/apache/tomee/microprofile-opentelemetry-tck/10.3.0-SNAPSHOT/microprofile-opentelemetry-tck-10.3.0-SNAPSHOT.pom
[INFO] Installing <https://ci-builds.apache.org/job/Tomee/job/tomee-10-build-full-tck/ws/tck/microprofile-tck/opentelemetry/target/microprofile-opentelemetry-tck-10.3.0-SNAPSHOT.jar> to /home/jenkins/.m2/repository/org/apache/tomee/microprofile-opentelemetry-tck/10.3.0-SNAPSHOT/microprofile-opentelemetry-tck-10.3.0-SNAPSHOT.jar
[INFO]
[INFO] ----------------------< org.apache.tomee:jax-rs >-----------------------
[INFO] Building TomEE :: TCK :: JAX-RS TCK 10.3.0-SNAPSHOT [24/27]
[INFO] from jax-rs/pom.xml
[INFO] --------------------------------[ pom ]---------------------------------
[INFO]
[INFO] --- clean:3.5.0:clean (default-clean) @ jax-rs ---
[INFO] Deleting <https://ci-builds.apache.org/job/Tomee/job/tomee-10-build-full-tck/ws/tck/jax-rs/target>
[INFO]
[INFO] --- enforcer:3.6.3:enforce (enforce-maven-version) @ jax-rs ---
[INFO]
[INFO] --- enforcer:3.6.3:enforce (enforce-java-version) @ jax-rs ---
[INFO]
[INFO] --- antrun:3.2.0:run (default) @ jax-rs ---
[INFO] Executing tasks
[INFO] [get] Getting: https://download.eclipse.org/ee4j/jakartaee-tck/jakartaee10/staged/eftl/jakarta-restful-ws-tck-3.1.5.zip
[INFO] [get] To: <https://ci-builds.apache.org/job/Tomee/job/tomee-10-build-full-tck/ws/tck/jax-rs/jakarta-restful-ws-tck-3.1.5.zip>
[INFO] [get] Error opening connection java.io.FileNotFoundException: https://download.eclipse.org/ee4j/jakartaee-tck/jakartaee10/staged/eftl/jakarta-restful-ws-tck-3.1.5.zip
[INFO] [get] Error opening connection java.io.FileNotFoundException: https://download.eclipse.org/ee4j/jakartaee-tck/jakartaee10/staged/eftl/jakarta-restful-ws-tck-3.1.5.zip
[INFO] [get] Error opening connection java.io.FileNotFoundException: https://download.eclipse.org/ee4j/jakartaee-tck/jakartaee10/staged/eftl/jakarta-restful-ws-tck-3.1.5.zip
[INFO] [get] Can't get https://download.eclipse.org/ee4j/jakartaee-tck/jakartaee10/staged/eftl/jakarta-restful-ws-tck-3.1.5.zip to <https://ci-builds.apache.org/job/Tomee/job/tomee-10-build-full-tck/ws/tck/jax-rs/jakarta-restful-ws-tck-3.1.5.zip>
[INFO]
[INFO] ------------------------------------------------------------------------
[INFO] Skipping TomEE :: TCK :: JAX-RS TCK :: Tests
[INFO] This project has been banned from the build due to previous failures.
[INFO] ------------------------------------------------------------------------
[INFO]
[INFO] ------------------------------------------------------------------------
[INFO] Skipping TomEE :: TCK :: JAX-RS TCK :: Tests Embedded
[INFO] This project has been banned from the build due to previous failures.
[INFO] ------------------------------------------------------------------------
[INFO]
[INFO] ------------------------------------------------------------------------
[INFO] Skipping TomEE :: TCK :: JAX-RS TCK :: Signature Test
[INFO] This project has been banned from the build due to previous failures.
[INFO] ------------------------------------------------------------------------
[INFO] ------------------------------------------------------------------------
[INFO] Reactor Summary for TomEE :: TCK 10.3.0-SNAPSHOT:
[INFO]
[INFO] TomEE :: TCK ....................................... SUCCESS [ 8.951 s]
[INFO] TomEE :: TCK :: Common ............................. SUCCESS [ 24.688 s]
[INFO] TomEE :: TCK :: CDI Embedded ....................... SUCCESS [ 18.088 s]
[INFO] TomEE :: TCK :: CDI TomEE .......................... SUCCESS [ 10.758 s]
[INFO] TomEE :: TCK :: CDI TCK Signature Tests ............ SUCCESS [ 5.717 s]
[INFO] TomEE :: TCK :: Bean Validation Embedded ........... SUCCESS [01:53 min]
[INFO] TomEE :: TCK :: Bean Validation TomEE .............. SUCCESS [10:58 min]
[INFO] TomEE :: TCK :: Bean Validation TCK Signature tests SUCCESS [ 7.942 s]
[INFO] TomEE :: TCK :: JSON-P Standalone .................. SUCCESS [ 5.652 s]
[INFO] TomEE :: TCK :: JSON-P Signature Tests ............. SUCCESS [ 6.050 s]
[INFO] TomEE :: TCK :: JSON-B Standalone .................. SUCCESS [ 5.953 s]
[INFO] TomEE :: TCK :: JSON-B Signature Tests ............. SUCCESS [ 5.717 s]
[INFO] TomEE :: TCK :: Concurrency Standalone ............. SUCCESS [04:04 min]
[INFO] TomEE :: TCK :: Concurrency Signature Tests ........ SUCCESS [ 26.287 s]
[INFO] TomEE :: TCK :: MicroProfile ....................... SUCCESS [ 3.042 s]
[INFO] TomEE :: TCK :: MicroProfile Config TCK ............ SUCCESS [06:22 min]
[INFO] TomEE :: TCK :: MicroProfile JWT TCK ............... SUCCESS [08:43 min]
[INFO] TomEE :: TCK :: MicroProfile Health TCK ............ SUCCESS [15:15 min]
[INFO] TomEE :: TCK :: MicroProfile Metrics TCK ........... SUCCESS [33:04 min]
[INFO] TomEE :: TCK :: MicroProfile Rest Client TCK ....... SUCCESS [05:16 min]
[INFO] TomEE :: TCK :: MicroProfile Open API TCK .......... SUCCESS [16:12 min]
[INFO] TomEE :: TCK :: MicroProfile Fault Tolerance TCK ... SUCCESS [24:20 min]
[INFO] TomEE :: TCK :: MicroProfile Open Telemetry TCK .... SUCCESS [14:08 min]
[INFO] TomEE :: TCK :: JAX-RS TCK ......................... FAILURE [ 2.867 s]
[INFO] TomEE :: TCK :: JAX-RS TCK :: Tests ................ SKIPPED
[INFO] TomEE :: TCK :: JAX-RS TCK :: Tests Embedded ....... SKIPPED
[INFO] TomEE :: TCK :: JAX-RS TCK :: Signature Test ....... SKIPPED
[INFO] ------------------------------------------------------------------------
[INFO] BUILD FAILURE
[INFO] ------------------------------------------------------------------------
[INFO] Total time: 02:33 h
[INFO] Finished at: 2026-10-01T14:05:34Z
[INFO] ------------------------------------------------------------------------
[WARNING] The requested profile "all-adapters" could not be activated because it does not exist.
[WARNING] The requested profile "jsonb-tck" could not be activated because it does not exist.
[WARNING] The requested profile "jsonp-tck" could not be activated because it does not exist.
Waiting for Jenkins to finish collecting data
[ERROR] Failed to execute goal org.apache.maven.plugins:maven-antrun-plugin:3.2.0:run (default) on project jax-rs: An Ant BuildException has occurred: Can't get https://download.eclipse.org/ee4j/jakartaee-tck/jakartaee10/staged/eftl/jakarta-restful-ws-tck-3.1.5.zip to <https://ci-builds.apache.org/job/Tomee/job/tomee-10-build-full-tck/ws/tck/jax-rs/jakarta-restful-ws-tck-3.1.5.zip>
[ERROR] around Ant part ...<get skipexisting="true" src="https://download.eclipse.org/ee4j/jakartaee-tck/jakartaee10/staged/eftl/jakarta-restful-ws-tck-3.1.5.zip" dest="jakarta-restful-ws-tck-3.1.5.zip" />... @ 4:183 in <https://ci-builds.apache.org/job/Tomee/job/tomee-10-build-full-tck/ws/tck/jax-rs/target/antrun/build-main.xml>
[ERROR] -> [Help 1]
[ERROR]
[ERROR] To see the full stack trace of the errors, re-run Maven with the -e switch.
[ERROR] Re-run Maven using the -X switch to enable full debug logging.
[ERROR]
[ERROR] For more information about the errors and possible solutions, please read the following articles:
[ERROR] [Help 1] http://cwiki.apache.org/confluence/display/MAVEN/MojoExecutionException
[ERROR]
[ERROR] After correcting the problems, you can resume the build with the command
[ERROR] mvn <goals> -rf :jax-rs
[JENKINS] Archiving <https://ci-builds.apache.org/job/Tomee/job/tomee-10-build-full-tck/ws/tck/microprofile-tck/health/pom.xml> to org.apache.tomee/microprofile-health-tck/10.3.0-SNAPSHOT/microprofile-health-tck-10.3.0-SNAPSHOT.pom
[JENKINS] Archiving <https://ci-builds.apache.org/job/Tomee/job/tomee-10-build-full-tck/ws/tck/microprofile-tck/health/target/microprofile-health-tck-10.3.0-SNAPSHOT.jar> to org.apache.tomee/microprofile-health-tck/10.3.0-SNAPSHOT/microprofile-health-tck-10.3.0-SNAPSHOT.jar
[JENKINS] Archiving <https://ci-builds.apache.org/job/Tomee/job/tomee-10-build-full-tck/ws/tck/jax-rs/jax-rs-tests-embedded/pom.xml> to org.apache.tomee/jax-rs-tests-embedded/10.3.0-SNAPSHOT/jax-rs-tests-embedded-10.3.0-SNAPSHOT.pom
[JENKINS] Archiving <https://ci-builds.apache.org/job/Tomee/job/tomee-10-build-full-tck/ws/tck/microprofile-tck/jwt/pom.xml> to org.apache.tomee/microprofile-jwt-tck/10.3.0-SNAPSHOT/microprofile-jwt-tck-10.3.0-SNAPSHOT.pom
[JENKINS] Archiving <https://ci-builds.apache.org/job/Tomee/job/tomee-10-build-full-tck/ws/tck/microprofile-tck/jwt/target/microprofile-jwt-tck-10.3.0-SNAPSHOT.jar> to org.apache.tomee/microprofile-jwt-tck/10.3.0-SNAPSHOT/microprofile-jwt-tck-10.3.0-SNAPSHOT.jar
[JENKINS] Archiving <https://ci-builds.apache.org/job/Tomee/job/tomee-10-build-full-tck/ws/tck/bval-tomee/pom.xml> to org.apache.tomee/bval-tomee/10.3.0-SNAPSHOT/bval-tomee-10.3.0-SNAPSHOT.pom
[JENKINS] Archiving <https://ci-builds.apache.org/job/Tomee/job/tomee-10-build-full-tck/ws/tck/bval-tomee/target/bval-tomee-10.3.0-SNAPSHOT.jar> to org.apache.tomee/bval-tomee/10.3.0-SNAPSHOT/bval-tomee-10.3.0-SNAPSHOT.jar
[JENKINS] Archiving <https://ci-builds.apache.org/job/Tomee/job/tomee-10-build-full-tck/ws/tck/jax-rs/jax-rs-tests/pom.xml> to org.apache.tomee/jax-rs-tests/10.3.0-SNAPSHOT/jax-rs-tests-10.3.0-SNAPSHOT.pom
[JENKINS] Archiving <https://ci-builds.apache.org/job/Tomee/job/tomee-10-build-full-tck/ws/tck/jax-rs/pom.xml> to org.apache.tomee/jax-rs/10.3.0-SNAPSHOT/jax-rs-10.3.0-SNAPSHOT.pom
[JENKINS] Archiving <https://ci-builds.apache.org/job/Tomee/job/tomee-10-build-full-tck/ws/tck/pom.xml> to org.apache.tomee/tck/10.3.0-SNAPSHOT/tck-10.3.0-SNAPSHOT.pom
[JENKINS] Archiving <https://ci-builds.apache.org/job/Tomee/job/tomee-10-build-full-tck/ws/tck/bval-signature-test/pom.xml> to org.apache.tomee/bval-signature-test/10.3.0-SNAPSHOT/bval-signature-test-10.3.0-SNAPSHOT.pom
[JENKINS] Archiving <https://ci-builds.apache.org/job/Tomee/job/tomee-10-build-full-tck/ws/tck/bval-signature-test/target/bval-signature-test-10.3.0-SNAPSHOT.jar> to org.apache.tomee/bval-signature-test/10.3.0-SNAPSHOT/bval-signature-test-10.3.0-SNAPSHOT.jar
[JENKINS] Archiving <https://ci-builds.apache.org/job/Tomee/job/tomee-10-build-full-tck/ws/tck/cdi-signature-test/pom.xml> to org.apache.tomee/cdi-signature-test/10.3.0-SNAPSHOT/cdi-signature-test-10.3.0-SNAPSHOT.pom
[JENKINS] Archiving <https://ci-builds.apache.org/job/Tomee/job/tomee-10-build-full-tck/ws/tck/cdi-signature-test/target/cdi-signature-test-10.3.0-SNAPSHOT.jar> to org.apache.tomee/cdi-signature-test/10.3.0-SNAPSHOT/cdi-signature-test-10.3.0-SNAPSHOT.jar
[JENKINS] Archiving <https://ci-builds.apache.org/job/Tomee/job/tomee-10-build-full-tck/ws/tck/jsonp-standalone/pom.xml> to org.apache.tomee/jsonp-standalone/10.3.0-SNAPSHOT/jsonp-standalone-10.3.0-SNAPSHOT.pom
[JENKINS] Archiving <https://ci-builds.apache.org/job/Tomee/job/tomee-10-build-full-tck/ws/tck/jsonp-standalone/target/jsonp-standalone-10.3.0-SNAPSHOT.jar> to org.apache.tomee/jsonp-standalone/10.3.0-SNAPSHOT/jsonp-standalone-10.3.0-SNAPSHOT.jar
[JENKINS] Archiving <https://ci-builds.apache.org/job/Tomee/job/tomee-10-build-full-tck/ws/tck/microprofile-tck/metrics/pom.xml> to org.apache.tomee/microprofile-metrics-tck/10.3.0-SNAPSHOT/microprofile-metrics-tck-10.3.0-SNAPSHOT.pom
[JENKINS] Archiving <https://ci-builds.apache.org/job/Tomee/job/tomee-10-build-full-tck/ws/tck/microprofile-tck/metrics/target/microprofile-metrics-tck-10.3.0-SNAPSHOT.jar> to org.apache.tomee/microprofile-metrics-tck/10.3.0-SNAPSHOT/microprofile-metrics-tck-10.3.0-SNAPSHOT.jar
[JENKINS] Archiving <https://ci-builds.apache.org/job/Tomee/job/tomee-10-build-full-tck/ws/tck/cdi-tomee/pom.xml> to org.apache.tomee/cdi-tomee/10.3.0-SNAPSHOT/cdi-tomee-10.3.0-SNAPSHOT.pom
[JENKINS] Archiving <https://ci-builds.apache.org/job/Tomee/job/tomee-10-build-full-tck/ws/tck/cdi-tomee/target/cdi-tomee-10.3.0-SNAPSHOT.jar> to org.apache.tomee/cdi-tomee/10.3.0-SNAPSHOT/cdi-tomee-10.3.0-SNAPSHOT.jar
[JENKINS] Archiving <https://ci-builds.apache.org/job/Tomee/job/tomee-10-build-full-tck/ws/tck/tck-common/pom.xml> to org.apache.tomee/tck-common/10.3.0-SNAPSHOT/tck-common-10.3.0-SNAPSHOT.pom
[JENKINS] Archiving <https://ci-builds.apache.org/job/Tomee/job/tomee-10-build-full-tck/ws/tck/tck-common/target/tck-common-10.3.0-SNAPSHOT.jar> to org.apache.tomee/tck-common/10.3.0-SNAPSHOT/tck-common-10.3.0-SNAPSHOT.jar
[JENKINS] Archiving <https://ci-builds.apache.org/job/Tomee/job/tomee-10-build-full-tck/ws/tck/microprofile-tck/openapi/pom.xml> to org.apache.tomee/microprofile-openapi-tck/10.3.0-SNAPSHOT/microprofile-openapi-tck-10.3.0-SNAPSHOT.pom
[JENKINS] Archiving <https://ci-builds.apache.org/job/Tomee/job/tomee-10-build-full-tck/ws/tck/microprofile-tck/openapi/target/microprofile-openapi-tck-10.3.0-SNAPSHOT.jar> to org.apache.tomee/microprofile-openapi-tck/10.3.0-SNAPSHOT/microprofile-openapi-tck-10.3.0-SNAPSHOT.jar
[JENKINS] Archiving <https://ci-builds.apache.org/job/Tomee/job/tomee-10-build-full-tck/ws/tck/bval-embedded/pom.xml> to org.apache.tomee/bval-embedded/10.3.0-SNAPSHOT/bval-embedded-10.3.0-SNAPSHOT.pom
[JENKINS] Archiving <https://ci-builds.apache.org/job/Tomee/job/tomee-10-build-full-tck/ws/tck/bval-embedded/target/bval-embedded-10.3.0-SNAPSHOT.jar> to org.apache.tomee/bval-embedded/10.3.0-SNAPSHOT/bval-embedded-10.3.0-SNAPSHOT.jar
[JENKINS] Archiving <https://ci-builds.apache.org/job/Tomee/job/tomee-10-build-full-tck/ws/tck/cdi-embedded/pom.xml> to org.apache.tomee/cdi-embedded/10.3.0-SNAPSHOT/cdi-embedded-10.3.0-SNAPSHOT.pom
[JENKINS] Archiving <https://ci-builds.apache.org/job/Tomee/job/tomee-10-build-full-tck/ws/tck/cdi-embedded/target/cdi-embedded-10.3.0-SNAPSHOT.jar> to org.apache.tomee/cdi-embedded/10.3.0-SNAPSHOT/cdi-embedded-10.3.0-SNAPSHOT.jar
[JENKINS] Archiving <https://ci-builds.apache.org/job/Tomee/job/tomee-10-build-full-tck/ws/tck/jax-rs/jax-rs-signature-test/pom.xml> to org.apache.tomee/jax-rs-signature-test/10.3.0-SNAPSHOT/jax-rs-signature-test-10.3.0-SNAPSHOT.pom
[JENKINS] Archiving <https://ci-builds.apache.org/job/Tomee/job/tomee-10-build-full-tck/ws/tck/microprofile-tck/opentelemetry/pom.xml> to org.apache.tomee/microprofile-opentelemetry-tck/10.3.0-SNAPSHOT/microprofile-opentelemetry-tck-10.3.0-SNAPSHOT.pom
[JENKINS] Archiving <https://ci-builds.apache.org/job/Tomee/job/tomee-10-build-full-tck/ws/tck/microprofile-tck/opentelemetry/target/microprofile-opentelemetry-tck-10.3.0-SNAPSHOT.jar> to org.apache.tomee/microprofile-opentelemetry-tck/10.3.0-SNAPSHOT/microprofile-opentelemetry-tck-10.3.0-SNAPSHOT.jar
[JENKINS] Archiving <https://ci-builds.apache.org/job/Tomee/job/tomee-10-build-full-tck/ws/tck/jsonb-signature-test/pom.xml> to org.apache.tomee/jsonb-signature-test/10.3.0-SNAPSHOT/jsonb-signature-test-10.3.0-SNAPSHOT.pom
[JENKINS] Archiving <https://ci-builds.apache.org/job/Tomee/job/tomee-10-build-full-tck/ws/tck/jsonb-signature-test/target/jsonb-signature-test-10.3.0-SNAPSHOT.jar> to org.apache.tomee/jsonb-signature-test/10.3.0-SNAPSHOT/jsonb-signature-test-10.3.0-SNAPSHOT.jar
[JENKINS] Archiving <https://ci-builds.apache.org/job/Tomee/job/tomee-10-build-full-tck/ws/tck/jsonb-standalone/pom.xml> to org.apache.tomee/jsonb-standalone/10.3.0-SNAPSHOT/jsonb-standalone-10.3.0-SNAPSHOT.pom
[JENKINS] Archiving <https://ci-builds.apache.org/job/Tomee/job/tomee-10-build-full-tck/ws/tck/jsonb-standalone/target/jsonb-standalone-10.3.0-SNAPSHOT.jar> to org.apache.tomee/jsonb-standalone/10.3.0-SNAPSHOT/jsonb-standalone-10.3.0-SNAPSHOT.jar
[JENKINS] Archiving <https://ci-builds.apache.org/job/Tomee/job/tomee-10-build-full-tck/ws/tck/jsonp-signature-test/pom.xml> to org.apache.tomee/jsonp-signature-test/10.3.0-SNAPSHOT/jsonp-signature-test-10.3.0-SNAPSHOT.pom
[JENKINS] Archiving <https://ci-builds.apache.org/job/Tomee/job/tomee-10-build-full-tck/ws/tck/jsonp-signature-test/target/jsonp-signature-test-10.3.0-SNAPSHOT.jar> to org.apache.tomee/jsonp-signature-test/10.3.0-SNAPSHOT/jsonp-signature-test-10.3.0-SNAPSHOT.jar
[JENKINS] Archiving <https://ci-builds.apache.org/job/Tomee/job/tomee-10-build-full-tck/ws/tck/microprofile-tck/pom.xml> to org.apache.tomee/microprofile-tck/10.3.0-SNAPSHOT/microprofile-tck-10.3.0-SNAPSHOT.pom
[JENKINS] Archiving <https://ci-builds.apache.org/job/Tomee/job/tomee-10-build-full-tck/ws/tck/microprofile-tck/rest-client/pom.xml> to org.apache.tomee/microprofile-rest-client-tck/10.3.0-SNAPSHOT/microprofile-rest-client-tck-10.3.0-SNAPSHOT.pom
[JENKINS] Archiving <https://ci-builds.apache.org/job/Tomee/job/tomee-10-build-full-tck/ws/tck/microprofile-tck/rest-client/target/microprofile-rest-client-tck-10.3.0-SNAPSHOT.jar> to org.apache.tomee/microprofile-rest-client-tck/10.3.0-SNAPSHOT/microprofile-rest-client-tck-10.3.0-SNAPSHOT.jar
[JENKINS] Archiving <https://ci-builds.apache.org/job/Tomee/job/tomee-10-build-full-tck/ws/tck/microprofile-tck/fault-tolerance/pom.xml> to org.apache.tomee/microprofile-fault-tolerance-tck/10.3.0-SNAPSHOT/microprofile-fault-tolerance-tck-10.3.0-SNAPSHOT.pom
[JENKINS] Archiving <https://ci-builds.apache.org/job/Tomee/job/tomee-10-build-full-tck/ws/tck/microprofile-tck/fault-tolerance/target/microprofile-fault-tolerance-tck-10.3.0-SNAPSHOT.jar> to org.apache.tomee/microprofile-fault-tolerance-tck/10.3.0-SNAPSHOT/microprofile-fault-tolerance-tck-10.3.0-SNAPSHOT.jar
[JENKINS] Archiving <https://ci-builds.apache.org/job/Tomee/job/tomee-10-build-full-tck/ws/tck/microprofile-tck/config/pom.xml> to org.apache.tomee/microprofile-config-tck/10.3.0-SNAPSHOT/microprofile-config-tck-10.3.0-SNAPSHOT.pom
[JENKINS] Archiving <https://ci-builds.apache.org/job/Tomee/job/tomee-10-build-full-tck/ws/tck/microprofile-tck/config/target/microprofile-config-tck-10.3.0-SNAPSHOT.jar> to org.apache.tomee/microprofile-config-tck/10.3.0-SNAPSHOT/microprofile-config-tck-10.3.0-SNAPSHOT.jar
[JENKINS] Archiving <https://ci-builds.apache.org/job/Tomee/job/tomee-10-build-full-tck/ws/tck/concurrency-standalone/pom.xml> to org.apache.tomee/concurrency-standalone/10.3.0-SNAPSHOT/concurrency-standalone-10.3.0-SNAPSHOT.pom
[JENKINS] Archiving <https://ci-builds.apache.org/job/Tomee/job/tomee-10-build-full-tck/ws/tck/concurrency-standalone/target/concurrency-standalone-10.3.0-SNAPSHOT.jar> to org.apache.tomee/concurrency-standalone/10.3.0-SNAPSHOT/concurrency-standalone-10.3.0-SNAPSHOT.jar
[JENKINS] Archiving <https://ci-builds.apache.org/job/Tomee/job/tomee-10-build-full-tck/ws/tck/concurrency-signature-test/pom.xml> to org.apache.tomee/concurrency-signature-test/10.3.0-SNAPSHOT/concurrency-signature-test-10.3.0-SNAPSHOT.pom
[JENKINS] Archiving <https://ci-builds.apache.org/job/Tomee/job/tomee-10-build-full-tck/ws/tck/concurrency-signature-test/target/concurrency-signature-test-10.3.0-SNAPSHOT.jar> to org.apache.tomee/concurrency-signature-test/10.3.0-SNAPSHOT/concurrency-signature-test-10.3.0-SNAPSHOT.jar
No mail will be sent out, as 'TomEE » tomee-10-build-full-tck » TomEE :: TCK :: JAX-RS TCK :: Tests Embedded #122' does not have a result yet. Please make sure you set a proper result in case of pipeline/build scripts.
No mail will be sent out, as 'TomEE » tomee-10-build-full-tck » TomEE :: TCK :: JAX-RS TCK :: Tests #122' does not have a result yet. Please make sure you set a proper result in case of pipeline/build scripts.
Sending e-mails to: commits@tomee.apache.org
No mail will be sent out, as 'TomEE » tomee-10-build-full-tck » TomEE :: TCK :: JAX-RS TCK :: Signature Test #122' does not have a result yet. Please make sure you set a proper result in case of pipeline/build scripts.
channel stopped
INFO: Processing JUnit
INFO: [JUnit] - 118 test report file(s) were found with the pattern '**/target/surefire-reports/TEST-*.xml' relative to '<https://ci-builds.apache.org/job/Tomee/job/tomee-10-build-full-tck/ws/'> for the testing framework 'JUnit'.
[Checks API] No suitable checks publisher found.
INFO: Setting the build status to SUCCESS
Build failed in Jenkins: TomEE » tomee-10-build-full-tck #121
Posted by Apache Jenkins Server <je...@builds.apache.org>.
See <https://ci-builds.apache.org/job/Tomee/job/tomee-10-build-full-tck/121/display/redirect?page=changes>
Changes:
[github] [tomee-10.x]: Bump org.apache.maven.plugins:maven-deploy-plugin from 3.1.4 to 3.2.0 (#3007)
[github] TOMEE-4695 - [tomee-10.x]: Bump org.glassfish:jakarta.faces from 4.0.23 to 4.0.26 (#3006)
[github] [tomee-10.x]: Bump org.codehaus.mojo:jaxb2-maven-plugin from 4.1.0 to 4.2.0 (#3005)
[github] TOMEE-4722 - [tomee-10.x]: Bump version.slf4j from 2.0.18 to 2.0.20 (#3003)
[github] TOMEE-4672 - [tomee-10.x]: Bump org.bouncycastle:bcprov-jdk18on from 1.85 to 1.86 (#3002)
[github] [tomee-10.x]: Bump com.nimbusds:nimbus-jose-jwt from 10.9.1 to 10.10 (#3001)
[github] [tomee-10.x]: Bump org.apache.maven.plugins:maven-plugin-plugin from 3.15.2 to 3.16.0 (#2997)
[github] TOMEE-4725 - [tomee-10.x]: Bump version.wss4j from 4.0.1 to 4.0.2 (#2993)
[github] [tomee-10.x]: Bump net.bytebuddy:byte-buddy from 1.18.11 to 1.18.14 (#2990)
[github] TOMEE-4723 - [tomee-10.x]: Bump version.jackson from 2.22.2 to 2.22.3 (#2989)
[github] TOMEE-4721 - ActiveMQ 6.3.2 (#3011)
------------------------------------------
[...truncated 112.17 MiB...]
01-Oct-2026 11:13:11.974 INFO [http-nio-40927-exec-3] org.apache.tomee.microprofile.metrics.VendorMetrics.afterApplicationDeployed Class name: org.apache.openejb.assembler.monitoring.JMXContainer
01-Oct-2026 11:13:11.975 INFO [http-nio-40927-exec-3] org.apache.tomee.microprofile.metrics.VendorMetrics.afterApplicationDeployed Adding vendor metrics for openejb.management:J2EEServer=openejb,J2EEApplication=<empty>,j2eeType=Resource,name=UserDatabase
01-Oct-2026 11:13:11.975 INFO [http-nio-40927-exec-3] org.apache.tomee.microprofile.metrics.VendorMetrics.afterApplicationDeployed Class name: UserDatabase
01-Oct-2026 11:13:11.976 INFO [http-nio-40927-exec-3] org.apache.tomee.microprofile.metrics.VendorMetrics.afterApplicationDeployed Adding vendor metrics for openejb.management:J2EEServer=openejb,J2EEApplication=<empty>,EJBModule=openejb,SingletonSessionBean=openejb/Deployer,name=openejb/Deployer,j2eeType=Invocations
01-Oct-2026 11:13:11.976 INFO [http-nio-40927-exec-3] org.apache.tomee.microprofile.metrics.VendorMetrics.afterApplicationDeployed Class name: org.apache.openejb.monitoring.ManagedMBean
01-Oct-2026 11:13:11.977 INFO [http-nio-40927-exec-3] org.apache.tomee.microprofile.metrics.VendorMetrics.afterApplicationDeployed Adding vendor metrics for openejb.management:ObjectType=containers,DataSource=Default Singleton Container
01-Oct-2026 11:13:11.977 INFO [http-nio-40927-exec-3] org.apache.tomee.microprofile.metrics.VendorMetrics.afterApplicationDeployed Class name: org.apache.openejb.assembler.monitoring.JMXContainer
01-Oct-2026 11:13:11.978 INFO [http-nio-40927-exec-3] org.apache.openejb.assembler.classic.Assembler.createApplication Deployed Application(path=<https://ci-builds.apache.org/job/Tomee/job/tomee-10-build-full-tck/ws/tck/microprofile-tck/opentelemetry/target/workdir/0/7506a439-9d80-400c-9300-7c3cdfd55600)>
01-Oct-2026 11:13:12.275 INFO [http-nio-40927-exec-3] org.apache.openejb.util.OptionsLog.info Using 'tomee.mp.scan=all'
01-Oct-2026 11:13:12.281 INFO [http-nio-40927-exec-3] org.apache.openejb.util.OptionsLog.info Using 'tomee.mp.scan=all'
01-Oct-2026 11:13:12.285 INFO [http-nio-40927-exec-3] org.apache.tomee.microprofile.openapi.MicroProfileOpenApiRegistration.onStartup Registering OpenAPI servlet on /openapi for application /7506a439-9d80-400c-9300-7c3cdfd55600
01-Oct-2026 11:13:12.338 INFO [http-nio-40927-exec-3] org.apache.jasper.servlet.TldScanner.scanJars At least one JAR was scanned for TLDs yet contained no TLDs. Enable debug logging for this logger for a complete list of JARs that were scanned but no TLDs were found in them. Skipping unneeded JARs during scanning can improve startup time and JSP compilation time.
01-Oct-2026 11:13:12.367 INFO [http-nio-40927-exec-3] org.apache.openejb.util.OptionsLog.info Using 'tomee.mp.scan=all'
01-Oct-2026 11:13:13.407 INFO [http-nio-40927-exec-3] org.apache.openejb.util.OptionsLog.info Using 'openejb.cxf-rs.cache-application=false'
01-Oct-2026 11:13:13.450 INFO [http-nio-40927-exec-3] org.apache.openejb.server.cxf.rs.CxfRsHttpListener.logApplication Application{path='http://localhost:40927/7506a439-9d80-400c-9300-7c3cdfd55600/', class=org.eclipse.microprofile.telemetry.tracing.tck.TestApplication$RestApplication, resources=2, providers=6, invalids=0}
01-Oct-2026 11:13:13.451 INFO [http-nio-40927-exec-3] org.apache.openejb.server.cxf.rs.CxfRsHttpListener.logApplication Resource{clazz=org.eclipse.microprofile.telemetry.tracing.tck.TestApplication$TestEndpoint, discovered=true, singleton=false}
01-Oct-2026 11:13:13.451 INFO [http-nio-40927-exec-3] org.apache.openejb.server.cxf.rs.CxfRsHttpListener.logApplication Resource{clazz=org.apache.tomee.microprofile.health.MicroProfileHealthChecksEndpoint, discovered=true, singleton=false}
01-Oct-2026 11:13:13.452 INFO [http-nio-40927-exec-3] org.apache.openejb.server.cxf.rs.CxfRsHttpListener.logApplication Provider{clazz=org.apache.tomee.microprofile.opentelemetry.MPOpenTelemetryFilterRegistration, discovered=true, singleton=false}
01-Oct-2026 11:13:13.452 INFO [http-nio-40927-exec-3] org.apache.openejb.server.cxf.rs.CxfRsHttpListener.logApplication Provider{clazz=org.apache.tomee.microprofile.jwt.jaxrs.MPJWTSecurityAnnotationsInterceptorsFeature, discovered=true, singleton=false}
01-Oct-2026 11:13:13.452 INFO [http-nio-40927-exec-3] org.apache.openejb.server.cxf.rs.CxfRsHttpListener.logApplication Provider{clazz=org.apache.tomee.microprofile.metrics.MetricsFilterRegistration, discovered=true, singleton=false}
01-Oct-2026 11:13:13.452 INFO [http-nio-40927-exec-3] org.apache.openejb.server.cxf.rs.CxfRsHttpListener.logApplication Provider{clazz=org.apache.tomee.microprofile.jwt.MPJWTFilter$MPJWTExceptionMapper, discovered=true, singleton=false}
01-Oct-2026 11:13:13.452 INFO [http-nio-40927-exec-3] org.apache.openejb.server.cxf.rs.CxfRsHttpListener.logApplication Provider{clazz=org.apache.tomee.microprofile.jwt.bval.ValidationInterceptorsFeature, discovered=true, singleton=false}
01-Oct-2026 11:13:13.453 INFO [http-nio-40927-exec-3] org.apache.openejb.server.cxf.rs.CxfRsHttpListener.logApplication Provider{clazz=io.smallrye.opentelemetry.implementation.rest.OpenTelemetryClientFilter, discovered=true, singleton=false}
01-Oct-2026 11:13:13.719 INFO [http-nio-40927-exec-3] org.apache.openejb.util.OptionsLog.info Using 'tomee.mp.scan=all'
01-Oct-2026 11:13:13.927 INFO [http-nio-40927-exec-3] org.apache.openejb.util.OptionsLog.info Using 'tomee.mp.scan=all'
01-Oct-2026 11:13:13.968 INFO [http-nio-40927-exec-3] org.apache.openejb.util.OptionsLog.info Using 'tomee.mp.scan=all'
01-Oct-2026 11:13:13.974 INFO [http-nio-40927-exec-3] org.apache.openejb.util.OptionsLog.info Using 'tomee.mp.scan=all'
01-Oct-2026 11:13:13.990 INFO [http-nio-40927-exec-3] org.apache.openejb.util.OptionsLog.info Using 'tomee.mp.scan=all'
01-Oct-2026 11:13:13.994 INFO [http-nio-40927-exec-3] org.apache.openejb.util.OptionsLog.info Using 'tomee.mp.scan=all'
01-Oct-2026 11:13:14.009 INFO [http-nio-40927-exec-3] org.apache.openejb.util.OptionsLog.info Using 'tomee.mp.scan=all'
01-Oct-2026 11:13:14.014 INFO [http-nio-40927-exec-3] org.apache.openejb.util.OptionsLog.info Using 'tomee.mp.scan=all'
01-Oct-2026 11:13:14.028 INFO [http-nio-40927-exec-3] org.apache.openejb.util.OptionsLog.info Using 'tomee.mp.scan=all'
01-Oct-2026 11:13:14.032 INFO [http-nio-40927-exec-3] org.apache.openejb.util.OptionsLog.info Using 'tomee.mp.scan=all'
01-Oct-2026 11:13:14.047 INFO [http-nio-40927-exec-3] org.apache.openejb.server.cxf.rs.CxfRsHttpListener.deployApplication Using readers:
01-Oct-2026 11:13:14.048 INFO [http-nio-40927-exec-3] org.apache.openejb.server.cxf.rs.CxfRsHttpListener.deployApplication org.apache.cxf.jaxrs.provider.EntityPartProvider@27a8368a
01-Oct-2026 11:13:14.048 INFO [http-nio-40927-exec-3] org.apache.openejb.server.cxf.rs.CxfRsHttpListener.deployApplication org.apache.cxf.jaxrs.provider.PrimitiveTextProvider@6e92b729
01-Oct-2026 11:13:14.048 INFO [http-nio-40927-exec-3] org.apache.openejb.server.cxf.rs.CxfRsHttpListener.deployApplication org.apache.cxf.jaxrs.provider.FormEncodingProvider@196323f3
01-Oct-2026 11:13:14.048 INFO [http-nio-40927-exec-3] org.apache.openejb.server.cxf.rs.CxfRsHttpListener.deployApplication org.apache.cxf.jaxrs.provider.MultipartProvider@37e50361
01-Oct-2026 11:13:14.048 INFO [http-nio-40927-exec-3] org.apache.openejb.server.cxf.rs.CxfRsHttpListener.deployApplication org.apache.cxf.jaxrs.provider.SourceProvider@5ebfc875
01-Oct-2026 11:13:14.048 INFO [http-nio-40927-exec-3] org.apache.openejb.server.cxf.rs.CxfRsHttpListener.deployApplication org.apache.cxf.jaxrs.provider.JAXBElementTypedProvider@3845a94e
01-Oct-2026 11:13:14.048 INFO [http-nio-40927-exec-3] org.apache.openejb.server.cxf.rs.CxfRsHttpListener.deployApplication org.apache.cxf.jaxrs.provider.JAXBElementProvider@3839690e
01-Oct-2026 11:13:14.048 INFO [http-nio-40927-exec-3] org.apache.openejb.server.cxf.rs.CxfRsHttpListener.deployApplication org.apache.openejb.server.cxf.rs.johnzon.TomEEJsonbProvider@32ca392e
01-Oct-2026 11:13:14.049 INFO [http-nio-40927-exec-3] org.apache.openejb.server.cxf.rs.CxfRsHttpListener.deployApplication org.apache.openejb.server.cxf.rs.johnzon.TomEEJsonpProvider@20212f64
01-Oct-2026 11:13:14.049 INFO [http-nio-40927-exec-3] org.apache.openejb.server.cxf.rs.CxfRsHttpListener.deployApplication org.apache.cxf.jaxrs.provider.StringTextProvider@3d577d
01-Oct-2026 11:13:14.049 INFO [http-nio-40927-exec-3] org.apache.openejb.server.cxf.rs.CxfRsHttpListener.deployApplication org.apache.cxf.jaxrs.provider.BinaryDataProvider@27d5aeba
01-Oct-2026 11:13:14.049 INFO [http-nio-40927-exec-3] org.apache.openejb.server.cxf.rs.CxfRsHttpListener.deployApplication org.apache.cxf.jaxrs.provider.DataSourceProvider@5c056e96
01-Oct-2026 11:13:14.049 INFO [http-nio-40927-exec-3] org.apache.openejb.server.cxf.rs.CxfRsHttpListener.deployApplication Using writers:
01-Oct-2026 11:13:14.049 INFO [http-nio-40927-exec-3] org.apache.openejb.server.cxf.rs.CxfRsHttpListener.deployApplication org.apache.cxf.jaxrs.provider.EntityPartProvider@27a8368a
01-Oct-2026 11:13:14.049 INFO [http-nio-40927-exec-3] org.apache.openejb.server.cxf.rs.CxfRsHttpListener.deployApplication org.apache.cxf.jaxrs.provider.JAXBElementTypedProvider@3845a94e
01-Oct-2026 11:13:14.050 INFO [http-nio-40927-exec-3] org.apache.openejb.server.cxf.rs.CxfRsHttpListener.deployApplication org.apache.johnzon.jaxrs.WadlDocumentMessageBodyWriter@75f6307d
01-Oct-2026 11:13:14.050 INFO [http-nio-40927-exec-3] org.apache.openejb.server.cxf.rs.CxfRsHttpListener.deployApplication org.apache.cxf.jaxrs.provider.StringTextProvider@3d577d
01-Oct-2026 11:13:14.050 INFO [http-nio-40927-exec-3] org.apache.openejb.server.cxf.rs.CxfRsHttpListener.deployApplication org.apache.cxf.jaxrs.nio.NioMessageBodyWriter@1f9a1701
01-Oct-2026 11:13:14.050 INFO [http-nio-40927-exec-3] org.apache.openejb.server.cxf.rs.CxfRsHttpListener.deployApplication org.apache.cxf.jaxrs.provider.PrimitiveTextProvider@6e92b729
01-Oct-2026 11:13:14.050 INFO [http-nio-40927-exec-3] org.apache.openejb.server.cxf.rs.CxfRsHttpListener.deployApplication org.apache.cxf.jaxrs.provider.FormEncodingProvider@196323f3
01-Oct-2026 11:13:14.050 INFO [http-nio-40927-exec-3] org.apache.openejb.server.cxf.rs.CxfRsHttpListener.deployApplication org.apache.cxf.jaxrs.provider.MultipartProvider@37e50361
01-Oct-2026 11:13:14.050 INFO [http-nio-40927-exec-3] org.apache.openejb.server.cxf.rs.CxfRsHttpListener.deployApplication org.apache.cxf.jaxrs.provider.SourceProvider@5ebfc875
01-Oct-2026 11:13:14.050 INFO [http-nio-40927-exec-3] org.apache.openejb.server.cxf.rs.CxfRsHttpListener.deployApplication org.apache.cxf.jaxrs.provider.JAXBElementProvider@3839690e
01-Oct-2026 11:13:14.051 INFO [http-nio-40927-exec-3] org.apache.openejb.server.cxf.rs.CxfRsHttpListener.deployApplication org.apache.openejb.server.cxf.rs.johnzon.TomEEJsonbProvider@32ca392e
01-Oct-2026 11:13:14.051 INFO [http-nio-40927-exec-3] org.apache.openejb.server.cxf.rs.CxfRsHttpListener.deployApplication org.apache.openejb.server.cxf.rs.johnzon.TomEEJsonpProvider@20212f64
01-Oct-2026 11:13:14.051 INFO [http-nio-40927-exec-3] org.apache.openejb.server.cxf.rs.CxfRsHttpListener.deployApplication org.apache.cxf.jaxrs.provider.BinaryDataProvider@27d5aeba
01-Oct-2026 11:13:14.051 INFO [http-nio-40927-exec-3] org.apache.openejb.server.cxf.rs.CxfRsHttpListener.deployApplication org.apache.cxf.jaxrs.provider.DataSourceProvider@5c056e96
01-Oct-2026 11:13:14.051 INFO [http-nio-40927-exec-3] org.apache.openejb.server.cxf.rs.CxfRsHttpListener.deployApplication Using exception mappers:
01-Oct-2026 11:13:14.051 INFO [http-nio-40927-exec-3] org.apache.openejb.server.cxf.rs.CxfRsHttpListener.deployApplication org.apache.cxf.jaxrs.impl.WebApplicationExceptionMapper@33d2244d
01-Oct-2026 11:13:14.051 INFO [http-nio-40927-exec-3] org.apache.openejb.server.cxf.rs.CxfRsHttpListener.deployApplication org.apache.tomee.microprofile.jwt.MPJWTFilter$MPJWTExceptionMapper@442e13f0
01-Oct-2026 11:13:14.052 INFO [http-nio-40927-exec-3] org.apache.openejb.server.cxf.rs.CxfRsHttpListener.deployApplication org.apache.openejb.server.cxf.rs.EJBExceptionMapper@21b10ece
01-Oct-2026 11:13:14.052 INFO [http-nio-40927-exec-3] org.apache.openejb.server.cxf.rs.CxfRsHttpListener.deployApplication org.apache.cxf.jaxrs.validation.ValidationExceptionMapper@620dc469
01-Oct-2026 11:13:14.055 INFO [http-nio-40927-exec-3] org.apache.openejb.server.cxf.rs.CxfRsHttpListener.logEndpoints REST Application: http://localhost:40927/7506a439-9d80-400c-9300-7c3cdfd55600/ -> org.eclipse.microprofile.telemetry.tracing.tck.TestApplication$RestApplication@4159a84c
01-Oct-2026 11:13:14.061 INFO [http-nio-40927-exec-3] org.apache.openejb.server.cxf.rs.CxfRsHttpListener.logEndpoints Service URI: http://localhost:40927/7506a439-9d80-400c-9300-7c3cdfd55600/health -> Pojo org.apache.tomee.microprofile.health.MicroProfileHealthChecksEndpoint
01-Oct-2026 11:13:14.061 INFO [http-nio-40927-exec-3] org.apache.openejb.server.cxf.rs.CxfRsHttpListener.logEndpoints GET http://localhost:40927/7506a439-9d80-400c-9300-7c3cdfd55600/health -> Response getChecks()
01-Oct-2026 11:13:14.062 INFO [http-nio-40927-exec-3] org.apache.openejb.server.cxf.rs.CxfRsHttpListener.logEndpoints GET http://localhost:40927/7506a439-9d80-400c-9300-7c3cdfd55600/health/live -> Response getLiveChecks()
01-Oct-2026 11:13:14.062 INFO [http-nio-40927-exec-3] org.apache.openejb.server.cxf.rs.CxfRsHttpListener.logEndpoints GET http://localhost:40927/7506a439-9d80-400c-9300-7c3cdfd55600/health/ready -> Response getReadyChecks()
01-Oct-2026 11:13:14.062 INFO [http-nio-40927-exec-3] org.apache.openejb.server.cxf.rs.CxfRsHttpListener.logEndpoints GET http://localhost:40927/7506a439-9d80-400c-9300-7c3cdfd55600/health/started -> Response getStartedChecks()
01-Oct-2026 11:13:14.062 INFO [http-nio-40927-exec-3] org.apache.openejb.server.cxf.rs.CxfRsHttpListener.logEndpoints Service URI: http://localhost:40927/7506a439-9d80-400c-9300-7c3cdfd55600/rest -> Pojo org.eclipse.microprofile.telemetry.tracing.tck.TestApplication$TestEndpoint
01-Oct-2026 11:13:14.062 INFO [http-nio-40927-exec-3] org.apache.openejb.server.cxf.rs.CxfRsHttpListener.logEndpoints GET http://localhost:40927/7506a439-9d80-400c-9300-7c3cdfd55600/rest -> String hello()
01-Oct-2026 11:13:15.522 INFO [http-nio-40927-exec-6] org.apache.openejb.util.OptionsLog.info Using 'openejb.internal.beans.security.enabled=false'
01-Oct-2026 11:13:15.522 INFO [http-nio-40927-exec-6] org.apache.openejb.assembler.classic.Assembler.destroyApplication Undeploying app: <https://ci-builds.apache.org/job/Tomee/job/tomee-10-build-full-tck/ws/tck/microprofile-tck/opentelemetry/target/workdir/0/7506a439-9d80-400c-9300-7c3cdfd55600>
Oct 01, 2026 11:13:15 AM org.apache.openejb.client.EventLogger log
INFO: RemoteInitialContextCreated{providerUri=http://localhost:40927/tomee/ejb}
Oct 01, 2026 11:13:15 AM org.apache.openejb.arquillian.common.TomEEContainer undeploy
INFO: cleaning <https://ci-builds.apache.org/job/Tomee/job/tomee-10-build-full-tck/ws/tck/microprofile-tck/opentelemetry/target/workdir/0/7506a439-9d80-400c-9300-7c3cdfd55600.war>
Oct 01, 2026 11:13:15 AM org.apache.openejb.arquillian.common.TomEEContainer undeploy
INFO: cleaning <https://ci-builds.apache.org/job/Tomee/job/tomee-10-build-full-tck/ws/tck/microprofile-tck/opentelemetry/target/workdir/0/7506a439-9d80-400c-9300-7c3cdfd55600>
01-Oct-2026 11:13:15.717 INFO [main] jdk.internal.reflect.DelegatingMethodAccessorImpl.invoke A valid shutdown command was received via the shutdown port. Stopping the Server instance.
01-Oct-2026 11:13:15.721 INFO [main] jdk.internal.reflect.DelegatingMethodAccessorImpl.invoke Pausing ProtocolHandler ["http-nio-40927"]
01-Oct-2026 11:13:15.726 INFO [main] jdk.internal.reflect.DelegatingMethodAccessorImpl.invoke Stopping service [Catalina]
01-Oct-2026 11:13:15.728 INFO [main] jdk.internal.reflect.DelegatingMethodAccessorImpl.invoke Stopping ProtocolHandler ["http-nio-40927"]
01-Oct-2026 11:13:15.733 INFO [main] org.apache.openejb.server.SimpleServiceManager.stop Stopping server services
01-Oct-2026 11:13:15.742 INFO [main] org.apache.openejb.assembler.classic.Assembler.destroyApplication Undeploying app: openejb
01-Oct-2026 11:13:15.744 SEVERE [main] org.apache.openejb.core.singleton.SingletonInstanceManager.undeploy Unable to unregister MBean openejb.management:J2EEServer=openejb,J2EEApplication=<empty>,EJBModule=openejb,SingletonSessionBean=openejb/Deployer,name=openejb/Deployer,j2eeType=Invocations
01-Oct-2026 11:13:15.756 INFO [main] jdk.internal.reflect.DelegatingMethodAccessorImpl.invoke Destroying ProtocolHandler ["http-nio-40927"]
[INFO] Tests run: 1, Failures: 0, Errors: 0, Skipped: 0, Time elapsed: 15.16 s -- in org.eclipse.microprofile.telemetry.tracing.tck.TestApplication
[INFO]
[INFO] Results:
[INFO]
[INFO] Tests run: 21, Failures: 0, Errors: 0, Skipped: 0
[INFO]
[JENKINS] Recording test results
[INFO]
[INFO] --- jar:3.0.2:jar (default-jar) @ microprofile-opentelemetry-tck ---
[INFO] Building jar: <https://ci-builds.apache.org/job/Tomee/job/tomee-10-build-full-tck/ws/tck/microprofile-tck/opentelemetry/target/microprofile-opentelemetry-tck-10.3.0-SNAPSHOT.jar>
[INFO]
[INFO] --- install:3.2.0:install (default-install) @ microprofile-opentelemetry-tck ---
[INFO] Installing <https://ci-builds.apache.org/job/Tomee/job/tomee-10-build-full-tck/ws/tck/microprofile-tck/opentelemetry/pom.xml> to /home/jenkins/.m2/repository/org/apache/tomee/microprofile-opentelemetry-tck/10.3.0-SNAPSHOT/microprofile-opentelemetry-tck-10.3.0-SNAPSHOT.pom
[INFO] Installing <https://ci-builds.apache.org/job/Tomee/job/tomee-10-build-full-tck/ws/tck/microprofile-tck/opentelemetry/target/microprofile-opentelemetry-tck-10.3.0-SNAPSHOT.jar> to /home/jenkins/.m2/repository/org/apache/tomee/microprofile-opentelemetry-tck/10.3.0-SNAPSHOT/microprofile-opentelemetry-tck-10.3.0-SNAPSHOT.jar
[INFO]
[INFO] ----------------------< org.apache.tomee:jax-rs >-----------------------
[INFO] Building TomEE :: TCK :: JAX-RS TCK 10.3.0-SNAPSHOT [24/27]
[INFO] from jax-rs/pom.xml
[INFO] --------------------------------[ pom ]---------------------------------
[INFO]
[INFO] --- clean:3.5.0:clean (default-clean) @ jax-rs ---
[INFO] Deleting <https://ci-builds.apache.org/job/Tomee/job/tomee-10-build-full-tck/ws/tck/jax-rs/target>
[INFO]
[INFO] --- enforcer:3.6.3:enforce (enforce-maven-version) @ jax-rs ---
[INFO]
[INFO] --- enforcer:3.6.3:enforce (enforce-java-version) @ jax-rs ---
[INFO]
[INFO] --- antrun:3.2.0:run (default) @ jax-rs ---
[INFO] Executing tasks
[INFO] [get] Getting: https://download.eclipse.org/ee4j/jakartaee-tck/jakartaee10/staged/eftl/jakarta-restful-ws-tck-3.1.5.zip
[INFO] [get] To: <https://ci-builds.apache.org/job/Tomee/job/tomee-10-build-full-tck/ws/tck/jax-rs/jakarta-restful-ws-tck-3.1.5.zip>
[INFO] [get] Error opening connection java.io.FileNotFoundException: https://download.eclipse.org/ee4j/jakartaee-tck/jakartaee10/staged/eftl/jakarta-restful-ws-tck-3.1.5.zip
[INFO] [get] Error opening connection java.io.FileNotFoundException: https://download.eclipse.org/ee4j/jakartaee-tck/jakartaee10/staged/eftl/jakarta-restful-ws-tck-3.1.5.zip
[INFO] [get] Error opening connection java.io.FileNotFoundException: https://download.eclipse.org/ee4j/jakartaee-tck/jakartaee10/staged/eftl/jakarta-restful-ws-tck-3.1.5.zip
[INFO] [get] Can't get https://download.eclipse.org/ee4j/jakartaee-tck/jakartaee10/staged/eftl/jakarta-restful-ws-tck-3.1.5.zip to <https://ci-builds.apache.org/job/Tomee/job/tomee-10-build-full-tck/ws/tck/jax-rs/jakarta-restful-ws-tck-3.1.5.zip>
[INFO]
[INFO] ------------------------------------------------------------------------
[INFO] Skipping TomEE :: TCK :: JAX-RS TCK :: Tests
[INFO] This project has been banned from the build due to previous failures.
[INFO] ------------------------------------------------------------------------
[INFO]
[INFO] ------------------------------------------------------------------------
[INFO] Skipping TomEE :: TCK :: JAX-RS TCK :: Tests Embedded
[INFO] This project has been banned from the build due to previous failures.
[INFO] ------------------------------------------------------------------------
[INFO]
[INFO] ------------------------------------------------------------------------
[INFO] Skipping TomEE :: TCK :: JAX-RS TCK :: Signature Test
[INFO] This project has been banned from the build due to previous failures.
[INFO] ------------------------------------------------------------------------
[INFO] ------------------------------------------------------------------------
[INFO] Reactor Summary for TomEE :: TCK 10.3.0-SNAPSHOT:
[INFO]
[INFO] TomEE :: TCK ....................................... SUCCESS [ 9.125 s]
[INFO] TomEE :: TCK :: Common ............................. SUCCESS [ 31.961 s]
[INFO] TomEE :: TCK :: CDI Embedded ....................... SUCCESS [ 26.329 s]
[INFO] TomEE :: TCK :: CDI TomEE .......................... SUCCESS [ 25.877 s]
[INFO] TomEE :: TCK :: CDI TCK Signature Tests ............ SUCCESS [ 6.522 s]
[INFO] TomEE :: TCK :: Bean Validation Embedded ........... SUCCESS [01:59 min]
[INFO] TomEE :: TCK :: Bean Validation TomEE .............. SUCCESS [12:01 min]
[INFO] TomEE :: TCK :: Bean Validation TCK Signature tests SUCCESS [ 8.198 s]
[INFO] TomEE :: TCK :: JSON-P Standalone .................. SUCCESS [ 5.902 s]
[INFO] TomEE :: TCK :: JSON-P Signature Tests ............. SUCCESS [ 6.108 s]
[INFO] TomEE :: TCK :: JSON-B Standalone .................. SUCCESS [ 6.345 s]
[INFO] TomEE :: TCK :: JSON-B Signature Tests ............. SUCCESS [ 5.917 s]
[INFO] TomEE :: TCK :: Concurrency Standalone ............. SUCCESS [04:13 min]
[INFO] TomEE :: TCK :: Concurrency Signature Tests ........ SUCCESS [ 31.211 s]
[INFO] TomEE :: TCK :: MicroProfile ....................... SUCCESS [ 3.070 s]
[INFO] TomEE :: TCK :: MicroProfile Config TCK ............ SUCCESS [07:14 min]
[INFO] TomEE :: TCK :: MicroProfile JWT TCK ............... SUCCESS [09:33 min]
[INFO] TomEE :: TCK :: MicroProfile Health TCK ............ SUCCESS [17:23 min]
[INFO] TomEE :: TCK :: MicroProfile Metrics TCK ........... SUCCESS [36:07 min]
[INFO] TomEE :: TCK :: MicroProfile Rest Client TCK ....... SUCCESS [05:25 min]
[INFO] TomEE :: TCK :: MicroProfile Open API TCK .......... SUCCESS [17:05 min]
[INFO] TomEE :: TCK :: MicroProfile Fault Tolerance TCK ... SUCCESS [23:59 min]
[INFO] TomEE :: TCK :: MicroProfile Open Telemetry TCK .... SUCCESS [14:41 min]
[INFO] TomEE :: TCK :: JAX-RS TCK ......................... FAILURE [ 2.976 s]
[INFO] TomEE :: TCK :: JAX-RS TCK :: Tests ................ SKIPPED
[INFO] TomEE :: TCK :: JAX-RS TCK :: Tests Embedded ....... SKIPPED
[INFO] TomEE :: TCK :: JAX-RS TCK :: Signature Test ....... SKIPPED
[INFO] ------------------------------------------------------------------------
[INFO] BUILD FAILURE
[INFO] ------------------------------------------------------------------------
[INFO] Total time: 02:43 h
[INFO] Finished at: 2026-10-01T11:14:05Z
[INFO] ------------------------------------------------------------------------
[WARNING] The requested profile "all-adapters" could not be activated because it does not exist.
[WARNING] The requested profile "jsonb-tck" could not be activated because it does not exist.
[WARNING] The requested profile "jsonp-tck" could not be activated because it does not exist.
Waiting for Jenkins to finish collecting data
[ERROR] Failed to execute goal org.apache.maven.plugins:maven-antrun-plugin:3.2.0:run (default) on project jax-rs: An Ant BuildException has occurred: Can't get https://download.eclipse.org/ee4j/jakartaee-tck/jakartaee10/staged/eftl/jakarta-restful-ws-tck-3.1.5.zip to <https://ci-builds.apache.org/job/Tomee/job/tomee-10-build-full-tck/ws/tck/jax-rs/jakarta-restful-ws-tck-3.1.5.zip>
[ERROR] around Ant part ...<get skipexisting="true" src="https://download.eclipse.org/ee4j/jakartaee-tck/jakartaee10/staged/eftl/jakarta-restful-ws-tck-3.1.5.zip" dest="jakarta-restful-ws-tck-3.1.5.zip" />... @ 4:183 in <https://ci-builds.apache.org/job/Tomee/job/tomee-10-build-full-tck/ws/tck/jax-rs/target/antrun/build-main.xml>
[ERROR] -> [Help 1]
[ERROR]
[ERROR] To see the full stack trace of the errors, re-run Maven with the -e switch.
[ERROR] Re-run Maven using the -X switch to enable full debug logging.
[ERROR]
[ERROR] For more information about the errors and possible solutions, please read the following articles:
[ERROR] [Help 1] http://cwiki.apache.org/confluence/display/MAVEN/MojoExecutionException
[ERROR]
[ERROR] After correcting the problems, you can resume the build with the command
[ERROR] mvn <goals> -rf :jax-rs
[JENKINS] Archiving <https://ci-builds.apache.org/job/Tomee/job/tomee-10-build-full-tck/ws/tck/microprofile-tck/health/pom.xml> to org.apache.tomee/microprofile-health-tck/10.3.0-SNAPSHOT/microprofile-health-tck-10.3.0-SNAPSHOT.pom
[JENKINS] Archiving <https://ci-builds.apache.org/job/Tomee/job/tomee-10-build-full-tck/ws/tck/microprofile-tck/health/target/microprofile-health-tck-10.3.0-SNAPSHOT.jar> to org.apache.tomee/microprofile-health-tck/10.3.0-SNAPSHOT/microprofile-health-tck-10.3.0-SNAPSHOT.jar
[JENKINS] Archiving <https://ci-builds.apache.org/job/Tomee/job/tomee-10-build-full-tck/ws/tck/jax-rs/jax-rs-tests-embedded/pom.xml> to org.apache.tomee/jax-rs-tests-embedded/10.3.0-SNAPSHOT/jax-rs-tests-embedded-10.3.0-SNAPSHOT.pom
[JENKINS] Archiving <https://ci-builds.apache.org/job/Tomee/job/tomee-10-build-full-tck/ws/tck/microprofile-tck/jwt/pom.xml> to org.apache.tomee/microprofile-jwt-tck/10.3.0-SNAPSHOT/microprofile-jwt-tck-10.3.0-SNAPSHOT.pom
[JENKINS] Archiving <https://ci-builds.apache.org/job/Tomee/job/tomee-10-build-full-tck/ws/tck/microprofile-tck/jwt/target/microprofile-jwt-tck-10.3.0-SNAPSHOT.jar> to org.apache.tomee/microprofile-jwt-tck/10.3.0-SNAPSHOT/microprofile-jwt-tck-10.3.0-SNAPSHOT.jar
[JENKINS] Archiving <https://ci-builds.apache.org/job/Tomee/job/tomee-10-build-full-tck/ws/tck/bval-tomee/pom.xml> to org.apache.tomee/bval-tomee/10.3.0-SNAPSHOT/bval-tomee-10.3.0-SNAPSHOT.pom
[JENKINS] Archiving <https://ci-builds.apache.org/job/Tomee/job/tomee-10-build-full-tck/ws/tck/bval-tomee/target/bval-tomee-10.3.0-SNAPSHOT.jar> to org.apache.tomee/bval-tomee/10.3.0-SNAPSHOT/bval-tomee-10.3.0-SNAPSHOT.jar
[JENKINS] Archiving <https://ci-builds.apache.org/job/Tomee/job/tomee-10-build-full-tck/ws/tck/jax-rs/jax-rs-tests/pom.xml> to org.apache.tomee/jax-rs-tests/10.3.0-SNAPSHOT/jax-rs-tests-10.3.0-SNAPSHOT.pom
[JENKINS] Archiving <https://ci-builds.apache.org/job/Tomee/job/tomee-10-build-full-tck/ws/tck/jax-rs/pom.xml> to org.apache.tomee/jax-rs/10.3.0-SNAPSHOT/jax-rs-10.3.0-SNAPSHOT.pom
[JENKINS] Archiving <https://ci-builds.apache.org/job/Tomee/job/tomee-10-build-full-tck/ws/tck/pom.xml> to org.apache.tomee/tck/10.3.0-SNAPSHOT/tck-10.3.0-SNAPSHOT.pom
[JENKINS] Archiving <https://ci-builds.apache.org/job/Tomee/job/tomee-10-build-full-tck/ws/tck/bval-signature-test/pom.xml> to org.apache.tomee/bval-signature-test/10.3.0-SNAPSHOT/bval-signature-test-10.3.0-SNAPSHOT.pom
[JENKINS] Archiving <https://ci-builds.apache.org/job/Tomee/job/tomee-10-build-full-tck/ws/tck/bval-signature-test/target/bval-signature-test-10.3.0-SNAPSHOT.jar> to org.apache.tomee/bval-signature-test/10.3.0-SNAPSHOT/bval-signature-test-10.3.0-SNAPSHOT.jar
[JENKINS] Archiving <https://ci-builds.apache.org/job/Tomee/job/tomee-10-build-full-tck/ws/tck/cdi-signature-test/pom.xml> to org.apache.tomee/cdi-signature-test/10.3.0-SNAPSHOT/cdi-signature-test-10.3.0-SNAPSHOT.pom
[JENKINS] Archiving <https://ci-builds.apache.org/job/Tomee/job/tomee-10-build-full-tck/ws/tck/cdi-signature-test/target/cdi-signature-test-10.3.0-SNAPSHOT.jar> to org.apache.tomee/cdi-signature-test/10.3.0-SNAPSHOT/cdi-signature-test-10.3.0-SNAPSHOT.jar
[JENKINS] Archiving <https://ci-builds.apache.org/job/Tomee/job/tomee-10-build-full-tck/ws/tck/jsonp-standalone/pom.xml> to org.apache.tomee/jsonp-standalone/10.3.0-SNAPSHOT/jsonp-standalone-10.3.0-SNAPSHOT.pom
[JENKINS] Archiving <https://ci-builds.apache.org/job/Tomee/job/tomee-10-build-full-tck/ws/tck/jsonp-standalone/target/jsonp-standalone-10.3.0-SNAPSHOT.jar> to org.apache.tomee/jsonp-standalone/10.3.0-SNAPSHOT/jsonp-standalone-10.3.0-SNAPSHOT.jar
[JENKINS] Archiving <https://ci-builds.apache.org/job/Tomee/job/tomee-10-build-full-tck/ws/tck/microprofile-tck/metrics/pom.xml> to org.apache.tomee/microprofile-metrics-tck/10.3.0-SNAPSHOT/microprofile-metrics-tck-10.3.0-SNAPSHOT.pom
[JENKINS] Archiving <https://ci-builds.apache.org/job/Tomee/job/tomee-10-build-full-tck/ws/tck/microprofile-tck/metrics/target/microprofile-metrics-tck-10.3.0-SNAPSHOT.jar> to org.apache.tomee/microprofile-metrics-tck/10.3.0-SNAPSHOT/microprofile-metrics-tck-10.3.0-SNAPSHOT.jar
[JENKINS] Archiving <https://ci-builds.apache.org/job/Tomee/job/tomee-10-build-full-tck/ws/tck/cdi-tomee/pom.xml> to org.apache.tomee/cdi-tomee/10.3.0-SNAPSHOT/cdi-tomee-10.3.0-SNAPSHOT.pom
[JENKINS] Archiving <https://ci-builds.apache.org/job/Tomee/job/tomee-10-build-full-tck/ws/tck/cdi-tomee/target/cdi-tomee-10.3.0-SNAPSHOT.jar> to org.apache.tomee/cdi-tomee/10.3.0-SNAPSHOT/cdi-tomee-10.3.0-SNAPSHOT.jar
[JENKINS] Archiving <https://ci-builds.apache.org/job/Tomee/job/tomee-10-build-full-tck/ws/tck/tck-common/pom.xml> to org.apache.tomee/tck-common/10.3.0-SNAPSHOT/tck-common-10.3.0-SNAPSHOT.pom
[JENKINS] Archiving <https://ci-builds.apache.org/job/Tomee/job/tomee-10-build-full-tck/ws/tck/tck-common/target/tck-common-10.3.0-SNAPSHOT.jar> to org.apache.tomee/tck-common/10.3.0-SNAPSHOT/tck-common-10.3.0-SNAPSHOT.jar
[JENKINS] Archiving <https://ci-builds.apache.org/job/Tomee/job/tomee-10-build-full-tck/ws/tck/microprofile-tck/openapi/pom.xml> to org.apache.tomee/microprofile-openapi-tck/10.3.0-SNAPSHOT/microprofile-openapi-tck-10.3.0-SNAPSHOT.pom
[JENKINS] Archiving <https://ci-builds.apache.org/job/Tomee/job/tomee-10-build-full-tck/ws/tck/microprofile-tck/openapi/target/microprofile-openapi-tck-10.3.0-SNAPSHOT.jar> to org.apache.tomee/microprofile-openapi-tck/10.3.0-SNAPSHOT/microprofile-openapi-tck-10.3.0-SNAPSHOT.jar
[JENKINS] Archiving <https://ci-builds.apache.org/job/Tomee/job/tomee-10-build-full-tck/ws/tck/bval-embedded/pom.xml> to org.apache.tomee/bval-embedded/10.3.0-SNAPSHOT/bval-embedded-10.3.0-SNAPSHOT.pom
[JENKINS] Archiving <https://ci-builds.apache.org/job/Tomee/job/tomee-10-build-full-tck/ws/tck/bval-embedded/target/bval-embedded-10.3.0-SNAPSHOT.jar> to org.apache.tomee/bval-embedded/10.3.0-SNAPSHOT/bval-embedded-10.3.0-SNAPSHOT.jar
[JENKINS] Archiving <https://ci-builds.apache.org/job/Tomee/job/tomee-10-build-full-tck/ws/tck/cdi-embedded/pom.xml> to org.apache.tomee/cdi-embedded/10.3.0-SNAPSHOT/cdi-embedded-10.3.0-SNAPSHOT.pom
[JENKINS] Archiving <https://ci-builds.apache.org/job/Tomee/job/tomee-10-build-full-tck/ws/tck/cdi-embedded/target/cdi-embedded-10.3.0-SNAPSHOT.jar> to org.apache.tomee/cdi-embedded/10.3.0-SNAPSHOT/cdi-embedded-10.3.0-SNAPSHOT.jar
[JENKINS] Archiving <https://ci-builds.apache.org/job/Tomee/job/tomee-10-build-full-tck/ws/tck/jax-rs/jax-rs-signature-test/pom.xml> to org.apache.tomee/jax-rs-signature-test/10.3.0-SNAPSHOT/jax-rs-signature-test-10.3.0-SNAPSHOT.pom
[JENKINS] Archiving <https://ci-builds.apache.org/job/Tomee/job/tomee-10-build-full-tck/ws/tck/microprofile-tck/opentelemetry/pom.xml> to org.apache.tomee/microprofile-opentelemetry-tck/10.3.0-SNAPSHOT/microprofile-opentelemetry-tck-10.3.0-SNAPSHOT.pom
[JENKINS] Archiving <https://ci-builds.apache.org/job/Tomee/job/tomee-10-build-full-tck/ws/tck/microprofile-tck/opentelemetry/target/microprofile-opentelemetry-tck-10.3.0-SNAPSHOT.jar> to org.apache.tomee/microprofile-opentelemetry-tck/10.3.0-SNAPSHOT/microprofile-opentelemetry-tck-10.3.0-SNAPSHOT.jar
[JENKINS] Archiving <https://ci-builds.apache.org/job/Tomee/job/tomee-10-build-full-tck/ws/tck/jsonb-signature-test/pom.xml> to org.apache.tomee/jsonb-signature-test/10.3.0-SNAPSHOT/jsonb-signature-test-10.3.0-SNAPSHOT.pom
[JENKINS] Archiving <https://ci-builds.apache.org/job/Tomee/job/tomee-10-build-full-tck/ws/tck/jsonb-signature-test/target/jsonb-signature-test-10.3.0-SNAPSHOT.jar> to org.apache.tomee/jsonb-signature-test/10.3.0-SNAPSHOT/jsonb-signature-test-10.3.0-SNAPSHOT.jar
[JENKINS] Archiving <https://ci-builds.apache.org/job/Tomee/job/tomee-10-build-full-tck/ws/tck/jsonb-standalone/pom.xml> to org.apache.tomee/jsonb-standalone/10.3.0-SNAPSHOT/jsonb-standalone-10.3.0-SNAPSHOT.pom
[JENKINS] Archiving <https://ci-builds.apache.org/job/Tomee/job/tomee-10-build-full-tck/ws/tck/jsonb-standalone/target/jsonb-standalone-10.3.0-SNAPSHOT.jar> to org.apache.tomee/jsonb-standalone/10.3.0-SNAPSHOT/jsonb-standalone-10.3.0-SNAPSHOT.jar
[JENKINS] Archiving <https://ci-builds.apache.org/job/Tomee/job/tomee-10-build-full-tck/ws/tck/jsonp-signature-test/pom.xml> to org.apache.tomee/jsonp-signature-test/10.3.0-SNAPSHOT/jsonp-signature-test-10.3.0-SNAPSHOT.pom
[JENKINS] Archiving <https://ci-builds.apache.org/job/Tomee/job/tomee-10-build-full-tck/ws/tck/jsonp-signature-test/target/jsonp-signature-test-10.3.0-SNAPSHOT.jar> to org.apache.tomee/jsonp-signature-test/10.3.0-SNAPSHOT/jsonp-signature-test-10.3.0-SNAPSHOT.jar
[JENKINS] Archiving <https://ci-builds.apache.org/job/Tomee/job/tomee-10-build-full-tck/ws/tck/microprofile-tck/pom.xml> to org.apache.tomee/microprofile-tck/10.3.0-SNAPSHOT/microprofile-tck-10.3.0-SNAPSHOT.pom
[JENKINS] Archiving <https://ci-builds.apache.org/job/Tomee/job/tomee-10-build-full-tck/ws/tck/microprofile-tck/rest-client/pom.xml> to org.apache.tomee/microprofile-rest-client-tck/10.3.0-SNAPSHOT/microprofile-rest-client-tck-10.3.0-SNAPSHOT.pom
[JENKINS] Archiving <https://ci-builds.apache.org/job/Tomee/job/tomee-10-build-full-tck/ws/tck/microprofile-tck/rest-client/target/microprofile-rest-client-tck-10.3.0-SNAPSHOT.jar> to org.apache.tomee/microprofile-rest-client-tck/10.3.0-SNAPSHOT/microprofile-rest-client-tck-10.3.0-SNAPSHOT.jar
[JENKINS] Archiving <https://ci-builds.apache.org/job/Tomee/job/tomee-10-build-full-tck/ws/tck/microprofile-tck/fault-tolerance/pom.xml> to org.apache.tomee/microprofile-fault-tolerance-tck/10.3.0-SNAPSHOT/microprofile-fault-tolerance-tck-10.3.0-SNAPSHOT.pom
[JENKINS] Archiving <https://ci-builds.apache.org/job/Tomee/job/tomee-10-build-full-tck/ws/tck/microprofile-tck/fault-tolerance/target/microprofile-fault-tolerance-tck-10.3.0-SNAPSHOT.jar> to org.apache.tomee/microprofile-fault-tolerance-tck/10.3.0-SNAPSHOT/microprofile-fault-tolerance-tck-10.3.0-SNAPSHOT.jar
[JENKINS] Archiving <https://ci-builds.apache.org/job/Tomee/job/tomee-10-build-full-tck/ws/tck/microprofile-tck/config/pom.xml> to org.apache.tomee/microprofile-config-tck/10.3.0-SNAPSHOT/microprofile-config-tck-10.3.0-SNAPSHOT.pom
[JENKINS] Archiving <https://ci-builds.apache.org/job/Tomee/job/tomee-10-build-full-tck/ws/tck/microprofile-tck/config/target/microprofile-config-tck-10.3.0-SNAPSHOT.jar> to org.apache.tomee/microprofile-config-tck/10.3.0-SNAPSHOT/microprofile-config-tck-10.3.0-SNAPSHOT.jar
[JENKINS] Archiving <https://ci-builds.apache.org/job/Tomee/job/tomee-10-build-full-tck/ws/tck/concurrency-standalone/pom.xml> to org.apache.tomee/concurrency-standalone/10.3.0-SNAPSHOT/concurrency-standalone-10.3.0-SNAPSHOT.pom
[JENKINS] Archiving <https://ci-builds.apache.org/job/Tomee/job/tomee-10-build-full-tck/ws/tck/concurrency-standalone/target/concurrency-standalone-10.3.0-SNAPSHOT.jar> to org.apache.tomee/concurrency-standalone/10.3.0-SNAPSHOT/concurrency-standalone-10.3.0-SNAPSHOT.jar
[JENKINS] Archiving <https://ci-builds.apache.org/job/Tomee/job/tomee-10-build-full-tck/ws/tck/concurrency-signature-test/pom.xml> to org.apache.tomee/concurrency-signature-test/10.3.0-SNAPSHOT/concurrency-signature-test-10.3.0-SNAPSHOT.pom
[JENKINS] Archiving <https://ci-builds.apache.org/job/Tomee/job/tomee-10-build-full-tck/ws/tck/concurrency-signature-test/target/concurrency-signature-test-10.3.0-SNAPSHOT.jar> to org.apache.tomee/concurrency-signature-test/10.3.0-SNAPSHOT/concurrency-signature-test-10.3.0-SNAPSHOT.jar
No mail will be sent out, as 'TomEE » tomee-10-build-full-tck » TomEE :: TCK :: JAX-RS TCK :: Tests Embedded #121' does not have a result yet. Please make sure you set a proper result in case of pipeline/build scripts.
No mail will be sent out, as 'TomEE » tomee-10-build-full-tck » TomEE :: TCK :: JAX-RS TCK :: Tests #121' does not have a result yet. Please make sure you set a proper result in case of pipeline/build scripts.
Sending e-mails to: commits@tomee.apache.org
No mail will be sent out, as 'TomEE » tomee-10-build-full-tck » TomEE :: TCK :: JAX-RS TCK :: Signature Test #121' does not have a result yet. Please make sure you set a proper result in case of pipeline/build scripts.
channel stopped
INFO: Processing JUnit
INFO: [JUnit] - 118 test report file(s) were found with the pattern '**/target/surefire-reports/TEST-*.xml' relative to '<https://ci-builds.apache.org/job/Tomee/job/tomee-10-build-full-tck/ws/'> for the testing framework 'JUnit'.
[Checks API] No suitable checks publisher found.
INFO: Setting the build status to SUCCESS
Build failed in Jenkins: TomEE » tomee-10-build-full-tck #120
Posted by Apache Jenkins Server <je...@builds.apache.org>.
See <https://ci-builds.apache.org/job/Tomee/job/tomee-10-build-full-tck/120/display/redirect>
Changes:
------------------------------------------
[...truncated 803.36 KiB...]
[INFO] TomEE :: Connector Examples :: Connector in EAR :: Connector Impl 10.2.1-SNAPSHOT SUCCESS [ 0.315 s]
[INFO] TomEE :: Connector Examples :: Connector in EAR :: RAR Packaging 10.2.1-SNAPSHOT SUCCESS [ 0.352 s]
[INFO] TomEE :: Connector Examples :: Connector in EAR :: Sample WAR 10.2.1-SNAPSHOT SUCCESS [ 0.226 s]
[INFO] TomEE :: Connector Examples :: Connector in EAR :: EAR Packaging 10.2.1-SNAPSHOT SUCCESS [ 0.353 s]
[INFO] TomEE :: Connector Examples :: Connector in EAR :: Functional Tests 10.2.1-SNAPSHOT SUCCESS [ 0.662 s]
[INFO] TomEE :: Connector Examples :: Connector in WAR 10.2.1-SNAPSHOT SUCCESS [ 0.660 s]
[INFO] TomEE :: Examples :: Cucumber JVM 10.2.1-SNAPSHOT .. SUCCESS [ 0.350 s]
[INFO] TomEE :: Examples :: Expanded support for Env Entries 10.2.1-SNAPSHOT SUCCESS [ 0.272 s]
[INFO] TomEE :: Examples :: Datasource Ciphered Password 10.2.1-SNAPSHOT SUCCESS [ 0.243 s]
[INFO] TomEE :: Examples :: Datasource Definition 10.2.1-SNAPSHOT SUCCESS [ 0.251 s]
[INFO] TomEE :: Examples :: Datasource Versioning 10.2.1-SNAPSHOT SUCCESS [ 0.650 s]
[INFO] TomEE :: Examples :: Decorators 10.2.1-SNAPSHOT .... SUCCESS [ 0.364 s]
[INFO] TomEE :: Examples :: Dynamic DAO Implementation 10.2.1-SNAPSHOT SUCCESS [ 0.230 s]
[INFO] TomEE :: Examples :: Dynamic Datasource Routing 10.2.1-SNAPSHOT SUCCESS [ 0.320 s]
[INFO] TomEE :: Examples :: Dynamic Implementation 10.2.1-SNAPSHOT SUCCESS [ 0.208 s]
[INFO] TomEE :: Examples :: Dynamic MBean Proxy 10.2.1-SNAPSHOT SUCCESS [ 0.292 s]
[INFO] TomEE :: Examples :: Ear Testing 10.2.1-SNAPSHOT ... SUCCESS [ 0.004 s]
[INFO] TomEE :: Examples :: Ear Testing :: Business Model 10.2.1-SNAPSHOT SUCCESS [ 0.072 s]
[INFO] TomEE :: Examples :: Ear Testing :: Business Logic 10.2.1-SNAPSHOT SUCCESS [ 0.200 s]
[INFO] TomEE :: Web Examples :: EJB Examples War 10.2.1-SNAPSHOT SUCCESS [ 0.209 s]
[INFO] TomEE :: Web Examples :: EJB Remote Call 10.2.1-SNAPSHOT SUCCESS [ 0.717 s]
[INFO] TomEE :: Web Examples :: EJB Remote Call 10.2.1-SNAPSHOT SUCCESS [ 0.233 s]
[INFO] TomEE :: Web Examples :: EJB WebService 10.2.1-SNAPSHOT SUCCESS [ 0.075 s]
[INFO] TomEE :: Arquillian Adaptors Parent :: OpenEJB Container 10.3.0-SNAPSHOT SUCCESS [ 1.599 s]
[INFO] TomEE :: Examples :: Groovy CDI 10.2.1-SNAPSHOT .... SUCCESS [ 0.978 s]
[INFO] TomEE :: Examples :: Groovy JPA 10.2.1-SNAPSHOT .... SUCCESS [ 0.800 s]
[INFO] TomEE :: Examples :: Hello World - Weblogic 10.2.1-SNAPSHOT SUCCESS [ 0.175 s]
[INFO] TomEE :: Examples :: @Resource jakarta.jms.ConnectionFactory 10.2.1-SNAPSHOT SUCCESS [ 0.444 s]
[INFO] TomEE :: Examples :: @Resource DataSource Injection 10.2.1-SNAPSHOT SUCCESS [ 0.184 s]
[INFO] TomEE :: Examples :: @EJB Injection 10.2.1-SNAPSHOT SUCCESS [ 0.186 s]
[INFO] TomEE :: Examples :: @PersistenceContext EntityManager Injection 10.2.1-SNAPSHOT SUCCESS [ 0.159 s]
[INFO] TomEE :: Examples :: @Resource env-entry Injection 10.2.1-SNAPSHOT SUCCESS [ 0.233 s]
[INFO] TomEE :: Examples :: Interceptors 10.2.1-SNAPSHOT .. SUCCESS [ 0.226 s]
[INFO] TomEE :: Examples :: JakartaMail API 10.2.1-SNAPSHOT SUCCESS [ 0.503 s]
[INFO] TomEE :: Examples :: Jakarta Mail API with Velocity 10.2.1-SNAPSHOT SUCCESS [ 1.058 s]
[INFO] TomEE :: Web Examples :: Java Modules (Simple REST resource) 10.2.1-SNAPSHOT SUCCESS [ 0.950 s]
[INFO] TomEE :: Examples :: JAXRS Filter 10.2.1-SNAPSHOT .. SUCCESS [ 0.436 s]
[INFO] TomEE :: Examples :: JAXRS JSON Provider with Jettison 10.2.1-SNAPSHOT FAILURE [ 0.048 s]
[INFO] TomEE :: Examples :: JPA with EclipseLink 10.2.1-SNAPSHOT SKIPPED
[INFO] TomEE :: Utils :: Core Hibernate 10.3.0-SNAPSHOT ... SKIPPED
[INFO] TomEE :: Examples :: JPA with Hibernate 10.2.1-SNAPSHOT SKIPPED
[INFO] TomEE :: Examples :: JPA with Hibernate and arquillian 10.2.1-SNAPSHOT SKIPPED
[INFO] TomEE :: Examples :: JPA @Enumerated 10.2.1-SNAPSHOT SKIPPED
[INFO] TomEE :: Web Examples :: JSF - CDI and EJB 10.2.1-SNAPSHOT SKIPPED
[INFO] TomEE :: Examples :: JUnit 5 :: Application Composer 10.2.1-SNAPSHOT SKIPPED
[INFO] TomEE :: Examples :: JUnit 5 :: Multiple TomEE with Arquillian 10.2.1-SNAPSHOT SKIPPED
[INFO] TomEE :: Examples :: JUnit 5 :: Simple Websockets with Arquillian 10.2.1-SNAPSHOT SKIPPED
[INFO] TomEE :: Examples :: @EJB Lookup 10.2.1-SNAPSHOT ... SKIPPED
[INFO] TomEE :: Examples :: EJB Lookup with descriptor 10.2.1-SNAPSHOT SKIPPED
[INFO] TomEE :: Examples :: Movies Complete (Meta) 10.2.1-SNAPSHOT SKIPPED
[INFO] TomEE :: Examples :: Movies Complete 10.2.1-SNAPSHOT SKIPPED
[INFO] TomEE :: Examples :: MicroProfile Config 10.2.1-SNAPSHOT SKIPPED
[INFO] TomEE :: Examples :: MicroProfile Config Source Database 10.2.1-SNAPSHOT SKIPPED
[INFO] TomEE :: Examples :: Microprofile Fault Tolerance :: Fallback 10.2.1-SNAPSHOT SKIPPED
[INFO] TomEE :: Examples :: Microprofile Fault Tolerance :: Retry 10.2.1-SNAPSHOT SKIPPED
[INFO] TomEE :: Examples :: Microprofile Fault Tolerance :: Timeout 10.2.1-SNAPSHOT SKIPPED
[INFO] TomEE :: Examples :: MicroProfile JWT Bean Validation 10.2.1-SNAPSHOT SKIPPED
[INFO] TomEE :: Examples :: MicroProfile JWT Bean Validation, Strongly-typed Annotations 10.2.1-SNAPSHOT SKIPPED
[INFO] TomEE :: Examples :: Microprofile Metrics Counted 10.2.1-SNAPSHOT SKIPPED
[INFO] TomEE :: Examples :: Microprofile Metrics Histogram 10.2.1-SNAPSHOT SKIPPED
[INFO] TomEE :: Examples :: Microprofile Metrics Timed 10.2.1-SNAPSHOT SKIPPED
[INFO] TomEE :: Examples :: MicroProfile Metrics Gauge 10.2.1-SNAPSHOT SKIPPED
[INFO] TomEE :: Examples :: MicroProfile Metrics Metered 10.2.1-SNAPSHOT SKIPPED
[INFO] TomEE :: Examples :: MP REST JWT JWK 10.2.1-SNAPSHOT SKIPPED
[INFO] TomEE :: Examples :: MP REST JWT PRINCIPAL 10.2.1-SNAPSHOT SKIPPED
[INFO] TomEE :: Examples :: MP REST JWT Public Key 10.2.1-SNAPSHOT SKIPPED
[INFO] TomEE :: Examples :: Microprofile REST Client 10.2.1-SNAPSHOT SKIPPED
[INFO] TomEE :: Examples :: Custom HealthCheck 10.2.1-SNAPSHOT SKIPPED
[INFO] TomEE :: Examples :: Microprofile OpenAPI Reader 10.2.1-SNAPSHOT SKIPPED
[INFO] TomEE :: Examples :: MTOM 10.2.1-SNAPSHOT .......... SKIPPED
[INFO] TomEE :: Examples :: Multiple JPA providers 10.2.1-SNAPSHOT SKIPPED
[INFO] TomEE :: Examples :: Multiple Arquillian Adapters 10.2.1-SNAPSHOT SKIPPED
[INFO] TomEE :: Examples :: Multiple TomEE with Arquillian 10.2.1-SNAPSHOT SKIPPED
[INFO] TomEE :: Examples :: Persistence Fragment 10.2.1-SNAPSHOT SKIPPED
[INFO] TomEE :: Web Examples :: Pojo WS 10.2.1-SNAPSHOT ... SKIPPED
[INFO] TomEE :: Examples :: Quartz 10.2.1-SNAPSHOT ........ SKIPPED
[INFO] TomEE :: Examples :: Quartz :: Quartz Resource Adapter 10.2.1-SNAPSHOT SKIPPED
[INFO] TomEE :: Examples :: Quartz :: Quartz Beans 10.2.1-SNAPSHOT SKIPPED
[INFO] TomEE :: Examples :: DataSource Realm 10.2.1-SNAPSHOT SKIPPED
[INFO] TomEE :: Examples :: Reloadable Persistence Unit Properties 10.2.1-SNAPSHOT SKIPPED
[INFO] TomEE :: Web Examples :: Resource Declared In A Webapp 10.2.1-SNAPSHOT SKIPPED
[INFO] TomEE :: Examples :: REST, Mockito and Application Composer 10.2.1-SNAPSHOT SKIPPED
[INFO] TomEE :: Examples :: REST and Application Composer 10.2.1-SNAPSHOT SKIPPED
[INFO] TomEE :: Examples :: REST CDI 10.2.1-SNAPSHOT ...... SKIPPED
[INFO] TomEE :: Examples :: JAXRS and JAAS 10.2.1-SNAPSHOT SKIPPED
[INFO] TomEE :: Examples :: REST and EJB 10.2.1-SNAPSHOT .. SKIPPED
[INFO] TomEE :: Web Examples :: REST Example 10.2.1-SNAPSHOT SKIPPED
[INFO] TomEE :: Web Examples :: REST Example With Application 10.2.1-SNAPSHOT SKIPPED
[INFO] TomEE :: Examples :: REST XML JSON 10.2.1-SNAPSHOT . SKIPPED
[INFO] TomEE :: Examples :: Basic Scala 10.2.1-SNAPSHOT ... SKIPPED
[INFO] TomEE :: Examples :: ScheduleExpression 10.2.1-SNAPSHOT SKIPPED
[INFO] TomEE :: Examples :: @Schedule Events 10.2.1-SNAPSHOT SKIPPED
[INFO] TomEE :: Examples :: @Schedule Methods (Meta) 10.2.1-SNAPSHOT SKIPPED
[INFO] TomEE :: Examples :: @Schedule Methods 10.2.1-SNAPSHOT SKIPPED
[INFO] TomEE :: Examples :: Server Events 10.2.1-SNAPSHOT . SKIPPED
[INFO] TomEE :: Examples :: Serverless Builder 10.2.1-SNAPSHOT SKIPPED
[INFO] TomEE :: Examples :: Serverless Apache TomEE WebProfile 10.2.1-SNAPSHOT SKIPPED
[INFO] TomEE :: Examples :: Serverless Apache TomEE MicroProfile 10.2.1-SNAPSHOT SKIPPED
[INFO] TomEE :: Examples :: Serverless Apache TomEE Plume 10.2.1-SNAPSHOT SKIPPED
[INFO] TomEE :: Examples :: Serverless Apache TomEE Plus 10.2.1-SNAPSHOT SKIPPED
[INFO] TomEE :: Examples :: Singleton startup ordering 10.2.1-SNAPSHOT SKIPPED
[INFO] TomEE :: Examples :: Simple CDI Interceptor 10.2.1-SNAPSHOT SKIPPED
[INFO] TomEE :: Examples :: Simple EAR 10.3.0-SNAPSHOT .... SKIPPED
[INFO] TomEE :: Examples :: Simple EAR :: Business Model 10.3.0-SNAPSHOT SKIPPED
[INFO] TomEE :: Examples :: Simple EAR :: Business Logic 10.3.0-SNAPSHOT SKIPPED
[INFO] TomEE :: Examples :: Simple EAR :: Webapp 10.3.0-SNAPSHOT SKIPPED
[INFO] TomEE :: Examples :: Simple EAR :: EAR Packaging 10.3.0-SNAPSHOT SKIPPED
[INFO] TomEE :: Examples :: Simple EAR :: Functional Tests 10.3.0-SNAPSHOT SKIPPED
[INFO] TomEE :: Examples :: Simple CMP2 Entity 10.2.1-SNAPSHOT SKIPPED
[INFO] TomEE :: Examples :: Simple JMS 10.2.1-SNAPSHOT .... SKIPPED
[INFO] TomEE :: Examples :: Simple JMS Context 10.2.1-SNAPSHOT SKIPPED
[INFO] TomEE :: Examples :: Simple MDB With a CDI Injection 10.2.1-SNAPSHOT SKIPPED
[INFO] TomEE :: Examples :: Simple MDB Example 10.2.1-SNAPSHOT SKIPPED
[INFO] TomEE :: Examples :: Simple MDB Using Deployment Descriptor Example 10.2.1-SNAPSHOT SKIPPED
[INFO] TomEE :: Examples :: Simple Remote tomcat-users.xml 10.2.1-SNAPSHOT SKIPPED
[INFO] TomEE :: Examples :: Simple REST 10.2.1-SNAPSHOT ... SKIPPED
[INFO] TomEE :: Examples :: Simple Singleton 10.2.1-SNAPSHOT SKIPPED
[INFO] TomEE :: Examples :: Simple Stateful Pojo 10.2.1-SNAPSHOT SKIPPED
[INFO] TomEE :: Examples :: Simple Stateful Pojo Callbacks 10.2.1-SNAPSHOT SKIPPED
[INFO] TomEE :: Examples :: Simple Stateless Pojo 10.2.1-SNAPSHOT SKIPPED
[INFO] TomEE :: Examples :: Simple Stateless Pojo Callbacks 10.2.1-SNAPSHOT SKIPPED
[INFO] TomEE :: Examples :: Simple Stateless With Deployment Descriptor 10.2.1-SNAPSHOT SKIPPED
[INFO] TomEE :: Examples :: Simple Webservice 10.2.1-SNAPSHOT SKIPPED
[INFO] TomEE :: Examples :: Simple Webservice Without Interface 10.2.1-SNAPSHOT SKIPPED
[INFO] TomEE :: Examples :: Async Servlet 10.2.1-SNAPSHOT . SKIPPED
[INFO] TomEE :: Web Examples :: Struts 10.2.1-SNAPSHOT .... SKIPPED
[INFO] TomEE :: Examples :: Telephone Stateful Pojo 10.2.1-SNAPSHOT SKIPPED
[INFO] TomEE :: Examples :: TestCase Injection 10.2.1-SNAPSHOT SKIPPED
[INFO] TomEE :: Examples :: Testing Security (Meta) 10.2.1-SNAPSHOT SKIPPED
[INFO] TomEE :: Examples :: Testing Security 10.2.1-SNAPSHOT SKIPPED
[INFO] TomEE :: Examples :: Testing Security 10.2.1-SNAPSHOT SKIPPED
[INFO] TomEE :: Examples :: Testing Security Service Provider 10.2.1-SNAPSHOT SKIPPED
[INFO] TomEE :: Examples :: Testing Security Script Service Provider 10.2.1-SNAPSHOT SKIPPED
[INFO] TomEE :: Examples :: Testing Transactions 10.2.1-SNAPSHOT SKIPPED
[INFO] TomEE :: Examples :: Testing Transactions BMT 10.2.1-SNAPSHOT SKIPPED
[INFO] TomEE :: TomEE :: IBM MQ AMQ Portability Examples :: MDB Example 1.0 SKIPPED
[INFO] TomEE :: Examples :: Transaction Rollback 10.2.1-SNAPSHOT SKIPPED
[INFO] TomEE :: Examples :: Troubleshooting 10.2.1-SNAPSHOT SKIPPED
[INFO] TomEE :: Examples :: Webservice Attachments 10.2.1-SNAPSHOT SKIPPED
[INFO] TomEE :: Examples :: Webservice Inheritance 10.2.1-SNAPSHOT SKIPPED
[INFO] TomEE :: Web Examples :: EJB WebService with Security 10.2.1-SNAPSHOT SKIPPED
[INFO] TomEE :: Web Examples :: EJB WebService with SSL Client Certificate 10.2.1-SNAPSHOT SKIPPED
[INFO] TomEE :: Web Examples :: EJB WebService with WS-Security 10.2.1-SNAPSHOT SKIPPED
[INFO] TomEE :: Web Examples :: EJB WebService WS Security with resources.xml 10.2.1-SNAPSHOT SKIPPED
[INFO] TomEE :: Examples :: Web Service Handlers 10.2.1-SNAPSHOT SKIPPED
[INFO] TomEE :: Examples :: @WebService Holder 10.2.1-SNAPSHOT SKIPPED
[INFO] TomEE :: Web Examples :: Moviefun 10.2.1-SNAPSHOT .. SKIPPED
[INFO] TomEE :: Web Examples :: Moviefun Rest 10.2.1-SNAPSHOT SKIPPED
[INFO] TomEE :: Examples :: Resources/JMX Example 10.2.1-SNAPSHOT SKIPPED
[INFO] TomEE :: Examples :: Resources/JMX Example :: EJB Module 10.2.1-SNAPSHOT SKIPPED
[INFO] TomEE :: Examples :: Resources/JMX Example :: EAR Module 10.2.1-SNAPSHOT SKIPPED
[INFO] TomEE :: Examples :: WebSocket with tls and basic auth Example 10.2.1-SNAPSHOT SKIPPED
[INFO] TomEE :: Examples :: Concurrency utilities example 10.2.1-SNAPSHOT SKIPPED
[INFO] TomEE :: Examples :: Microprofile JSONB Configuration 10.2.1-SNAPSHOT SKIPPED
[INFO] TomEE :: Examples :: Microprofile JSONB Custom Serializer/Deserializer 10.2.1-SNAPSHOT SKIPPED
[INFO] TomEE :: Examples :: Azure deployment example 10.2.1-SNAPSHOT SKIPPED
[INFO] TomEE :: Examples :: XA Datasource configuration and usage 10.2.1-SNAPSHOT SKIPPED
[INFO] TomEE :: Examples :: Websocket JMS 10.2.1-SNAPSHOT . SKIPPED
[INFO] TomEE :: Web Examples :: Multi-Broker 10.2.1-SNAPSHOT SKIPPED
[INFO] TomEE :: Examples :: Jakarta Security tomcat-user.xml Identity Store 10.2.1-SNAPSHOT SKIPPED
[INFO] TomEE :: Examples :: Jakarta Security custom Identity Store 10.2.1-SNAPSHOT SKIPPED
[INFO] TomEE :: Examples :: Jakarta Security OpenID Connect 10.2.1-SNAPSHOT SKIPPED
[INFO] TomEE :: Examples :: Jakarta Security Passkey (WebAuthn) as a 2nd factor 10.3.0-SNAPSHOT SKIPPED
[INFO] TomEE :: Examples :: Jakarta Security Passkey 2FA (programmatic SecurityContext.authenticate) 10.3.0-SNAPSHOT SKIPPED
[INFO] TomEE :: Examples 10.3.0-SNAPSHOT .................. SKIPPED
[INFO] TomEE :: Assembly :: All In One EJB Lite jar 10.3.0-SNAPSHOT SKIPPED
[INFO] TomEE :: Utils :: TomEE Webapps-based Deployer EJB 10.3.0-SNAPSHOT SKIPPED
[INFO] TomEE :: TCK 10.3.0-SNAPSHOT ....................... SKIPPED
[INFO] TomEE :: TCK :: Common 10.3.0-SNAPSHOT ............. SKIPPED
[INFO] TomEE :: TCK :: CDI Embedded 10.3.0-SNAPSHOT ....... SKIPPED
[INFO] TomEE :: TCK :: CDI TomEE 10.3.0-SNAPSHOT .......... SKIPPED
[INFO] TomEE :: TCK :: CDI TCK Signature Tests 10.3.0-SNAPSHOT SKIPPED
[INFO] TomEE :: TCK :: Bean Validation Embedded 10.3.0-SNAPSHOT SKIPPED
[INFO] TomEE :: TCK :: Bean Validation TomEE 10.3.0-SNAPSHOT SKIPPED
[INFO] TomEE :: TCK :: Bean Validation TCK Signature tests 10.3.0-SNAPSHOT SKIPPED
[INFO] TomEE :: TCK :: JSON-P Standalone 10.3.0-SNAPSHOT .. SKIPPED
[INFO] TomEE :: TCK :: JSON-P Signature Tests 10.3.0-SNAPSHOT SKIPPED
[INFO] TomEE :: TCK :: JSON-B Standalone 10.3.0-SNAPSHOT .. SKIPPED
[INFO] TomEE :: TCK :: JSON-B Signature Tests 10.3.0-SNAPSHOT SKIPPED
[INFO] TomEE :: TCK :: Concurrency Standalone 10.3.0-SNAPSHOT SKIPPED
[INFO] TomEE :: TCK :: Concurrency Signature Tests 10.3.0-SNAPSHOT SKIPPED
[INFO] TomEE :: TCK :: MicroProfile 10.3.0-SNAPSHOT ....... SKIPPED
[INFO] TomEE :: TCK :: MicroProfile Config TCK 10.3.0-SNAPSHOT SKIPPED
[INFO] TomEE :: TCK :: MicroProfile JWT TCK 10.3.0-SNAPSHOT SKIPPED
[INFO] TomEE :: TCK :: MicroProfile Health TCK 10.3.0-SNAPSHOT SKIPPED
[INFO] TomEE :: TCK :: MicroProfile Metrics TCK 10.3.0-SNAPSHOT SKIPPED
[INFO] TomEE :: TCK :: MicroProfile Rest Client TCK 10.3.0-SNAPSHOT SKIPPED
[INFO] TomEE :: TCK :: MicroProfile Open API TCK 10.3.0-SNAPSHOT SKIPPED
[INFO] TomEE :: TCK :: MicroProfile Fault Tolerance TCK 10.3.0-SNAPSHOT SKIPPED
[INFO] TomEE :: TCK :: MicroProfile Open Telemetry TCK 10.3.0-SNAPSHOT SKIPPED
[INFO] TomEE :: TCK :: JAX-RS TCK 10.3.0-SNAPSHOT ......... SKIPPED
[INFO] TomEE :: TCK :: JAX-RS TCK :: Tests 10.3.0-SNAPSHOT SKIPPED
[INFO] TomEE :: Arquillian Adaptors Parent :: Embedded Adaptor 10.3.0-SNAPSHOT SKIPPED
[INFO] TomEE :: TCK :: JAX-RS TCK :: Tests Embedded 10.3.0-SNAPSHOT SKIPPED
[INFO] TomEE :: TCK :: JAX-RS TCK :: Signature Test 10.3.0-SNAPSHOT SKIPPED
[INFO] TomEE :: Arquillian Adaptors Parent :: Tests 10.3.0-SNAPSHOT SKIPPED
[INFO] TomEE :: Arquillian Adaptors Parent :: Tests :: Web Profile 10.3.0-SNAPSHOT SKIPPED
[INFO] TomEE :: Arquillian Adaptors Parent :: Tests :: JAXRS 10.3.0-SNAPSHOT SKIPPED
[INFO] TomEE :: Arquillian Adaptors Parent :: Tests :: JAXWS 10.3.0-SNAPSHOT SKIPPED
[INFO] TomEE :: Arquillian Adaptors Parent :: Tests :: JMS 10.3.0-SNAPSHOT SKIPPED
[INFO] TomEE :: Arquillian Adaptors Parent :: Tests :: Configuration Tests 10.3.0-SNAPSHOT SKIPPED
[INFO] TomEE :: Arquillian Adaptors Parent :: Sample :: Moviefun 10.3.0-SNAPSHOT SKIPPED
[INFO] TomEE :: Arquillian Adaptors Parent :: Arquillian TCK 10.3.0-SNAPSHOT SKIPPED
[INFO] TomEE :: Arquillian :: Functional Tests 10.3.0-SNAPSHOT SKIPPED
[INFO] TomEE :: Arquillian :: Functional Tests :: Spring CXF Test 10.3.0-SNAPSHOT SKIPPED
[INFO] TomEE :: Utils :: Provisionning 10.3.0-SNAPSHOT .... SKIPPED
[INFO] TomEE :: Utils :: Log4j2 10.3.0-SNAPSHOT ........... SKIPPED
[INFO] TomEE :: TomEE :: webaccess 10.3.0-SNAPSHOT ........ SKIPPED
[INFO] TomEE :: TomEE :: Overlay Runner 10.3.0-SNAPSHOT ... SKIPPED
[INFO] ------------------------------------------------------------------------
[INFO] BUILD FAILURE
[INFO] ------------------------------------------------------------------------
[INFO] Total time: 05:54 min
[INFO] Finished at: 2026-09-30T12:26:46Z
[INFO] ------------------------------------------------------------------------
[WARNING]
[WARNING] Plugin validation issues were detected in 10 plugin(s)
[WARNING]
[WARNING] * org.apache.maven.plugins:maven-jar-plugin:3.0.2
[WARNING] * org.apache.maven.plugins:maven-assembly-plugin:2.4.1
[WARNING] * org.apache.maven.plugins:maven-compiler-plugin:3.14.1
[WARNING] * org.apache.maven.plugins:maven-compiler-plugin:3.10.1
[WARNING] * org.apache.tomee.patch:tomee-patch-plugin:0.10
[WARNING] * org.apache.felix:maven-bundle-plugin:6.1.0
[WARNING] * org.apache.maven.plugins:maven-resources-plugin:3.3.0
[WARNING] * org.apache.openjpa:openjpa-maven-plugin:4.1.1
[WARNING] * org.apache.maven.plugins:maven-surefire-plugin:3.5.3
[WARNING] * org.apache.maven.plugins:maven-war-plugin:3.3.2
[WARNING]
[WARNING] For more or less details, use 'maven.plugin.validation' property with one of the values (case insensitive): [BRIEF, DEFAULT, VERBOSE]
[WARNING]
[ERROR] Failed to execute goal on project jaxrs-json-provider-jettison: Could not resolve dependencies for project org.superbiz:jaxrs-json-provider-jettison:war:10.2.1-SNAPSHOT: The following artifacts could not be resolved: org.apache.tomee.bom:tomee-microprofile:jar:10.2.1-SNAPSHOT (absent): Could not find artifact org.apache.tomee.bom:tomee-microprofile:jar:10.2.1-SNAPSHOT -> [Help 1]
[ERROR]
[ERROR] To see the full stack trace of the errors, re-run Maven with the -e switch.
[ERROR] Re-run Maven using the -X switch to enable full debug logging.
[ERROR]
[ERROR] For more information about the errors and possible solutions, please read the following articles:
[ERROR] [Help 1] http://cwiki.apache.org/confluence/display/MAVEN/DependencyResolutionException
[ERROR]
[ERROR] After correcting the problems, you can resume the build with the command
[ERROR] mvn <args> -rf :jaxrs-json-provider-jettison
Build step 'Execute shell' marked build as failure
INFO: Processing JUnit
INFO: [JUnit] - No test report file(s) were found with the pattern '**/target/surefire-reports/TEST-*.xml' relative to '<https://ci-builds.apache.org/job/Tomee/job/tomee-10-build-full-tck/ws/'> for the testing framework 'JUnit'.
Did you enter a pattern relative to (and within) the workspace directory?
Did you generate the result report(s) for 'JUnit'?"
WARNING: All test reports are empty.
[Checks API] No suitable checks publisher found.
INFO: Setting the build status to SUCCESS