You are viewing a plain text version of this content. The canonical link for it is here.
Posted to commits@tomee.apache.org by Apache Jenkins Server <je...@builds.apache.org> on 2024/12/17 20:01:46 UTC

Build failed in Jenkins: TomEE » tomee-9.x-build-full » TomEE :: Arquillian :: Functional Tests :: Spring CXF Test #700

See <https://ci-builds.apache.org/job/Tomee/job/tomee-9.x-build-full/org.apache.tomee$spring-cxf-tomee-4332/700/display/redirect>

Changes:


------------------------------------------
[INFO] 
[INFO] ---------------< org.apache.tomee:spring-cxf-tomee-4332 >---------------
[INFO] Building TomEE :: Arquillian :: Functional Tests :: Spring CXF Test 9.1.4-SNAPSHOT [338/346]
[INFO]   from arquillian/functional-tests/spring-cxf-tomee-4332/pom.xml
[INFO] --------------------------------[ war ]---------------------------------
[INFO] Downloading from apache-plugin-release: https://repository.apache.org/content/repositories/releases/org/springframework/boot/spring-boot-maven-plugin/maven-metadata.xml
[INFO] Downloading from apache-plugin-snapshot: https://repository.apache.org/content/groups/snapshots/org/springframework/boot/spring-boot-maven-plugin/maven-metadata.xml
[INFO] Downloading from Nexus: https://repository.apache.org/snapshots/org/springframework/boot/spring-boot-maven-plugin/maven-metadata.xml
[INFO] Downloading from central: https://repo.maven.apache.org/maven2/org/springframework/boot/spring-boot-maven-plugin/maven-metadata.xml
[INFO] Downloaded from central: https://repo.maven.apache.org/maven2/org/springframework/boot/spring-boot-maven-plugin/maven-metadata.xml (8.6 kB at 69 kB/s)
[INFO] 
[INFO] --- clean:3.2.0:clean (default-clean) @ spring-cxf-tomee-4332 ---
[INFO] 
[INFO] --- enforcer:3.0.0:enforce (enforce-maven-version) @ spring-cxf-tomee-4332 ---
[INFO] 
[INFO] --- enforcer:3.0.0:enforce (enforce-java-version) @ spring-cxf-tomee-4332 ---
[INFO] 
[INFO] --- remote-resources:1.5:process (process-resource-bundles) @ spring-cxf-tomee-4332 ---
[INFO] 
[INFO] --- resources:3.0.2:resources (default-resources) @ spring-cxf-tomee-4332 ---
[INFO] Using 'UTF-8' encoding to copy filtered resources.
[INFO] Copying 1 resource
[INFO] Copying 3 resources
[INFO] 
[INFO] --- compiler:3.6.2:compile (default-compile) @ spring-cxf-tomee-4332 ---
[INFO] Changes detected - recompiling the module!
[INFO] Compiling 4 source files to <https://ci-builds.apache.org/job/Tomee/job/tomee-9.x-build-full/org.apache.tomee$spring-cxf-tomee-4332/ws/target/classes>
[INFO] -------------------------------------------------------------
[ERROR] COMPILATION ERROR : 
[INFO] -------------------------------------------------------------
[ERROR] <https://ci-builds.apache.org/job/Tomee/job/tomee-9.x-build-full/org.apache.tomee$spring-cxf-tomee-4332/ws/src/main/java/org/example/spring/ServletInitializer.java>:[19,39] error: cannot access SpringApplicationBuilder
  bad class file: /home/jenkins/.m2/repository/org/springframework/boot/spring-boot/3.1.11/spring-boot-3.1.11.jar(/org/springframework/boot/builder/SpringApplicationBuilder.class)
    class file has wrong version 61.0, should be 55.0
    Please remove or make sure it appears in the correct subdirectory of the classpath.
[ERROR] <https://ci-builds.apache.org/job/Tomee/job/tomee-9.x-build-full/org.apache.tomee$spring-cxf-tomee-4332/ws/src/main/java/org/example/spring/ServletInitializer.java>:[20,51] error: cannot access SpringBootServletInitializer
  bad class file: /home/jenkins/.m2/repository/org/springframework/boot/spring-boot/3.1.11/spring-boot-3.1.11.jar(/org/springframework/boot/web/servlet/support/SpringBootServletInitializer.class)
    class file has wrong version 61.0, should be 55.0
    Please remove or make sure it appears in the correct subdirectory of the classpath.
[ERROR] <https://ci-builds.apache.org/job/Tomee/job/tomee-9.x-build-full/org.apache.tomee$spring-cxf-tomee-4332/ws/src/main/java/org/example/spring/ServletInitializer.java>:[22,40] error: cannot find symbol
  symbol: class SpringBootServletInitializer
[ERROR] <https://ci-builds.apache.org/job/Tomee/job/tomee-9.x-build-full/org.apache.tomee$spring-cxf-tomee-4332/ws/src/main/java/org/example/spring/ServletInitializer.java>:[25,46] error: cannot find symbol
  symbol:   class SpringApplicationBuilder
  location: class ServletInitializer
[ERROR] <https://ci-builds.apache.org/job/Tomee/job/tomee-9.x-build-full/org.apache.tomee$spring-cxf-tomee-4332/ws/src/main/java/org/example/spring/ServletInitializer.java>:[25,11] error: cannot find symbol
  symbol:   class SpringApplicationBuilder
  location: class ServletInitializer
[ERROR] <https://ci-builds.apache.org/job/Tomee/job/tomee-9.x-build-full/org.apache.tomee$spring-cxf-tomee-4332/ws/src/main/java/org/example/spring/DemoApplication.java>:[19,31] error: cannot access SpringApplication
  bad class file: /home/jenkins/.m2/repository/org/springframework/boot/spring-boot/3.1.11/spring-boot-3.1.11.jar(/org/springframework/boot/SpringApplication.class)
    class file has wrong version 61.0, should be 55.0
    Please remove or make sure it appears in the correct subdirectory of the classpath.
[ERROR] <https://ci-builds.apache.org/job/Tomee/job/tomee-9.x-build-full/org.apache.tomee$spring-cxf-tomee-4332/ws/src/main/java/org/example/spring/DemoApplication.java>:[20,45] error: cannot access SpringBootApplication
  bad class file: /home/jenkins/.m2/repository/org/springframework/boot/spring-boot-autoconfigure/3.1.11/spring-boot-autoconfigure-3.1.11.jar(/org/springframework/boot/autoconfigure/SpringBootApplication.class)
    class file has wrong version 61.0, should be 55.0
    Please remove or make sure it appears in the correct subdirectory of the classpath.
[ERROR] <https://ci-builds.apache.org/job/Tomee/job/tomee-9.x-build-full/org.apache.tomee$spring-cxf-tomee-4332/ws/src/main/java/org/example/spring/DemoApplication.java>:[22,1] error: cannot find symbol
  symbol: class SpringBootApplication
[ERROR] <https://ci-builds.apache.org/job/Tomee/job/tomee-9.x-build-full/org.apache.tomee$spring-cxf-tomee-4332/ws/src/main/java/org/example/spring/GreetingController.java>:[19,31] error: cannot access MediaType
  bad class file: /home/jenkins/.m2/repository/org/springframework/spring-web/6.0.19/spring-web-6.0.19.jar(/org/springframework/http/MediaType.class)
    class file has wrong version 61.0, should be 55.0
    Please remove or make sure it appears in the correct subdirectory of the classpath.
[ERROR] <https://ci-builds.apache.org/job/Tomee/job/tomee-9.x-build-full/org.apache.tomee$spring-cxf-tomee-4332/ws/src/main/java/org/example/spring/GreetingController.java>:[20,37] error: cannot access Controller
  bad class file: /home/jenkins/.m2/repository/org/springframework/spring-context/6.0.19/spring-context-6.0.19.jar(/org/springframework/stereotype/Controller.class)
    class file has wrong version 61.0, should be 55.0
    Please remove or make sure it appears in the correct subdirectory of the classpath.
[ERROR] <https://ci-builds.apache.org/job/Tomee/job/tomee-9.x-build-full/org.apache.tomee$spring-cxf-tomee-4332/ws/src/main/java/org/example/spring/GreetingController.java>:[21,46] error: cannot access GetMapping
  bad class file: /home/jenkins/.m2/repository/org/springframework/spring-web/6.0.19/spring-web-6.0.19.jar(/org/springframework/web/bind/annotation/GetMapping.class)
    class file has wrong version 61.0, should be 55.0
    Please remove or make sure it appears in the correct subdirectory of the classpath.
[ERROR] <https://ci-builds.apache.org/job/Tomee/job/tomee-9.x-build-full/org.apache.tomee$spring-cxf-tomee-4332/ws/src/main/java/org/example/spring/GreetingController.java>:[22,46] error: cannot access RequestMapping
  bad class file: /home/jenkins/.m2/repository/org/springframework/spring-web/6.0.19/spring-web-6.0.19.jar(/org/springframework/web/bind/annotation/RequestMapping.class)
    class file has wrong version 61.0, should be 55.0
    Please remove or make sure it appears in the correct subdirectory of the classpath.
[ERROR] <https://ci-builds.apache.org/job/Tomee/job/tomee-9.x-build-full/org.apache.tomee$spring-cxf-tomee-4332/ws/src/main/java/org/example/spring/GreetingController.java>:[23,46] error: cannot access ResponseBody
  bad class file: /home/jenkins/.m2/repository/org/springframework/spring-web/6.0.19/spring-web-6.0.19.jar(/org/springframework/web/bind/annotation/ResponseBody.class)
    class file has wrong version 61.0, should be 55.0
    Please remove or make sure it appears in the correct subdirectory of the classpath.
[ERROR] <https://ci-builds.apache.org/job/Tomee/job/tomee-9.x-build-full/org.apache.tomee$spring-cxf-tomee-4332/ws/src/main/java/org/example/spring/GreetingController.java>:[25,1] error: cannot find symbol
  symbol: class Controller
[ERROR] <https://ci-builds.apache.org/job/Tomee/job/tomee-9.x-build-full/org.apache.tomee$spring-cxf-tomee-4332/ws/src/main/java/org/example/spring/GreetingController.java>:[26,1] error: cannot find symbol
  symbol: class RequestMapping
[ERROR] <https://ci-builds.apache.org/job/Tomee/job/tomee-9.x-build-full/org.apache.tomee$spring-cxf-tomee-4332/ws/src/main/java/org/example/spring/GreetingController.java>:[29,5] error: cannot find symbol
  symbol:   class GetMapping
  location: class GreetingController
[ERROR] <https://ci-builds.apache.org/job/Tomee/job/tomee-9.x-build-full/org.apache.tomee$spring-cxf-tomee-4332/ws/src/main/java/org/example/spring/GreetingController.java>:[29,27] error: cannot find symbol
  symbol:   variable MediaType
  location: class GreetingController
[ERROR] <https://ci-builds.apache.org/job/Tomee/job/tomee-9.x-build-full/org.apache.tomee$spring-cxf-tomee-4332/ws/src/main/java/org/example/spring/GreetingController.java>:[30,5] error: cannot find symbol
  symbol:   class ResponseBody
  location: class GreetingController
[ERROR] <https://ci-builds.apache.org/job/Tomee/job/tomee-9.x-build-full/org.apache.tomee$spring-cxf-tomee-4332/ws/src/main/java/org/example/spring/ServletInitializer.java>:[24,1] error: method does not override or implement a method from a supertype
[ERROR] <https://ci-builds.apache.org/job/Tomee/job/tomee-9.x-build-full/org.apache.tomee$spring-cxf-tomee-4332/ws/src/main/java/org/example/spring/DemoApplication.java>:[26,2] error: cannot find symbol
  symbol:   variable SpringApplication
  location: class DemoApplication
[INFO] 20 errors 
[INFO] -------------------------------------------------------------

Build failed in Jenkins: TomEE » tomee-9.x-build-full » TomEE :: Arquillian :: Functional Tests :: Spring CXF Test #703

Posted by Apache Jenkins Server <je...@builds.apache.org>.
See <https://ci-builds.apache.org/job/Tomee/job/tomee-9.x-build-full/org.apache.tomee$spring-cxf-tomee-4332/703/display/redirect>

Changes:


------------------------------------------
[INFO] 
[INFO] ---------------< org.apache.tomee:spring-cxf-tomee-4332 >---------------
[INFO] Building TomEE :: Arquillian :: Functional Tests :: Spring CXF Test 9.1.4-SNAPSHOT [338/346]
[INFO]   from arquillian/functional-tests/spring-cxf-tomee-4332/pom.xml
[INFO] --------------------------------[ war ]---------------------------------
[INFO] Downloading from Nexus: https://repository.apache.org/snapshots/org/springframework/boot/spring-boot-maven-plugin/maven-metadata.xml
[INFO] Downloading from apache-plugin-snapshot: https://repository.apache.org/content/groups/snapshots/org/springframework/boot/spring-boot-maven-plugin/maven-metadata.xml
[INFO] Downloading from apache-plugin-release: https://repository.apache.org/content/repositories/releases/org/springframework/boot/spring-boot-maven-plugin/maven-metadata.xml
[INFO] Downloading from central: https://repo.maven.apache.org/maven2/org/springframework/boot/spring-boot-maven-plugin/maven-metadata.xml
[INFO] Downloaded from central: https://repo.maven.apache.org/maven2/org/springframework/boot/spring-boot-maven-plugin/maven-metadata.xml (8.7 kB at 74 kB/s)
[INFO] Downloading from apache-plugin-release: https://repository.apache.org/content/repositories/releases/org/springframework/boot/spring-boot-maven-plugin/3.4.1/spring-boot-maven-plugin-3.4.1.pom
[INFO] Downloading from central: https://repo.maven.apache.org/maven2/org/springframework/boot/spring-boot-maven-plugin/3.4.1/spring-boot-maven-plugin-3.4.1.pom
[INFO] Downloaded from central: https://repo.maven.apache.org/maven2/org/springframework/boot/spring-boot-maven-plugin/3.4.1/spring-boot-maven-plugin-3.4.1.pom (4.0 kB at 125 kB/s)
[INFO] Downloading from apache-plugin-release: https://repository.apache.org/content/repositories/releases/org/springframework/boot/spring-boot-maven-plugin/3.4.1/spring-boot-maven-plugin-3.4.1.jar
[INFO] Downloading from central: https://repo.maven.apache.org/maven2/org/springframework/boot/spring-boot-maven-plugin/3.4.1/spring-boot-maven-plugin-3.4.1.jar
[INFO] Downloaded from central: https://repo.maven.apache.org/maven2/org/springframework/boot/spring-boot-maven-plugin/3.4.1/spring-boot-maven-plugin-3.4.1.jar (137 kB at 1.5 MB/s)
[INFO] 
[INFO] --- clean:3.2.0:clean (default-clean) @ spring-cxf-tomee-4332 ---
[INFO] 
[INFO] --- enforcer:3.0.0:enforce (enforce-maven-version) @ spring-cxf-tomee-4332 ---
[INFO] 
[INFO] --- enforcer:3.0.0:enforce (enforce-java-version) @ spring-cxf-tomee-4332 ---
[INFO] 
[INFO] --- remote-resources:1.5:process (process-resource-bundles) @ spring-cxf-tomee-4332 ---
[INFO] 
[INFO] --- resources:3.0.2:resources (default-resources) @ spring-cxf-tomee-4332 ---
[INFO] Using 'UTF-8' encoding to copy filtered resources.
[INFO] Copying 1 resource
[INFO] Copying 3 resources
[INFO] 
[INFO] --- compiler:3.6.2:compile (default-compile) @ spring-cxf-tomee-4332 ---
[INFO] Changes detected - recompiling the module!
[INFO] Compiling 4 source files to <https://ci-builds.apache.org/job/Tomee/job/tomee-9.x-build-full/org.apache.tomee$spring-cxf-tomee-4332/ws/target/classes>
[INFO] -------------------------------------------------------------
[ERROR] COMPILATION ERROR : 
[INFO] -------------------------------------------------------------
[ERROR] <https://ci-builds.apache.org/job/Tomee/job/tomee-9.x-build-full/org.apache.tomee$spring-cxf-tomee-4332/ws/src/main/java/org/example/spring/ServletInitializer.java>:[19,39] error: cannot access SpringApplicationBuilder
  bad class file: /home/jenkins/.m2/repository/org/springframework/boot/spring-boot/3.1.11/spring-boot-3.1.11.jar(/org/springframework/boot/builder/SpringApplicationBuilder.class)
    class file has wrong version 61.0, should be 55.0
    Please remove or make sure it appears in the correct subdirectory of the classpath.
[ERROR] <https://ci-builds.apache.org/job/Tomee/job/tomee-9.x-build-full/org.apache.tomee$spring-cxf-tomee-4332/ws/src/main/java/org/example/spring/ServletInitializer.java>:[20,51] error: cannot access SpringBootServletInitializer
  bad class file: /home/jenkins/.m2/repository/org/springframework/boot/spring-boot/3.1.11/spring-boot-3.1.11.jar(/org/springframework/boot/web/servlet/support/SpringBootServletInitializer.class)
    class file has wrong version 61.0, should be 55.0
    Please remove or make sure it appears in the correct subdirectory of the classpath.
[ERROR] <https://ci-builds.apache.org/job/Tomee/job/tomee-9.x-build-full/org.apache.tomee$spring-cxf-tomee-4332/ws/src/main/java/org/example/spring/ServletInitializer.java>:[22,40] error: cannot find symbol
  symbol: class SpringBootServletInitializer
[ERROR] <https://ci-builds.apache.org/job/Tomee/job/tomee-9.x-build-full/org.apache.tomee$spring-cxf-tomee-4332/ws/src/main/java/org/example/spring/ServletInitializer.java>:[25,46] error: cannot find symbol
  symbol:   class SpringApplicationBuilder
  location: class ServletInitializer
[ERROR] <https://ci-builds.apache.org/job/Tomee/job/tomee-9.x-build-full/org.apache.tomee$spring-cxf-tomee-4332/ws/src/main/java/org/example/spring/ServletInitializer.java>:[25,11] error: cannot find symbol
  symbol:   class SpringApplicationBuilder
  location: class ServletInitializer
[ERROR] <https://ci-builds.apache.org/job/Tomee/job/tomee-9.x-build-full/org.apache.tomee$spring-cxf-tomee-4332/ws/src/main/java/org/example/spring/DemoApplication.java>:[19,31] error: cannot access SpringApplication
  bad class file: /home/jenkins/.m2/repository/org/springframework/boot/spring-boot/3.1.11/spring-boot-3.1.11.jar(/org/springframework/boot/SpringApplication.class)
    class file has wrong version 61.0, should be 55.0
    Please remove or make sure it appears in the correct subdirectory of the classpath.
[ERROR] <https://ci-builds.apache.org/job/Tomee/job/tomee-9.x-build-full/org.apache.tomee$spring-cxf-tomee-4332/ws/src/main/java/org/example/spring/DemoApplication.java>:[20,45] error: cannot access SpringBootApplication
  bad class file: /home/jenkins/.m2/repository/org/springframework/boot/spring-boot-autoconfigure/3.1.11/spring-boot-autoconfigure-3.1.11.jar(/org/springframework/boot/autoconfigure/SpringBootApplication.class)
    class file has wrong version 61.0, should be 55.0
    Please remove or make sure it appears in the correct subdirectory of the classpath.
[ERROR] <https://ci-builds.apache.org/job/Tomee/job/tomee-9.x-build-full/org.apache.tomee$spring-cxf-tomee-4332/ws/src/main/java/org/example/spring/DemoApplication.java>:[22,1] error: cannot find symbol
  symbol: class SpringBootApplication
[ERROR] <https://ci-builds.apache.org/job/Tomee/job/tomee-9.x-build-full/org.apache.tomee$spring-cxf-tomee-4332/ws/src/main/java/org/example/spring/GreetingController.java>:[19,31] error: cannot access MediaType
  bad class file: /home/jenkins/.m2/repository/org/springframework/spring-web/6.0.19/spring-web-6.0.19.jar(/org/springframework/http/MediaType.class)
    class file has wrong version 61.0, should be 55.0
    Please remove or make sure it appears in the correct subdirectory of the classpath.
[ERROR] <https://ci-builds.apache.org/job/Tomee/job/tomee-9.x-build-full/org.apache.tomee$spring-cxf-tomee-4332/ws/src/main/java/org/example/spring/GreetingController.java>:[20,37] error: cannot access Controller
  bad class file: /home/jenkins/.m2/repository/org/springframework/spring-context/6.0.19/spring-context-6.0.19.jar(/org/springframework/stereotype/Controller.class)
    class file has wrong version 61.0, should be 55.0
    Please remove or make sure it appears in the correct subdirectory of the classpath.
[ERROR] <https://ci-builds.apache.org/job/Tomee/job/tomee-9.x-build-full/org.apache.tomee$spring-cxf-tomee-4332/ws/src/main/java/org/example/spring/GreetingController.java>:[21,46] error: cannot access GetMapping
  bad class file: /home/jenkins/.m2/repository/org/springframework/spring-web/6.0.19/spring-web-6.0.19.jar(/org/springframework/web/bind/annotation/GetMapping.class)
    class file has wrong version 61.0, should be 55.0
    Please remove or make sure it appears in the correct subdirectory of the classpath.
[ERROR] <https://ci-builds.apache.org/job/Tomee/job/tomee-9.x-build-full/org.apache.tomee$spring-cxf-tomee-4332/ws/src/main/java/org/example/spring/GreetingController.java>:[22,46] error: cannot access RequestMapping
  bad class file: /home/jenkins/.m2/repository/org/springframework/spring-web/6.0.19/spring-web-6.0.19.jar(/org/springframework/web/bind/annotation/RequestMapping.class)
    class file has wrong version 61.0, should be 55.0
    Please remove or make sure it appears in the correct subdirectory of the classpath.
[ERROR] <https://ci-builds.apache.org/job/Tomee/job/tomee-9.x-build-full/org.apache.tomee$spring-cxf-tomee-4332/ws/src/main/java/org/example/spring/GreetingController.java>:[23,46] error: cannot access ResponseBody
  bad class file: /home/jenkins/.m2/repository/org/springframework/spring-web/6.0.19/spring-web-6.0.19.jar(/org/springframework/web/bind/annotation/ResponseBody.class)
    class file has wrong version 61.0, should be 55.0
    Please remove or make sure it appears in the correct subdirectory of the classpath.
[ERROR] <https://ci-builds.apache.org/job/Tomee/job/tomee-9.x-build-full/org.apache.tomee$spring-cxf-tomee-4332/ws/src/main/java/org/example/spring/GreetingController.java>:[25,1] error: cannot find symbol
  symbol: class Controller
[ERROR] <https://ci-builds.apache.org/job/Tomee/job/tomee-9.x-build-full/org.apache.tomee$spring-cxf-tomee-4332/ws/src/main/java/org/example/spring/GreetingController.java>:[26,1] error: cannot find symbol
  symbol: class RequestMapping
[ERROR] <https://ci-builds.apache.org/job/Tomee/job/tomee-9.x-build-full/org.apache.tomee$spring-cxf-tomee-4332/ws/src/main/java/org/example/spring/GreetingController.java>:[29,5] error: cannot find symbol
  symbol:   class GetMapping
  location: class GreetingController
[ERROR] <https://ci-builds.apache.org/job/Tomee/job/tomee-9.x-build-full/org.apache.tomee$spring-cxf-tomee-4332/ws/src/main/java/org/example/spring/GreetingController.java>:[29,27] error: cannot find symbol
  symbol:   variable MediaType
  location: class GreetingController
[ERROR] <https://ci-builds.apache.org/job/Tomee/job/tomee-9.x-build-full/org.apache.tomee$spring-cxf-tomee-4332/ws/src/main/java/org/example/spring/GreetingController.java>:[30,5] error: cannot find symbol
  symbol:   class ResponseBody
  location: class GreetingController
[ERROR] <https://ci-builds.apache.org/job/Tomee/job/tomee-9.x-build-full/org.apache.tomee$spring-cxf-tomee-4332/ws/src/main/java/org/example/spring/ServletInitializer.java>:[24,1] error: method does not override or implement a method from a supertype
[ERROR] <https://ci-builds.apache.org/job/Tomee/job/tomee-9.x-build-full/org.apache.tomee$spring-cxf-tomee-4332/ws/src/main/java/org/example/spring/DemoApplication.java>:[26,2] error: cannot find symbol
  symbol:   variable SpringApplication
  location: class DemoApplication
[INFO] 20 errors 
[INFO] -------------------------------------------------------------

Build failed in Jenkins: TomEE » tomee-9.x-build-full » TomEE :: Arquillian :: Functional Tests :: Spring CXF Test #702

Posted by Apache Jenkins Server <je...@builds.apache.org>.
See <https://ci-builds.apache.org/job/Tomee/job/tomee-9.x-build-full/org.apache.tomee$spring-cxf-tomee-4332/702/display/redirect>

Changes:


------------------------------------------
[INFO] 
[INFO] ---------------< org.apache.tomee:spring-cxf-tomee-4332 >---------------
[INFO] Building TomEE :: Arquillian :: Functional Tests :: Spring CXF Test 9.1.4-SNAPSHOT [338/346]
[INFO]   from arquillian/functional-tests/spring-cxf-tomee-4332/pom.xml
[INFO] --------------------------------[ war ]---------------------------------
[INFO] Downloading from apache-plugin-release: https://repository.apache.org/content/repositories/releases/org/springframework/boot/spring-boot-maven-plugin/maven-metadata.xml
[INFO] Downloading from apache-plugin-snapshot: https://repository.apache.org/content/groups/snapshots/org/springframework/boot/spring-boot-maven-plugin/maven-metadata.xml
[INFO] Downloading from central: https://repo.maven.apache.org/maven2/org/springframework/boot/spring-boot-maven-plugin/maven-metadata.xml
[INFO] Downloading from Nexus: https://repository.apache.org/snapshots/org/springframework/boot/spring-boot-maven-plugin/maven-metadata.xml
[INFO] Downloaded from central: https://repo.maven.apache.org/maven2/org/springframework/boot/spring-boot-maven-plugin/maven-metadata.xml (8.7 kB at 60 kB/s)
[INFO] Downloading from apache-plugin-release: https://repository.apache.org/content/repositories/releases/org/springframework/boot/spring-boot-maven-plugin/3.4.1/spring-boot-maven-plugin-3.4.1.pom
[INFO] Downloading from central: https://repo.maven.apache.org/maven2/org/springframework/boot/spring-boot-maven-plugin/3.4.1/spring-boot-maven-plugin-3.4.1.pom
[INFO] Downloaded from central: https://repo.maven.apache.org/maven2/org/springframework/boot/spring-boot-maven-plugin/3.4.1/spring-boot-maven-plugin-3.4.1.pom (4.0 kB at 114 kB/s)
[INFO] Downloading from apache-plugin-release: https://repository.apache.org/content/repositories/releases/org/springframework/boot/spring-boot-maven-plugin/3.4.1/spring-boot-maven-plugin-3.4.1.jar
[INFO] Downloading from central: https://repo.maven.apache.org/maven2/org/springframework/boot/spring-boot-maven-plugin/3.4.1/spring-boot-maven-plugin-3.4.1.jar
[INFO] Downloaded from central: https://repo.maven.apache.org/maven2/org/springframework/boot/spring-boot-maven-plugin/3.4.1/spring-boot-maven-plugin-3.4.1.jar (137 kB at 1.4 MB/s)
[INFO] Downloading from apache: https://repository.apache.org/content/repositories/releases/org/springframework/boot/spring-boot-starter-web/3.1.11/spring-boot-starter-web-3.1.11.pom
[INFO] Downloading from JBoss Repository: https://repository.jboss.org/nexus/content/groups/public-jboss/org/springframework/boot/spring-boot-starter-web/3.1.11/spring-boot-starter-web-3.1.11.pom
[INFO] Downloading from B_shibboleth: https://build.shibboleth.net/nexus/content/groups/public/org/springframework/boot/spring-boot-starter-web/3.1.11/spring-boot-starter-web-3.1.11.pom
[INFO] Downloading from central: https://repo.maven.apache.org/maven2/org/springframework/boot/spring-boot-starter-web/3.1.11/spring-boot-starter-web-3.1.11.pom
[INFO] Downloaded from central: https://repo.maven.apache.org/maven2/org/springframework/boot/spring-boot-starter-web/3.1.11/spring-boot-starter-web-3.1.11.pom (2.9 kB at 86 kB/s)
[INFO] Downloading from apache: https://repository.apache.org/content/repositories/releases/org/springframework/boot/spring-boot-starter/3.1.11/spring-boot-starter-3.1.11.pom
[INFO] Downloading from JBoss Repository: https://repository.jboss.org/nexus/content/groups/public-jboss/org/springframework/boot/spring-boot-starter/3.1.11/spring-boot-starter-3.1.11.pom
[INFO] Downloading from B_shibboleth: https://build.shibboleth.net/nexus/content/groups/public/org/springframework/boot/spring-boot-starter/3.1.11/spring-boot-starter-3.1.11.pom
[INFO] Downloading from central: https://repo.maven.apache.org/maven2/org/springframework/boot/spring-boot-starter/3.1.11/spring-boot-starter-3.1.11.pom
[INFO] Downloaded from central: https://repo.maven.apache.org/maven2/org/springframework/boot/spring-boot-starter/3.1.11/spring-boot-starter-3.1.11.pom (3.0 kB at 98 kB/s)
[INFO] Downloading from apache: https://repository.apache.org/content/repositories/releases/org/springframework/boot/spring-boot/3.1.11/spring-boot-3.1.11.pom
[INFO] Downloading from JBoss Repository: https://repository.jboss.org/nexus/content/groups/public-jboss/org/springframework/boot/spring-boot/3.1.11/spring-boot-3.1.11.pom
[INFO] Downloading from B_shibboleth: https://build.shibboleth.net/nexus/content/groups/public/org/springframework/boot/spring-boot/3.1.11/spring-boot-3.1.11.pom
[INFO] Downloading from central: https://repo.maven.apache.org/maven2/org/springframework/boot/spring-boot/3.1.11/spring-boot-3.1.11.pom
[INFO] Downloaded from central: https://repo.maven.apache.org/maven2/org/springframework/boot/spring-boot/3.1.11/spring-boot-3.1.11.pom (2.2 kB at 71 kB/s)
[INFO] Downloading from apache: https://repository.apache.org/content/repositories/releases/org/springframework/boot/spring-boot-autoconfigure/3.1.11/spring-boot-autoconfigure-3.1.11.pom
[INFO] Downloading from JBoss Repository: https://repository.jboss.org/nexus/content/groups/public-jboss/org/springframework/boot/spring-boot-autoconfigure/3.1.11/spring-boot-autoconfigure-3.1.11.pom
[INFO] Downloading from B_shibboleth: https://build.shibboleth.net/nexus/content/groups/public/org/springframework/boot/spring-boot-autoconfigure/3.1.11/spring-boot-autoconfigure-3.1.11.pom
[INFO] Downloading from central: https://repo.maven.apache.org/maven2/org/springframework/boot/spring-boot-autoconfigure/3.1.11/spring-boot-autoconfigure-3.1.11.pom
[INFO] Downloaded from central: https://repo.maven.apache.org/maven2/org/springframework/boot/spring-boot-autoconfigure/3.1.11/spring-boot-autoconfigure-3.1.11.pom (2.1 kB at 64 kB/s)
[INFO] Downloading from apache: https://repository.apache.org/content/repositories/releases/org/springframework/boot/spring-boot-starter-logging/3.1.11/spring-boot-starter-logging-3.1.11.pom
[INFO] Downloading from JBoss Repository: https://repository.jboss.org/nexus/content/groups/public-jboss/org/springframework/boot/spring-boot-starter-logging/3.1.11/spring-boot-starter-logging-3.1.11.pom
[INFO] Downloading from B_shibboleth: https://build.shibboleth.net/nexus/content/groups/public/org/springframework/boot/spring-boot-starter-logging/3.1.11/spring-boot-starter-logging-3.1.11.pom
[INFO] Downloading from central: https://repo.maven.apache.org/maven2/org/springframework/boot/spring-boot-starter-logging/3.1.11/spring-boot-starter-logging-3.1.11.pom
[INFO] Downloaded from central: https://repo.maven.apache.org/maven2/org/springframework/boot/spring-boot-starter-logging/3.1.11/spring-boot-starter-logging-3.1.11.pom (2.5 kB at 36 kB/s)
[INFO] Downloading from apache: https://repository.apache.org/content/repositories/releases/org/springframework/boot/spring-boot-starter-json/3.1.11/spring-boot-starter-json-3.1.11.pom
[INFO] Downloading from JBoss Repository: https://repository.jboss.org/nexus/content/groups/public-jboss/org/springframework/boot/spring-boot-starter-json/3.1.11/spring-boot-starter-json-3.1.11.pom
[INFO] Downloading from B_shibboleth: https://build.shibboleth.net/nexus/content/groups/public/org/springframework/boot/spring-boot-starter-json/3.1.11/spring-boot-starter-json-3.1.11.pom
[INFO] Downloading from central: https://repo.maven.apache.org/maven2/org/springframework/boot/spring-boot-starter-json/3.1.11/spring-boot-starter-json-3.1.11.pom
[INFO] Downloaded from central: https://repo.maven.apache.org/maven2/org/springframework/boot/spring-boot-starter-json/3.1.11/spring-boot-starter-json-3.1.11.pom (3.1 kB at 45 kB/s)
[INFO] Downloading from apache: https://repository.apache.org/content/repositories/releases/org/springframework/boot/spring-boot-starter-tomcat/3.1.11/spring-boot-starter-tomcat-3.1.11.pom
[INFO] Downloading from JBoss Repository: https://repository.jboss.org/nexus/content/groups/public-jboss/org/springframework/boot/spring-boot-starter-tomcat/3.1.11/spring-boot-starter-tomcat-3.1.11.pom
[INFO] Downloading from B_shibboleth: https://build.shibboleth.net/nexus/content/groups/public/org/springframework/boot/spring-boot-starter-tomcat/3.1.11/spring-boot-starter-tomcat-3.1.11.pom
[INFO] Downloading from central: https://repo.maven.apache.org/maven2/org/springframework/boot/spring-boot-starter-tomcat/3.1.11/spring-boot-starter-tomcat-3.1.11.pom
[INFO] Downloaded from central: https://repo.maven.apache.org/maven2/org/springframework/boot/spring-boot-starter-tomcat/3.1.11/spring-boot-starter-tomcat-3.1.11.pom (3.1 kB at 101 kB/s)
[INFO] Downloading from apache: https://repository.apache.org/content/repositories/releases/org/springframework/boot/spring-boot-starter-test/3.1.11/spring-boot-starter-test-3.1.11.pom
[INFO] Downloading from JBoss Repository: https://repository.jboss.org/nexus/content/groups/public-jboss/org/springframework/boot/spring-boot-starter-test/3.1.11/spring-boot-starter-test-3.1.11.pom
[INFO] Downloading from B_shibboleth: https://build.shibboleth.net/nexus/content/groups/public/org/springframework/boot/spring-boot-starter-test/3.1.11/spring-boot-starter-test-3.1.11.pom
[INFO] Downloading from central: https://repo.maven.apache.org/maven2/org/springframework/boot/spring-boot-starter-test/3.1.11/spring-boot-starter-test-3.1.11.pom
[INFO] Downloaded from central: https://repo.maven.apache.org/maven2/org/springframework/boot/spring-boot-starter-test/3.1.11/spring-boot-starter-test-3.1.11.pom (4.9 kB at 163 kB/s)
[INFO] Downloading from apache: https://repository.apache.org/content/repositories/releases/org/springframework/boot/spring-boot-test/3.1.11/spring-boot-test-3.1.11.pom
[INFO] Downloading from JBoss Repository: https://repository.jboss.org/nexus/content/groups/public-jboss/org/springframework/boot/spring-boot-test/3.1.11/spring-boot-test-3.1.11.pom
[INFO] Downloading from B_shibboleth: https://build.shibboleth.net/nexus/content/groups/public/org/springframework/boot/spring-boot-test/3.1.11/spring-boot-test-3.1.11.pom
[INFO] Downloading from central: https://repo.maven.apache.org/maven2/org/springframework/boot/spring-boot-test/3.1.11/spring-boot-test-3.1.11.pom
[INFO] Downloaded from central: https://repo.maven.apache.org/maven2/org/springframework/boot/spring-boot-test/3.1.11/spring-boot-test-3.1.11.pom (2.0 kB at 68 kB/s)
[INFO] Downloading from apache: https://repository.apache.org/content/repositories/releases/org/springframework/boot/spring-boot-test-autoconfigure/3.1.11/spring-boot-test-autoconfigure-3.1.11.pom
[INFO] Downloading from JBoss Repository: https://repository.jboss.org/nexus/content/groups/public-jboss/org/springframework/boot/spring-boot-test-autoconfigure/3.1.11/spring-boot-test-autoconfigure-3.1.11.pom
[INFO] Downloading from B_shibboleth: https://build.shibboleth.net/nexus/content/groups/public/org/springframework/boot/spring-boot-test-autoconfigure/3.1.11/spring-boot-test-autoconfigure-3.1.11.pom
[INFO] Downloading from central: https://repo.maven.apache.org/maven2/org/springframework/boot/spring-boot-test-autoconfigure/3.1.11/spring-boot-test-autoconfigure-3.1.11.pom
[INFO] Downloaded from central: https://repo.maven.apache.org/maven2/org/springframework/boot/spring-boot-test-autoconfigure/3.1.11/spring-boot-test-autoconfigure-3.1.11.pom (2.5 kB at 80 kB/s)
[INFO] Downloading from apache: https://repository.apache.org/content/repositories/releases/org/codehaus/plexus/plexus-classworlds/1.2-alpha-10/plexus-classworlds-1.2-alpha-10.pom
[INFO] Downloading from JBoss Repository: https://repository.jboss.org/nexus/content/groups/public-jboss/org/codehaus/plexus/plexus-classworlds/1.2-alpha-10/plexus-classworlds-1.2-alpha-10.pom
[INFO] Downloading from B_shibboleth: https://build.shibboleth.net/nexus/content/groups/public/org/codehaus/plexus/plexus-classworlds/1.2-alpha-10/plexus-classworlds-1.2-alpha-10.pom
[INFO] Downloading from central: https://repo.maven.apache.org/maven2/org/codehaus/plexus/plexus-classworlds/1.2-alpha-10/plexus-classworlds-1.2-alpha-10.pom
[INFO] Downloaded from central: https://repo.maven.apache.org/maven2/org/codehaus/plexus/plexus-classworlds/1.2-alpha-10/plexus-classworlds-1.2-alpha-10.pom (3.2 kB at 95 kB/s)
[INFO] Downloading from apache: https://repository.apache.org/content/repositories/releases/org/springframework/boot/spring-boot-starter-web/3.1.11/spring-boot-starter-web-3.1.11.jar
[INFO] Downloading from apache: https://repository.apache.org/content/repositories/releases/org/springframework/boot/spring-boot-starter/3.1.11/spring-boot-starter-3.1.11.jar
[INFO] Downloading from apache: https://repository.apache.org/content/repositories/releases/org/springframework/boot/spring-boot/3.1.11/spring-boot-3.1.11.jar
[INFO] Downloading from apache: https://repository.apache.org/content/repositories/releases/org/springframework/boot/spring-boot-autoconfigure/3.1.11/spring-boot-autoconfigure-3.1.11.jar
[INFO] Downloading from apache: https://repository.apache.org/content/repositories/releases/org/springframework/boot/spring-boot-starter-logging/3.1.11/spring-boot-starter-logging-3.1.11.jar
[INFO] Downloading from apache: https://repository.apache.org/content/repositories/releases/org/springframework/boot/spring-boot-starter-json/3.1.11/spring-boot-starter-json-3.1.11.jar
[INFO] Downloading from apache: https://repository.apache.org/content/repositories/releases/org/springframework/boot/spring-boot-starter-tomcat/3.1.11/spring-boot-starter-tomcat-3.1.11.jar
[INFO] Downloading from apache: https://repository.apache.org/content/repositories/releases/org/springframework/boot/spring-boot-test/3.1.11/spring-boot-test-3.1.11.jar
[INFO] Downloading from apache: https://repository.apache.org/content/repositories/releases/org/springframework/boot/spring-boot-starter-test/3.1.11/spring-boot-starter-test-3.1.11.jar
[INFO] Downloading from apache: https://repository.apache.org/content/repositories/releases/org/springframework/boot/spring-boot-test-autoconfigure/3.1.11/spring-boot-test-autoconfigure-3.1.11.jar
[INFO] Downloading from apache: https://repository.apache.org/content/repositories/releases/org/codehaus/plexus/plexus-classworlds/1.2-alpha-10/plexus-classworlds-1.2-alpha-10.jar
[INFO] Downloading from JBoss Repository: https://repository.jboss.org/nexus/content/groups/public-jboss/org/springframework/boot/spring-boot-starter-web/3.1.11/spring-boot-starter-web-3.1.11.jar
[INFO] Downloading from JBoss Repository: https://repository.jboss.org/nexus/content/groups/public-jboss/org/springframework/boot/spring-boot-starter/3.1.11/spring-boot-starter-3.1.11.jar
[INFO] Downloading from JBoss Repository: https://repository.jboss.org/nexus/content/groups/public-jboss/org/springframework/boot/spring-boot/3.1.11/spring-boot-3.1.11.jar
[INFO] Downloading from JBoss Repository: https://repository.jboss.org/nexus/content/groups/public-jboss/org/springframework/boot/spring-boot-autoconfigure/3.1.11/spring-boot-autoconfigure-3.1.11.jar
[INFO] Downloading from JBoss Repository: https://repository.jboss.org/nexus/content/groups/public-jboss/org/springframework/boot/spring-boot-starter-logging/3.1.11/spring-boot-starter-logging-3.1.11.jar
[INFO] Downloading from JBoss Repository: https://repository.jboss.org/nexus/content/groups/public-jboss/org/springframework/boot/spring-boot-starter-json/3.1.11/spring-boot-starter-json-3.1.11.jar
[INFO] Downloading from JBoss Repository: https://repository.jboss.org/nexus/content/groups/public-jboss/org/springframework/boot/spring-boot-starter-tomcat/3.1.11/spring-boot-starter-tomcat-3.1.11.jar
[INFO] Downloading from JBoss Repository: https://repository.jboss.org/nexus/content/groups/public-jboss/org/springframework/boot/spring-boot-starter-test/3.1.11/spring-boot-starter-test-3.1.11.jar
[INFO] Downloading from JBoss Repository: https://repository.jboss.org/nexus/content/groups/public-jboss/org/springframework/boot/spring-boot-test/3.1.11/spring-boot-test-3.1.11.jar
[INFO] Downloading from JBoss Repository: https://repository.jboss.org/nexus/content/groups/public-jboss/org/springframework/boot/spring-boot-test-autoconfigure/3.1.11/spring-boot-test-autoconfigure-3.1.11.jar
[INFO] Downloading from JBoss Repository: https://repository.jboss.org/nexus/content/groups/public-jboss/org/codehaus/plexus/plexus-classworlds/1.2-alpha-10/plexus-classworlds-1.2-alpha-10.jar
[INFO] Downloading from B_shibboleth: https://build.shibboleth.net/nexus/content/groups/public/org/springframework/boot/spring-boot-starter-web/3.1.11/spring-boot-starter-web-3.1.11.jar
[INFO] Downloading from B_shibboleth: https://build.shibboleth.net/nexus/content/groups/public/org/springframework/boot/spring-boot-starter/3.1.11/spring-boot-starter-3.1.11.jar
[INFO] Downloading from B_shibboleth: https://build.shibboleth.net/nexus/content/groups/public/org/springframework/boot/spring-boot/3.1.11/spring-boot-3.1.11.jar
[INFO] Downloading from B_shibboleth: https://build.shibboleth.net/nexus/content/groups/public/org/springframework/boot/spring-boot-autoconfigure/3.1.11/spring-boot-autoconfigure-3.1.11.jar
[INFO] Downloading from B_shibboleth: https://build.shibboleth.net/nexus/content/groups/public/org/springframework/boot/spring-boot-starter-logging/3.1.11/spring-boot-starter-logging-3.1.11.jar
[INFO] Downloading from B_shibboleth: https://build.shibboleth.net/nexus/content/groups/public/org/springframework/boot/spring-boot-starter-json/3.1.11/spring-boot-starter-json-3.1.11.jar
[INFO] Downloading from B_shibboleth: https://build.shibboleth.net/nexus/content/groups/public/org/springframework/boot/spring-boot-starter-tomcat/3.1.11/spring-boot-starter-tomcat-3.1.11.jar
[INFO] Downloading from B_shibboleth: https://build.shibboleth.net/nexus/content/groups/public/org/springframework/boot/spring-boot-starter-test/3.1.11/spring-boot-starter-test-3.1.11.jar
[INFO] Downloading from B_shibboleth: https://build.shibboleth.net/nexus/content/groups/public/org/springframework/boot/spring-boot-test/3.1.11/spring-boot-test-3.1.11.jar
[INFO] Downloading from B_shibboleth: https://build.shibboleth.net/nexus/content/groups/public/org/springframework/boot/spring-boot-test-autoconfigure/3.1.11/spring-boot-test-autoconfigure-3.1.11.jar
[INFO] Downloading from B_shibboleth: https://build.shibboleth.net/nexus/content/groups/public/org/codehaus/plexus/plexus-classworlds/1.2-alpha-10/plexus-classworlds-1.2-alpha-10.jar
[INFO] Downloading from central: https://repo.maven.apache.org/maven2/org/springframework/boot/spring-boot-starter-web/3.1.11/spring-boot-starter-web-3.1.11.jar
[INFO] Downloaded from central: https://repo.maven.apache.org/maven2/org/springframework/boot/spring-boot-starter-web/3.1.11/spring-boot-starter-web-3.1.11.jar (4.8 kB at 70 kB/s)
[INFO] Downloading from central: https://repo.maven.apache.org/maven2/org/springframework/boot/spring-boot-starter/3.1.11/spring-boot-starter-3.1.11.jar
[INFO] Downloading from central: https://repo.maven.apache.org/maven2/org/springframework/boot/spring-boot/3.1.11/spring-boot-3.1.11.jar
[INFO] Downloading from central: https://repo.maven.apache.org/maven2/org/springframework/boot/spring-boot-autoconfigure/3.1.11/spring-boot-autoconfigure-3.1.11.jar
[INFO] Downloading from central: https://repo.maven.apache.org/maven2/org/springframework/boot/spring-boot-starter-logging/3.1.11/spring-boot-starter-logging-3.1.11.jar
[INFO] Downloading from central: https://repo.maven.apache.org/maven2/org/springframework/boot/spring-boot-starter-json/3.1.11/spring-boot-starter-json-3.1.11.jar
[INFO] Downloaded from central: https://repo.maven.apache.org/maven2/org/springframework/boot/spring-boot-starter/3.1.11/spring-boot-starter-3.1.11.jar (4.8 kB at 69 kB/s)
[INFO] Downloading from central: https://repo.maven.apache.org/maven2/org/springframework/boot/spring-boot-starter-tomcat/3.1.11/spring-boot-starter-tomcat-3.1.11.jar
[INFO] Downloaded from central: https://repo.maven.apache.org/maven2/org/springframework/boot/spring-boot-starter-json/3.1.11/spring-boot-starter-json-3.1.11.jar (4.7 kB at 37 kB/s)
[INFO] Downloading from central: https://repo.maven.apache.org/maven2/org/springframework/boot/spring-boot-starter-test/3.1.11/spring-boot-starter-test-3.1.11.jar
[INFO] Downloaded from central: https://repo.maven.apache.org/maven2/org/springframework/boot/spring-boot-starter-logging/3.1.11/spring-boot-starter-logging-3.1.11.jar (4.8 kB at 37 kB/s)
[INFO] Downloading from central: https://repo.maven.apache.org/maven2/org/springframework/boot/spring-boot-test/3.1.11/spring-boot-test-3.1.11.jar
[INFO] Downloaded from central: https://repo.maven.apache.org/maven2/org/springframework/boot/spring-boot-starter-tomcat/3.1.11/spring-boot-starter-tomcat-3.1.11.jar (4.8 kB at 35 kB/s)
[INFO] Downloading from central: https://repo.maven.apache.org/maven2/org/springframework/boot/spring-boot-test-autoconfigure/3.1.11/spring-boot-test-autoconfigure-3.1.11.jar
[INFO] Downloaded from central: https://repo.maven.apache.org/maven2/org/springframework/boot/spring-boot-starter-test/3.1.11/spring-boot-starter-test-3.1.11.jar (4.8 kB at 24 kB/s)
[INFO] Downloading from central: https://repo.maven.apache.org/maven2/org/codehaus/plexus/plexus-classworlds/1.2-alpha-10/plexus-classworlds-1.2-alpha-10.jar
[INFO] Downloaded from central: https://repo.maven.apache.org/maven2/org/springframework/boot/spring-boot-test-autoconfigure/3.1.11/spring-boot-test-autoconfigure-3.1.11.jar (223 kB at 953 kB/s)
[INFO] Downloaded from central: https://repo.maven.apache.org/maven2/org/springframework/boot/spring-boot-test/3.1.11/spring-boot-test-3.1.11.jar (248 kB at 913 kB/s)
[INFO] Downloaded from central: https://repo.maven.apache.org/maven2/org/springframework/boot/spring-boot/3.1.11/spring-boot-3.1.11.jar (1.6 MB at 5.6 MB/s)
[INFO] Downloaded from central: https://repo.maven.apache.org/maven2/org/springframework/boot/spring-boot-autoconfigure/3.1.11/spring-boot-autoconfigure-3.1.11.jar (1.8 MB at 6.4 MB/s)
[INFO] Downloaded from central: https://repo.maven.apache.org/maven2/org/codehaus/plexus/plexus-classworlds/1.2-alpha-10/plexus-classworlds-1.2-alpha-10.jar (42 kB at 144 kB/s)
[INFO] 
[INFO] --- clean:3.2.0:clean (default-clean) @ spring-cxf-tomee-4332 ---
[INFO] 
[INFO] --- enforcer:3.0.0:enforce (enforce-maven-version) @ spring-cxf-tomee-4332 ---
[INFO] 
[INFO] --- enforcer:3.0.0:enforce (enforce-java-version) @ spring-cxf-tomee-4332 ---
[INFO] 
[INFO] --- remote-resources:1.5:process (process-resource-bundles) @ spring-cxf-tomee-4332 ---
[INFO] 
[INFO] --- resources:3.0.2:resources (default-resources) @ spring-cxf-tomee-4332 ---
[INFO] Using 'UTF-8' encoding to copy filtered resources.
[INFO] Copying 1 resource
[INFO] Copying 3 resources
[INFO] 
[INFO] --- compiler:3.6.2:compile (default-compile) @ spring-cxf-tomee-4332 ---
[INFO] Changes detected - recompiling the module!
[INFO] Compiling 4 source files to <https://ci-builds.apache.org/job/Tomee/job/tomee-9.x-build-full/org.apache.tomee$spring-cxf-tomee-4332/ws/target/classes>
[INFO] -------------------------------------------------------------
[ERROR] COMPILATION ERROR : 
[INFO] -------------------------------------------------------------
[ERROR] <https://ci-builds.apache.org/job/Tomee/job/tomee-9.x-build-full/org.apache.tomee$spring-cxf-tomee-4332/ws/src/main/java/org/example/spring/ServletInitializer.java>:[19,39] error: cannot access SpringApplicationBuilder
  bad class file: /home/jenkins/.m2/repository/org/springframework/boot/spring-boot/3.1.11/spring-boot-3.1.11.jar(/org/springframework/boot/builder/SpringApplicationBuilder.class)
    class file has wrong version 61.0, should be 55.0
    Please remove or make sure it appears in the correct subdirectory of the classpath.
[ERROR] <https://ci-builds.apache.org/job/Tomee/job/tomee-9.x-build-full/org.apache.tomee$spring-cxf-tomee-4332/ws/src/main/java/org/example/spring/ServletInitializer.java>:[20,51] error: cannot access SpringBootServletInitializer
  bad class file: /home/jenkins/.m2/repository/org/springframework/boot/spring-boot/3.1.11/spring-boot-3.1.11.jar(/org/springframework/boot/web/servlet/support/SpringBootServletInitializer.class)
    class file has wrong version 61.0, should be 55.0
    Please remove or make sure it appears in the correct subdirectory of the classpath.
[ERROR] <https://ci-builds.apache.org/job/Tomee/job/tomee-9.x-build-full/org.apache.tomee$spring-cxf-tomee-4332/ws/src/main/java/org/example/spring/ServletInitializer.java>:[22,40] error: cannot find symbol
  symbol: class SpringBootServletInitializer
[ERROR] <https://ci-builds.apache.org/job/Tomee/job/tomee-9.x-build-full/org.apache.tomee$spring-cxf-tomee-4332/ws/src/main/java/org/example/spring/ServletInitializer.java>:[25,46] error: cannot find symbol
  symbol:   class SpringApplicationBuilder
  location: class ServletInitializer
[ERROR] <https://ci-builds.apache.org/job/Tomee/job/tomee-9.x-build-full/org.apache.tomee$spring-cxf-tomee-4332/ws/src/main/java/org/example/spring/ServletInitializer.java>:[25,11] error: cannot find symbol
  symbol:   class SpringApplicationBuilder
  location: class ServletInitializer
[ERROR] <https://ci-builds.apache.org/job/Tomee/job/tomee-9.x-build-full/org.apache.tomee$spring-cxf-tomee-4332/ws/src/main/java/org/example/spring/DemoApplication.java>:[19,31] error: cannot access SpringApplication
  bad class file: /home/jenkins/.m2/repository/org/springframework/boot/spring-boot/3.1.11/spring-boot-3.1.11.jar(/org/springframework/boot/SpringApplication.class)
    class file has wrong version 61.0, should be 55.0
    Please remove or make sure it appears in the correct subdirectory of the classpath.
[ERROR] <https://ci-builds.apache.org/job/Tomee/job/tomee-9.x-build-full/org.apache.tomee$spring-cxf-tomee-4332/ws/src/main/java/org/example/spring/DemoApplication.java>:[20,45] error: cannot access SpringBootApplication
  bad class file: /home/jenkins/.m2/repository/org/springframework/boot/spring-boot-autoconfigure/3.1.11/spring-boot-autoconfigure-3.1.11.jar(/org/springframework/boot/autoconfigure/SpringBootApplication.class)
    class file has wrong version 61.0, should be 55.0
    Please remove or make sure it appears in the correct subdirectory of the classpath.
[ERROR] <https://ci-builds.apache.org/job/Tomee/job/tomee-9.x-build-full/org.apache.tomee$spring-cxf-tomee-4332/ws/src/main/java/org/example/spring/DemoApplication.java>:[22,1] error: cannot find symbol
  symbol: class SpringBootApplication
[ERROR] <https://ci-builds.apache.org/job/Tomee/job/tomee-9.x-build-full/org.apache.tomee$spring-cxf-tomee-4332/ws/src/main/java/org/example/spring/GreetingController.java>:[19,31] error: cannot access MediaType
  bad class file: /home/jenkins/.m2/repository/org/springframework/spring-web/6.0.19/spring-web-6.0.19.jar(/org/springframework/http/MediaType.class)
    class file has wrong version 61.0, should be 55.0
    Please remove or make sure it appears in the correct subdirectory of the classpath.
[ERROR] <https://ci-builds.apache.org/job/Tomee/job/tomee-9.x-build-full/org.apache.tomee$spring-cxf-tomee-4332/ws/src/main/java/org/example/spring/GreetingController.java>:[20,37] error: cannot access Controller
  bad class file: /home/jenkins/.m2/repository/org/springframework/spring-context/6.0.19/spring-context-6.0.19.jar(/org/springframework/stereotype/Controller.class)
    class file has wrong version 61.0, should be 55.0
    Please remove or make sure it appears in the correct subdirectory of the classpath.
[ERROR] <https://ci-builds.apache.org/job/Tomee/job/tomee-9.x-build-full/org.apache.tomee$spring-cxf-tomee-4332/ws/src/main/java/org/example/spring/GreetingController.java>:[21,46] error: cannot access GetMapping
  bad class file: /home/jenkins/.m2/repository/org/springframework/spring-web/6.0.19/spring-web-6.0.19.jar(/org/springframework/web/bind/annotation/GetMapping.class)
    class file has wrong version 61.0, should be 55.0
    Please remove or make sure it appears in the correct subdirectory of the classpath.
[ERROR] <https://ci-builds.apache.org/job/Tomee/job/tomee-9.x-build-full/org.apache.tomee$spring-cxf-tomee-4332/ws/src/main/java/org/example/spring/GreetingController.java>:[22,46] error: cannot access RequestMapping
  bad class file: /home/jenkins/.m2/repository/org/springframework/spring-web/6.0.19/spring-web-6.0.19.jar(/org/springframework/web/bind/annotation/RequestMapping.class)
    class file has wrong version 61.0, should be 55.0
    Please remove or make sure it appears in the correct subdirectory of the classpath.
[ERROR] <https://ci-builds.apache.org/job/Tomee/job/tomee-9.x-build-full/org.apache.tomee$spring-cxf-tomee-4332/ws/src/main/java/org/example/spring/GreetingController.java>:[23,46] error: cannot access ResponseBody
  bad class file: /home/jenkins/.m2/repository/org/springframework/spring-web/6.0.19/spring-web-6.0.19.jar(/org/springframework/web/bind/annotation/ResponseBody.class)
    class file has wrong version 61.0, should be 55.0
    Please remove or make sure it appears in the correct subdirectory of the classpath.
[ERROR] <https://ci-builds.apache.org/job/Tomee/job/tomee-9.x-build-full/org.apache.tomee$spring-cxf-tomee-4332/ws/src/main/java/org/example/spring/GreetingController.java>:[25,1] error: cannot find symbol
  symbol: class Controller
[ERROR] <https://ci-builds.apache.org/job/Tomee/job/tomee-9.x-build-full/org.apache.tomee$spring-cxf-tomee-4332/ws/src/main/java/org/example/spring/GreetingController.java>:[26,1] error: cannot find symbol
  symbol: class RequestMapping
[ERROR] <https://ci-builds.apache.org/job/Tomee/job/tomee-9.x-build-full/org.apache.tomee$spring-cxf-tomee-4332/ws/src/main/java/org/example/spring/GreetingController.java>:[29,5] error: cannot find symbol
  symbol:   class GetMapping
  location: class GreetingController
[ERROR] <https://ci-builds.apache.org/job/Tomee/job/tomee-9.x-build-full/org.apache.tomee$spring-cxf-tomee-4332/ws/src/main/java/org/example/spring/GreetingController.java>:[29,27] error: cannot find symbol
  symbol:   variable MediaType
  location: class GreetingController
[ERROR] <https://ci-builds.apache.org/job/Tomee/job/tomee-9.x-build-full/org.apache.tomee$spring-cxf-tomee-4332/ws/src/main/java/org/example/spring/GreetingController.java>:[30,5] error: cannot find symbol
  symbol:   class ResponseBody
  location: class GreetingController
[ERROR] <https://ci-builds.apache.org/job/Tomee/job/tomee-9.x-build-full/org.apache.tomee$spring-cxf-tomee-4332/ws/src/main/java/org/example/spring/ServletInitializer.java>:[24,1] error: method does not override or implement a method from a supertype
[ERROR] <https://ci-builds.apache.org/job/Tomee/job/tomee-9.x-build-full/org.apache.tomee$spring-cxf-tomee-4332/ws/src/main/java/org/example/spring/DemoApplication.java>:[26,2] error: cannot find symbol
  symbol:   variable SpringApplication
  location: class DemoApplication
[INFO] 20 errors 
[INFO] -------------------------------------------------------------

Build failed in Jenkins: TomEE » tomee-9.x-build-full » TomEE :: Arquillian :: Functional Tests :: Spring CXF Test #701

Posted by Apache Jenkins Server <je...@builds.apache.org>.
See <https://ci-builds.apache.org/job/Tomee/job/tomee-9.x-build-full/org.apache.tomee$spring-cxf-tomee-4332/701/display/redirect>

Changes:


------------------------------------------
[INFO] 
[INFO] ---------------< org.apache.tomee:spring-cxf-tomee-4332 >---------------
[INFO] Building TomEE :: Arquillian :: Functional Tests :: Spring CXF Test 9.1.4-SNAPSHOT [338/346]
[INFO]   from arquillian/functional-tests/spring-cxf-tomee-4332/pom.xml
[INFO] --------------------------------[ war ]---------------------------------
[INFO] Downloading from apache-plugin-release: https://repository.apache.org/content/repositories/releases/org/springframework/boot/spring-boot-maven-plugin/maven-metadata.xml
[INFO] Downloading from Nexus: https://repository.apache.org/snapshots/org/springframework/boot/spring-boot-maven-plugin/maven-metadata.xml
[INFO] Downloading from central: https://repo.maven.apache.org/maven2/org/springframework/boot/spring-boot-maven-plugin/maven-metadata.xml
[INFO] Downloading from apache-plugin-snapshot: https://repository.apache.org/content/groups/snapshots/org/springframework/boot/spring-boot-maven-plugin/maven-metadata.xml
[INFO] Downloaded from central: https://repo.maven.apache.org/maven2/org/springframework/boot/spring-boot-maven-plugin/maven-metadata.xml (8.6 kB at 87 kB/s)
[INFO] 
[INFO] --- clean:3.2.0:clean (default-clean) @ spring-cxf-tomee-4332 ---
[INFO] 
[INFO] --- enforcer:3.0.0:enforce (enforce-maven-version) @ spring-cxf-tomee-4332 ---
[INFO] 
[INFO] --- enforcer:3.0.0:enforce (enforce-java-version) @ spring-cxf-tomee-4332 ---
[INFO] 
[INFO] --- remote-resources:1.5:process (process-resource-bundles) @ spring-cxf-tomee-4332 ---
[INFO] 
[INFO] --- resources:3.0.2:resources (default-resources) @ spring-cxf-tomee-4332 ---
[INFO] Using 'UTF-8' encoding to copy filtered resources.
[INFO] Copying 1 resource
[INFO] Copying 3 resources
[INFO] 
[INFO] --- compiler:3.6.2:compile (default-compile) @ spring-cxf-tomee-4332 ---
[INFO] Changes detected - recompiling the module!
[INFO] Compiling 4 source files to <https://ci-builds.apache.org/job/Tomee/job/tomee-9.x-build-full/org.apache.tomee$spring-cxf-tomee-4332/ws/target/classes>
[INFO] -------------------------------------------------------------
[ERROR] COMPILATION ERROR : 
[INFO] -------------------------------------------------------------
[ERROR] <https://ci-builds.apache.org/job/Tomee/job/tomee-9.x-build-full/org.apache.tomee$spring-cxf-tomee-4332/ws/src/main/java/org/example/spring/ServletInitializer.java>:[19,39] error: cannot access SpringApplicationBuilder
  bad class file: /home/jenkins/.m2/repository/org/springframework/boot/spring-boot/3.1.11/spring-boot-3.1.11.jar(/org/springframework/boot/builder/SpringApplicationBuilder.class)
    class file has wrong version 61.0, should be 55.0
    Please remove or make sure it appears in the correct subdirectory of the classpath.
[ERROR] <https://ci-builds.apache.org/job/Tomee/job/tomee-9.x-build-full/org.apache.tomee$spring-cxf-tomee-4332/ws/src/main/java/org/example/spring/ServletInitializer.java>:[20,51] error: cannot access SpringBootServletInitializer
  bad class file: /home/jenkins/.m2/repository/org/springframework/boot/spring-boot/3.1.11/spring-boot-3.1.11.jar(/org/springframework/boot/web/servlet/support/SpringBootServletInitializer.class)
    class file has wrong version 61.0, should be 55.0
    Please remove or make sure it appears in the correct subdirectory of the classpath.
[ERROR] <https://ci-builds.apache.org/job/Tomee/job/tomee-9.x-build-full/org.apache.tomee$spring-cxf-tomee-4332/ws/src/main/java/org/example/spring/ServletInitializer.java>:[22,40] error: cannot find symbol
  symbol: class SpringBootServletInitializer
[ERROR] <https://ci-builds.apache.org/job/Tomee/job/tomee-9.x-build-full/org.apache.tomee$spring-cxf-tomee-4332/ws/src/main/java/org/example/spring/ServletInitializer.java>:[25,46] error: cannot find symbol
  symbol:   class SpringApplicationBuilder
  location: class ServletInitializer
[ERROR] <https://ci-builds.apache.org/job/Tomee/job/tomee-9.x-build-full/org.apache.tomee$spring-cxf-tomee-4332/ws/src/main/java/org/example/spring/ServletInitializer.java>:[25,11] error: cannot find symbol
  symbol:   class SpringApplicationBuilder
  location: class ServletInitializer
[ERROR] <https://ci-builds.apache.org/job/Tomee/job/tomee-9.x-build-full/org.apache.tomee$spring-cxf-tomee-4332/ws/src/main/java/org/example/spring/DemoApplication.java>:[19,31] error: cannot access SpringApplication
  bad class file: /home/jenkins/.m2/repository/org/springframework/boot/spring-boot/3.1.11/spring-boot-3.1.11.jar(/org/springframework/boot/SpringApplication.class)
    class file has wrong version 61.0, should be 55.0
    Please remove or make sure it appears in the correct subdirectory of the classpath.
[ERROR] <https://ci-builds.apache.org/job/Tomee/job/tomee-9.x-build-full/org.apache.tomee$spring-cxf-tomee-4332/ws/src/main/java/org/example/spring/DemoApplication.java>:[20,45] error: cannot access SpringBootApplication
  bad class file: /home/jenkins/.m2/repository/org/springframework/boot/spring-boot-autoconfigure/3.1.11/spring-boot-autoconfigure-3.1.11.jar(/org/springframework/boot/autoconfigure/SpringBootApplication.class)
    class file has wrong version 61.0, should be 55.0
    Please remove or make sure it appears in the correct subdirectory of the classpath.
[ERROR] <https://ci-builds.apache.org/job/Tomee/job/tomee-9.x-build-full/org.apache.tomee$spring-cxf-tomee-4332/ws/src/main/java/org/example/spring/DemoApplication.java>:[22,1] error: cannot find symbol
  symbol: class SpringBootApplication
[ERROR] <https://ci-builds.apache.org/job/Tomee/job/tomee-9.x-build-full/org.apache.tomee$spring-cxf-tomee-4332/ws/src/main/java/org/example/spring/GreetingController.java>:[19,31] error: cannot access MediaType
  bad class file: /home/jenkins/.m2/repository/org/springframework/spring-web/6.0.19/spring-web-6.0.19.jar(/org/springframework/http/MediaType.class)
    class file has wrong version 61.0, should be 55.0
    Please remove or make sure it appears in the correct subdirectory of the classpath.
[ERROR] <https://ci-builds.apache.org/job/Tomee/job/tomee-9.x-build-full/org.apache.tomee$spring-cxf-tomee-4332/ws/src/main/java/org/example/spring/GreetingController.java>:[20,37] error: cannot access Controller
  bad class file: /home/jenkins/.m2/repository/org/springframework/spring-context/6.0.19/spring-context-6.0.19.jar(/org/springframework/stereotype/Controller.class)
    class file has wrong version 61.0, should be 55.0
    Please remove or make sure it appears in the correct subdirectory of the classpath.
[ERROR] <https://ci-builds.apache.org/job/Tomee/job/tomee-9.x-build-full/org.apache.tomee$spring-cxf-tomee-4332/ws/src/main/java/org/example/spring/GreetingController.java>:[21,46] error: cannot access GetMapping
  bad class file: /home/jenkins/.m2/repository/org/springframework/spring-web/6.0.19/spring-web-6.0.19.jar(/org/springframework/web/bind/annotation/GetMapping.class)
    class file has wrong version 61.0, should be 55.0
    Please remove or make sure it appears in the correct subdirectory of the classpath.
[ERROR] <https://ci-builds.apache.org/job/Tomee/job/tomee-9.x-build-full/org.apache.tomee$spring-cxf-tomee-4332/ws/src/main/java/org/example/spring/GreetingController.java>:[22,46] error: cannot access RequestMapping
  bad class file: /home/jenkins/.m2/repository/org/springframework/spring-web/6.0.19/spring-web-6.0.19.jar(/org/springframework/web/bind/annotation/RequestMapping.class)
    class file has wrong version 61.0, should be 55.0
    Please remove or make sure it appears in the correct subdirectory of the classpath.
[ERROR] <https://ci-builds.apache.org/job/Tomee/job/tomee-9.x-build-full/org.apache.tomee$spring-cxf-tomee-4332/ws/src/main/java/org/example/spring/GreetingController.java>:[23,46] error: cannot access ResponseBody
  bad class file: /home/jenkins/.m2/repository/org/springframework/spring-web/6.0.19/spring-web-6.0.19.jar(/org/springframework/web/bind/annotation/ResponseBody.class)
    class file has wrong version 61.0, should be 55.0
    Please remove or make sure it appears in the correct subdirectory of the classpath.
[ERROR] <https://ci-builds.apache.org/job/Tomee/job/tomee-9.x-build-full/org.apache.tomee$spring-cxf-tomee-4332/ws/src/main/java/org/example/spring/GreetingController.java>:[25,1] error: cannot find symbol
  symbol: class Controller
[ERROR] <https://ci-builds.apache.org/job/Tomee/job/tomee-9.x-build-full/org.apache.tomee$spring-cxf-tomee-4332/ws/src/main/java/org/example/spring/GreetingController.java>:[26,1] error: cannot find symbol
  symbol: class RequestMapping
[ERROR] <https://ci-builds.apache.org/job/Tomee/job/tomee-9.x-build-full/org.apache.tomee$spring-cxf-tomee-4332/ws/src/main/java/org/example/spring/GreetingController.java>:[29,5] error: cannot find symbol
  symbol:   class GetMapping
  location: class GreetingController
[ERROR] <https://ci-builds.apache.org/job/Tomee/job/tomee-9.x-build-full/org.apache.tomee$spring-cxf-tomee-4332/ws/src/main/java/org/example/spring/GreetingController.java>:[29,27] error: cannot find symbol
  symbol:   variable MediaType
  location: class GreetingController
[ERROR] <https://ci-builds.apache.org/job/Tomee/job/tomee-9.x-build-full/org.apache.tomee$spring-cxf-tomee-4332/ws/src/main/java/org/example/spring/GreetingController.java>:[30,5] error: cannot find symbol
  symbol:   class ResponseBody
  location: class GreetingController
[ERROR] <https://ci-builds.apache.org/job/Tomee/job/tomee-9.x-build-full/org.apache.tomee$spring-cxf-tomee-4332/ws/src/main/java/org/example/spring/ServletInitializer.java>:[24,1] error: method does not override or implement a method from a supertype
[ERROR] <https://ci-builds.apache.org/job/Tomee/job/tomee-9.x-build-full/org.apache.tomee$spring-cxf-tomee-4332/ws/src/main/java/org/example/spring/DemoApplication.java>:[26,2] error: cannot find symbol
  symbol:   variable SpringApplication
  location: class DemoApplication
[INFO] 20 errors 
[INFO] -------------------------------------------------------------