You are viewing a plain text version of this content. The canonical link for it is here.
Posted to builds@solr.apache.org by Apache Jenkins Server <je...@builds.apache.org> on 2026/10/06 14:17:58 UTC
[JENKINS] Solr » Solr-Test-10.1 - Build # 78 - Unstable!
Build: https://ci-builds.apache.org/job/Solr/job/Solr-Test-10.1/78/
1 tests failed.
FAILED: org.apache.solr.search.TestReRankQParserPlugin.testMinExactCount
Error Message:
java.lang.AssertionError: REQUEST FAILED: xpath=//result/doc[2]/str[@name='id'][.='0']
xml response was: <?xml version="1.0" encoding="UTF-8"?>
<response>
<lst name="responseHeader"><int name="status">0</int><int name="QTime">1</int></lst><result name="response" numFound="200" start="0" maxScore="0.0011321187" numFoundExact="true"><doc><str name="id">10</str><float name="score">4.4537134</float></doc><doc><str name="id">11</str><float name="score">0.0011321187</float></doc><doc><str name="id">12</str><float name="score">0.0011321187</float></doc><doc><str name="id">13</str><float name="score">0.0011321187</float></doc><doc><str name="id">14</str><float name="score">0.0011321187</float></doc><doc><str name="id">15</str><float name="score">0.0011321187</float></doc><doc><str name="id">16</str><float name="score">0.0011321187</float></doc><doc><str name="id">17</str><float name="score">0.0011321187</float></doc><doc><str name="id">18</str><float name="score">0.0011321187</float></doc><doc><str name="id">19</str><float name="score">0.0011321187</float></doc></result>
</response>
request was:q=field_t:0&start=0&rows=10&fl=id,score&sort=score+desc,+id_p_i+asc&rq={!rerank+reRankQuery%3D$rrq+reRankDocs%3D20}&rrq=id:10
Stack Trace:
java.lang.AssertionError: REQUEST FAILED: xpath=//result/doc[2]/str[@name='id'][.='0']
xml response was: <?xml version="1.0" encoding="UTF-8"?>
<response>
<lst name="responseHeader"><int name="status">0</int><int name="QTime">1</int></lst><result name="response" numFound="200" start="0" maxScore="0.0011321187" numFoundExact="true"><doc><str name="id">10</str><float name="score">4.4537134</float></doc><doc><str name="id">11</str><float name="score">0.0011321187</float></doc><doc><str name="id">12</str><float name="score">0.0011321187</float></doc><doc><str name="id">13</str><float name="score">0.0011321187</float></doc><doc><str name="id">14</str><float name="score">0.0011321187</float></doc><doc><str name="id">15</str><float name="score">0.0011321187</float></doc><doc><str name="id">16</str><float name="score">0.0011321187</float></doc><doc><str name="id">17</str><float name="score">0.0011321187</float></doc><doc><str name="id">18</str><float name="score">0.0011321187</float></doc><doc><str name="id">19</str><float name="score">0.0011321187</float></doc></result>
</response>
request was:q=field_t:0&start=0&rows=10&fl=id,score&sort=score+desc,+id_p_i+asc&rq={!rerank+reRankQuery%3D$rrq+reRankDocs%3D20}&rrq=id:10
at __randomizedtesting.SeedInfo.seed([3DDF7021B5204DEF:485F4AB95AFDB398]:0)
at org.junit.Assert.fail(Assert.java:89)
at org.apache.solr.SolrTestCaseJ4.assertQ(SolrTestCaseJ4.java:847)
at org.apache.solr.SolrTestCaseJ4.assertQ(SolrTestCaseJ4.java:811)
at org.apache.solr.search.TestReRankQParserPlugin.testMinExactCount(TestReRankQParserPlugin.java:1248)
at java.base/jdk.internal.reflect.DirectMethodHandleAccessor.invoke(DirectMethodHandleAccessor.java:103)
at java.base/java.lang.reflect.Method.invoke(Method.java:580)
at com.carrotsearch.randomizedtesting.RandomizedRunner.invoke(RandomizedRunner.java:1780)
at com.carrotsearch.randomizedtesting.RandomizedRunner$8.evaluate(RandomizedRunner.java:959)
at com.carrotsearch.randomizedtesting.RandomizedRunner$9.evaluate(RandomizedRunner.java:995)
at com.carrotsearch.randomizedtesting.RandomizedRunner$10.evaluate(RandomizedRunner.java:1009)
at com.carrotsearch.randomizedtesting.rules.SystemPropertiesRestoreRule$1.evaluate(SystemPropertiesRestoreRule.java:80)
at org.junit.rules.RunRules.evaluate(RunRules.java:20)
at org.apache.lucene.tests.util.TestRuleSetupTeardownChained$1.evaluate(TestRuleSetupTeardownChained.java:48)
at org.apache.lucene.tests.util.AbstractBeforeAfterRule$1.evaluate(AbstractBeforeAfterRule.java:43)
at org.apache.lucene.tests.util.TestRuleThreadAndTestName$1.evaluate(TestRuleThreadAndTestName.java:45)
at org.apache.lucene.tests.util.TestRuleIgnoreAfterMaxFailures$1.evaluate(TestRuleIgnoreAfterMaxFailures.java:60)
at org.apache.lucene.tests.util.TestRuleMarkFailure$1.evaluate(TestRuleMarkFailure.java:44)
at org.junit.rules.RunRules.evaluate(RunRules.java:20)
at com.carrotsearch.randomizedtesting.rules.StatementAdapter.evaluate(StatementAdapter.java:36)
at com.carrotsearch.randomizedtesting.ThreadLeakControl$StatementRunner.run(ThreadLeakControl.java:390)
at com.carrotsearch.randomizedtesting.ThreadLeakControl.forkTimeoutingTask(ThreadLeakControl.java:843)
at com.carrotsearch.randomizedtesting.ThreadLeakControl$3.evaluate(ThreadLeakControl.java:490)
at com.carrotsearch.randomizedtesting.RandomizedRunner.runSingleTest(RandomizedRunner.java:968)
at com.carrotsearch.randomizedtesting.RandomizedRunner$5.evaluate(RandomizedRunner.java:853)
at com.carrotsearch.randomizedtesting.RandomizedRunner$6.evaluate(RandomizedRunner.java:904)
at com.carrotsearch.randomizedtesting.RandomizedRunner$7.evaluate(RandomizedRunner.java:915)
at com.carrotsearch.randomizedtesting.rules.StatementAdapter.evaluate(StatementAdapter.java:36)
at com.carrotsearch.randomizedtesting.rules.StatementAdapter.evaluate(StatementAdapter.java:36)
at org.apache.lucene.tests.util.AbstractBeforeAfterRule$1.evaluate(AbstractBeforeAfterRule.java:43)
at com.carrotsearch.randomizedtesting.rules.SystemPropertiesRestoreRule$1.evaluate(SystemPropertiesRestoreRule.java:80)
at org.junit.rules.RunRules.evaluate(RunRules.java:20)
at org.apache.lucene.tests.util.AbstractBeforeAfterRule$1.evaluate(AbstractBeforeAfterRule.java:43)
at com.carrotsearch.randomizedtesting.rules.StatementAdapter.evaluate(StatementAdapter.java:36)
at org.apache.lucene.tests.util.TestRuleStoreClassName$1.evaluate(TestRuleStoreClassName.java:38)
at com.carrotsearch.randomizedtesting.rules.NoShadowingOrOverridesOnMethodsRule$1.evaluate(NoShadowingOrOverridesOnMethodsRule.java:40)
at com.carrotsearch.randomizedtesting.rules.NoShadowingOrOverridesOnMethodsRule$1.evaluate(NoShadowingOrOverridesOnMethodsRule.java:40)
at com.carrotsearch.randomizedtesting.rules.StatementAdapter.evaluate(StatementAdapter.java:36)
at com.carrotsearch.randomizedtesting.rules.StatementAdapter.evaluate(StatementAdapter.java:36)
at org.apache.lucene.tests.util.TestRuleAssertionsRequired$1.evaluate(TestRuleAssertionsRequired.java:53)
at org.apache.lucene.tests.util.AbstractBeforeAfterRule$1.evaluate(AbstractBeforeAfterRule.java:43)
at org.apache.lucene.tests.util.TestRuleMarkFailure$1.evaluate(TestRuleMarkFailure.java:44)
at org.apache.lucene.tests.util.TestRuleIgnoreAfterMaxFailures$1.evaluate(TestRuleIgnoreAfterMaxFailures.java:60)
at org.apache.lucene.tests.util.TestRuleIgnoreTestSuites$1.evaluate(TestRuleIgnoreTestSuites.java:47)
at org.junit.rules.RunRules.evaluate(RunRules.java:20)
at com.carrotsearch.randomizedtesting.rules.StatementAdapter.evaluate(StatementAdapter.java:36)
at com.carrotsearch.randomizedtesting.ThreadLeakControl$StatementRunner.run(ThreadLeakControl.java:390)
at com.carrotsearch.randomizedtesting.ThreadLeakControl.lambda$forkTimeoutingTask$0(ThreadLeakControl.java:850)
at java.base/java.lang.Thread.run(Thread.java:1583)
Build Log:
[...truncated 11 lines...]
ERROR: Workspace has a .git repository, but it appears to be corrupt.
hudson.plugins.git.GitException: Command "git rev-parse --resolve-git-dir /home/jenkins/jenkins-agent/workspace/Solr/Solr-Test-10.1/.git" returned status code 128:
stdout:
stderr: fatal: not a gitdir '/home/jenkins/jenkins-agent/workspace/Solr/Solr-Test-10.1/.git'
at PluginClassLoader for git-client//org.jenkinsci.plugins.gitclient.CliGitAPIImpl.launchCommandIn(CliGitAPIImpl.java:2848)
at PluginClassLoader for git-client//org.jenkinsci.plugins.gitclient.CliGitAPIImpl.launchCommandIn(CliGitAPIImpl.java:2768)
at PluginClassLoader for git-client//org.jenkinsci.plugins.gitclient.CliGitAPIImpl.launchCommandIn(CliGitAPIImpl.java:2763)
at PluginClassLoader for git-client//org.jenkinsci.plugins.gitclient.CliGitAPIImpl.launchCommand(CliGitAPIImpl.java:2052)
at PluginClassLoader for git-client//org.jenkinsci.plugins.gitclient.CliGitAPIImpl.launchCommand(CliGitAPIImpl.java:2064)
at PluginClassLoader for git-client//org.jenkinsci.plugins.gitclient.CliGitAPIImpl.hasGitRepo(CliGitAPIImpl.java:404)
at PluginClassLoader for git-client//hudson.plugins.git.GitAPI.hasGitRepo(GitAPI.java:281)
at jdk.internal.reflect.GeneratedMethodAccessor34.invoke(Unknown Source)
at java.base/jdk.internal.reflect.DelegatingMethodAccessorImpl.invoke(DelegatingMethodAccessorImpl.java:43)
at java.base/java.lang.reflect.Method.invoke(Method.java:569)
at hudson.remoting.RemoteInvocationHandler$RPCRequest.perform(RemoteInvocationHandler.java:986)
at hudson.remoting.RemoteInvocationHandler$RPCRequest.call(RemoteInvocationHandler.java:961)
at hudson.remoting.RemoteInvocationHandler$RPCRequest.call(RemoteInvocationHandler.java:907)
at hudson.remoting.UserRequest.perform(UserRequest.java:225)
at hudson.remoting.UserRequest.perform(UserRequest.java:50)
at hudson.remoting.Request$2.run(Request.java:391)
at hudson.remoting.InterceptingExecutorService.lambda$wrap$0(InterceptingExecutorService.java:81)
at java.base/java.util.concurrent.FutureTask.run(FutureTask.java:264)
at java.base/java.util.concurrent.ThreadPoolExecutor.runWorker(ThreadPoolExecutor.java:1136)
at java.base/java.util.concurrent.ThreadPoolExecutor$Worker.run(ThreadPoolExecutor.java:635)
at java.base/java.lang.Thread.run(Thread.java:840)
Cloning the remote Git repository
Cloning repository https://gitbox.apache.org/repos/asf/solr.git
> git init /home/jenkins/jenkins-agent/workspace/Solr/Solr-Test-10.1 # timeout=10
Fetching upstream changes from https://gitbox.apache.org/repos/asf/solr.git
> git --version # timeout=10
> git --version # 'git version 2.43.0'
> git fetch --tags --force --progress -- https://gitbox.apache.org/repos/asf/solr.git +refs/heads/*:refs/remotes/origin/* # timeout=10
> git config remote.origin.url https://gitbox.apache.org/repos/asf/solr.git # timeout=10
> git config --add remote.origin.fetch +refs/heads/*:refs/remotes/origin/* # timeout=10
Avoid second fetch
> git rev-parse refs/remotes/origin/branch_10_1^{commit} # timeout=10
Checking out Revision ee956454b93750b0d4b07f234609376583ec7f38 (refs/remotes/origin/branch_10_1)
> git config core.sparsecheckout # timeout=10
> git checkout -f ee956454b93750b0d4b07f234609376583ec7f38 # timeout=10
> git branch -a -v --no-abbrev # timeout=10
> git checkout -b branch_10_1 ee956454b93750b0d4b07f234609376583ec7f38 # timeout=10
Commit message: "Update CHANGELOG."
> git rev-list --no-walk 4c6dd37120240b5f85d88217e83eeadaf13af554 # timeout=10
No emails were triggered.
provisioning config files...
copy managed file [gradle.properties] to file:/home/jenkins/jenkins-agent/workspace/Solr/Solr-Test-10.1/gradle.properties
[Gradle] - Launching build.
[Solr-Test-10.1] $ /home/jenkins/jenkins-agent/workspace/Solr/Solr-Test-10.1/gradlew -Dtests.haltonfailure=false -Dtests.badapples=false --continue test
Downloading gradle-wrapper.jar from https://raw.githubusercontent.com/gradle/gradle/v8.10.2/gradle/wrapper/gradle-wrapper.jar
To honour the JVM settings for this build a single-use Daemon process will be forked. For more on this, please refer to https://docs.gradle.org/9.7.0/userguide/gradle_daemon.html#sec:disabling_the_daemon in the Gradle documentation.
Daemon will be stopped at the end of the build
> Task :build-infra:compileJava
Note: /home/jenkins/jenkins-agent/workspace/Solr/Solr-Test-10.1/build-tools/build-infra/src/main/java/org/apache/lucene/gradle/Checksum.java uses or overrides a deprecated API.
Note: Recompile with -Xlint:deprecation for details.
> Task :build-infra:pluginDescriptors
> Task :build-infra:processResources
> Task :build-infra:classes
> Task :build-infra:jar
> Configure project :solr:webapp
WARNING: gradle.properties is missing solr.ui.commit and is not configured to build UI from source; falling back to build from source.
> Task :gitStatus
> Task :checkJdkInternalsExportedToGradle
> Task :solr:api:compileJava
Note: Some input files use or override a deprecated API.
Note: Recompile with -Xlint:deprecation for details.
> Task :solr:api:processResources NO-SOURCE
> Task :solr:api:classes
> Task :solr:api:jar
> Task :randomizationInfo
Running tests with randomization seed: tests.seed=3DDF7021B5204DEF
> Task :solr:api:resolve
> Task :solr:api:processTestResources
> Task :solr:core:processResources
> Task :solr:solrj:processResources
> Task :solr:solrj-jetty:processResources NO-SOURCE
> Task :solr:solrj-streaming:processResources
> Task :solr:solrj-zookeeper:processResources NO-SOURCE
> Task :solr:test-framework:processResources
> Task :solr:benchmark:processResources
> Task :solr:benchmark:processTestResources
> Task :solr:core:processTestResources
> Task :solr:modules:analysis-extras:processResources NO-SOURCE
> Task :solr:cross-dc-manager:processResources NO-SOURCE
> Task :solr:cross-dc-manager:processTestResources
> Task :solr:modules:cross-dc:processResources NO-SOURCE
> Task :solr:modules:opentelemetry:processResources NO-SOURCE
> Task :solr:server:compileJava SKIPPED
> Task :solr:server:processResources NO-SOURCE
> Task :solr:server:classes UP-TO-DATE
> Task :solr:server:compileTestJava NO-SOURCE
> Task :solr:server:processTestResources NO-SOURCE
> Task :solr:server:testClasses UP-TO-DATE
> Task :solr:server:test NO-SOURCE
> Task :solr:server:wipeTaskTemp
> Task :solr:solr-ref-guide:compileJava NO-SOURCE
> Task :solr:solr-ref-guide:processResources NO-SOURCE
> Task :solr:solr-ref-guide:classes UP-TO-DATE
> Task :solr:solr-ref-guide:copySolrjTestResources
> Task :solr:solr-ref-guide:processTestResources NO-SOURCE
> Task :solr:modules:sql:processResources
> Task :solr:solrj:processTestResources
> Task :solr:solrj-jetty:processTestResources
> Task :solr:solrj-streaming:processTestResources
> Task :solr:solrj-zookeeper:processTestResources
> Task :solr:test-framework:processTestResources
> Task :solr:solrj:openApiGenerate
Cleaned up output directory /home/jenkins/jenkins-agent/workspace/Solr/Solr-Test-10.1/solr/solrj/build/generated before code generation.
[openApiGenerate] Worker isolation: classloader (fast startup, but generator classes accumulate in Gradle daemon Metaspace - consider workerIsolation = "process" if you hit metaspace pressure)
File (reserved word) cannot be used as model name. Renamed to ModelFile
############################################################################################
# Thanks for using OpenAPI Generator. #
# We appreciate your support! Please consider donating to help us maintain this project. #
# https://opencollective.com/openapi_generator/donate #
############################################################################################
Successfully generated code to /home/jenkins/jenkins-agent/workspace/Solr/Solr-Test-10.1/solr/solrj/build/generated
Type-safe project accessors is an incubating feature.
> Task :kotlinWasmKotlinNpmCachesSetup
> Task :kotlinWasmNodeJsSetup
> Task :kotlinWasmRestoreYarnLock
> Task :kotlinWasmYarnSetup
> Task :shared:wasmJsPackageJson
> Task :shared:wasmJsTestPackageJson
> Task :webApp:wasmJsPackageJson
> Task :webApp:wasmJsTestPackageJson
> Task :shared:wasmJsPublicPackageJson
> Task :shared:wasmJsTestPublicPackageJson
> Task :webApp:wasmJsPublicPackageJson
> Task :webApp:wasmJsTestPublicPackageJson
> Task :kotlinWasmPackageJsonUmbrella
> Task :wasmRootPackageJson
> Task :kotlinWasmNpmInstall
> Task :kotlinWasmToolingSetup
> Task :kotlinWasmStoreYarnLock
> Task :shared:convertXmlValueResourcesForCommonMain
> Task :shared:copyNonXmlValueResourcesForCommonMain
> Task :shared:prepareComposeResourcesTaskForCommonMain
> Task :shared:convertXmlValueResourcesForWasmJsMain NO-SOURCE
> Task :shared:copyNonXmlValueResourcesForWasmJsMain NO-SOURCE
> Task :shared:prepareComposeResourcesTaskForWasmJsMain NO-SOURCE
> Task :shared:convertXmlValueResourcesForWebMain NO-SOURCE
> Task :shared:copyNonXmlValueResourcesForWebMain NO-SOURCE
> Task :shared:prepareComposeResourcesTaskForWebMain NO-SOURCE
> Task :shared:assembleWasmJsMainResources
> Task :shared:wasmJsCopyHierarchicalMultiplatformResources
> Task :shared:wasmJsZipMultiplatformResourcesForPublication
> Task :webApp:wasmJsResolveResourcesFromDependencies
> Task :webApp:convertXmlValueResourcesForCommonMain NO-SOURCE
> Task :webApp:copyNonXmlValueResourcesForCommonMain NO-SOURCE
> Task :webApp:prepareComposeResourcesTaskForCommonMain NO-SOURCE
> Task :webApp:convertXmlValueResourcesForWasmJsMain NO-SOURCE
> Task :webApp:copyNonXmlValueResourcesForWasmJsMain NO-SOURCE
> Task :webApp:prepareComposeResourcesTaskForWasmJsMain NO-SOURCE
> Task :webApp:convertXmlValueResourcesForWebMain NO-SOURCE
> Task :webApp:copyNonXmlValueResourcesForWebMain NO-SOURCE
> Task :webApp:prepareComposeResourcesTaskForWebMain NO-SOURCE
> Task :webApp:assembleWasmJsMainResources
> Task :webApp:wasmJsResolveSelfResourcesCopyHierarchicalMultiplatformResources
> Task :webApp:wasmJsAggregateResources
> Task :webApp:wasmJsProcessResources
> Task :shared:kmpPartiallyResolvedDependenciesChecker
> Task :shared:checkKotlinGradlePluginConfigurationErrors SKIPPED
> Task :shared:checkWasmJsMainComposeLibrariesCompatibility
> Task :shared:generateResourceAccessorsForCommonMain
> Task :shared:generateResourceAccessorsForWasmJsMain NO-SOURCE
> Task :shared:generateResourceAccessorsForWebMain NO-SOURCE
> Task :shared:generateActualResourceCollectorsForWasmJsMain
> Task :shared:generateComposeResClass
> Task :shared:generateExpectResourceCollectorsForCommonMain
> Task :shared:compileKotlinWasmJs FROM-CACHE
> Task :webApp:kmpPartiallyResolvedDependenciesChecker
> Task :webApp:checkKotlinGradlePluginConfigurationErrors SKIPPED
> Task :webApp:checkWasmJsMainComposeLibrariesCompatibility
> Task :webApp:generateResourceAccessorsForCommonMain SKIPPED
> Task :webApp:generateResourceAccessorsForWasmJsMain SKIPPED
> Task :webApp:generateResourceAccessorsForWebMain SKIPPED
> Task :webApp:generateActualResourceCollectorsForWasmJsMain SKIPPED
> Task :webApp:generateComposeResClass SKIPPED
> Task :webApp:generateExpectResourceCollectorsForCommonMain SKIPPED
> Task :webApp:compileKotlinWasmJs FROM-CACHE
> Task :webApp:wasmJsMainClasses
> Task :webApp:compileProductionExecutableKotlinWasmJs FROM-CACHE
> Task :webApp:kotlinWasmBinaryenSetup
> Task :solr:webapp:buildUiFromSource
> Task :webApp:compileProductionExecutableKotlinWasmJsOptimize
> Task :webApp:unpackSkikoWasmRuntime
> Task :webApp:processSkikoRuntimeForKWasm
> Task :webApp:wasmJsProductionExecutableCompileSync
> Task :webApp:wasmJsBrowserProductionWebpack FROM-CACHE
> Task :webApp:wasmJsBrowserDistribution
BUILD SUCCESSFUL in 1m 21s
45 actionable tasks: 41 executed, 4 from cache
> Task :solr:solrj:generatedSpotlessHelper
> Task :solr:solrj:generatedSpotless
> Task :solr:solrj:compileJava
Note: Some input files use or override a deprecated API.
Note: Recompile with -Xlint:deprecation for details.
> Task :solr:solrj-jetty:compileJava
Note: /home/jenkins/jenkins-agent/workspace/Solr/Solr-Test-10.1/solr/solrj-jetty/src/java/org/apache/solr/client/solrj/jetty/HttpJettySolrClient.java uses or overrides a deprecated API.
Note: Recompile with -Xlint:deprecation for details.
> Task :solr:solrj-streaming:compileJava
Note: Some input files use or override a deprecated API.
Note: Recompile with -Xlint:deprecation for details.
> Task :solr:solrj-zookeeper:compileJava
> Task :solr:core:compileJava
Note: Some input files use or override a deprecated API.
Note: Recompile with -Xlint:deprecation for details.
> Task :solr:test-framework:compileJava
Note: Some input files use or override a deprecated API.
Note: Recompile with -Xlint:deprecation for details.
> Task :solr:api:compileTestJava
> Task :solr:api:testClasses
> Task :solr:core:classes
> Task :solr:core:jar
> Task :solr:solrj:classes
> Task :solr:solrj:jar
> Task :solr:solrj-jetty:classes
> Task :solr:solrj-jetty:jar
> Task :solr:solrj-streaming:classes
> Task :solr:solrj-streaming:jar
> Task :solr:solrj-zookeeper:classes
> Task :solr:solrj-zookeeper:jar
> Task :solr:test-framework:classes
> Task :solr:test-framework:jar
> Task :solr:api:test
WARNING: Using incubator modules: jdk.incubator.vector
WARNING: Using incubator modules: jdk.incubator.vector
WARNING: A command line option has enabled the Security Manager
WARNING: The Security Manager is deprecated and will be removed in a future release
WARNING: A command line option has enabled the Security Manager
WARNING: The Security Manager is deprecated and will be removed in a future release
java.security.policy: error adding Permission, java.net.URLPermission:
java.util.ServiceConfigurationError: Locale provider adapter "CLDR"cannot be instantiated.
java.security.policy: error adding Permission, java.net.URLPermission:
java.util.ServiceConfigurationError: Locale provider adapter "CLDR"cannot be instantiated.
java.security.policy: error adding Permission, java.net.URLPermission:
java.util.ServiceConfigurationError: Locale provider adapter "CLDR"cannot be instantiated.
java.security.policy: error adding Permission, java.net.URLPermission:
java.util.ServiceConfigurationError: Locale provider adapter "CLDR"cannot be instantiated.
java.security.policy: error adding Permission, java.net.URLPermission:
java.util.ServiceConfigurationError: Locale provider adapter "CLDR"cannot be instantiated.
java.security.policy: error adding Permission, java.net.URLPermission:
java.util.ServiceConfigurationError: Locale provider adapter "CLDR"cannot be instantiated.
java.security.policy: error adding Permission, java.net.URLPermission:
java.util.ServiceConfigurationError: Locale provider adapter "CLDR"cannot be instantiated.
java.security.policy: error adding Permission, java.net.URLPermission:
java.util.ServiceConfigurationError: Locale provider adapter "CLDR"cannot be instantiated.
java.security.policy: error adding Permission, java.net.URLPermission:
java.util.ServiceConfigurationError: Locale provider adapter "CLDR"cannot be instantiated.
java.security.policy: error adding Permission, java.net.URLPermission:
java.util.ServiceConfigurationError: Locale provider adapter "CLDR"cannot be instantiated.
:solr:api:test (SUCCESS): 19 test(s)
> Task :solr:api:wipeTaskTemp
> Task :solr:benchmark:compileJava
> Task :solr:benchmark:classes
> Task :solr:benchmark:compileTestJava
> Task :solr:benchmark:testClasses
> Task :solr:benchmark:test
WARNING: Using incubator modules: jdk.incubator.vector
WARNING: Using incubator modules: jdk.incubator.vector
WARNING: Using incubator modules: jdk.incubator.vector
WARNING: A command line option has enabled the Security Manager
WARNING: The Security Manager is deprecated and will be removed in a future release
WARNING: A command line option has enabled the Security Manager
WARNING: The Security Manager is deprecated and will be removed in a future release
WARNING: A command line option has enabled the Security Manager
WARNING: The Security Manager is deprecated and will be removed in a future release
java.security.policy: error adding Permission, java.net.URLPermission:
java.util.ServiceConfigurationError: Locale provider adapter "CLDR"cannot be instantiated.
java.security.policy: error adding Permission, java.net.URLPermission:
java.util.ServiceConfigurationError: Locale provider adapter "CLDR"cannot be instantiated.
java.security.policy: error adding Permission, java.net.URLPermission:
java.util.ServiceConfigurationError: Locale provider adapter "CLDR"cannot be instantiated.
java.security.policy: error adding Permission, java.net.URLPermission:
java.util.ServiceConfigurationError: Locale provider adapter "CLDR"cannot be instantiated.
java.security.policy: error adding Permission, java.net.URLPermission:
java.util.ServiceConfigurationError: Locale provider adapter "CLDR"cannot be instantiated.
java.security.policy: error adding Permission, java.net.URLPermission:
java.util.ServiceConfigurationError: Locale provider adapter "CLDR"cannot be instantiated.
java.security.policy: error adding Permission, java.net.URLPermission:
java.util.ServiceConfigurationError: Locale provider adapter "CLDR"cannot be instantiated.
java.security.policy: error adding Permission, java.net.URLPermission:
java.util.ServiceConfigurationError: Locale provider adapter "CLDR"cannot be instantiated.
java.security.policy: error adding Permission, java.net.URLPermission:
java.util.ServiceConfigurationError: Locale provider adapter "CLDR"cannot be instantiated.
java.security.policy: error adding Permission, java.net.URLPermission:
java.util.ServiceConfigurationError: Locale provider adapter "CLDR"cannot be instantiated.
java.security.policy: error adding Permission, java.net.URLPermission:
java.util.ServiceConfigurationError: Locale provider adapter "CLDR"cannot be instantiated.
java.security.policy: error adding Permission, java.net.URLPermission:
java.util.ServiceConfigurationError: Locale provider adapter "CLDR"cannot be instantiated.
java.security.policy: error adding Permission, java.net.URLPermission:
java.util.ServiceConfigurationError: Locale provider adapter "CLDR"cannot be instantiated.
java.security.policy: error adding Permission, java.net.URLPermission:
java.util.ServiceConfigurationError: Locale provider adapter "CLDR"cannot be instantiated.
java.security.policy: error adding Permission, java.net.URLPermission:
java.util.ServiceConfigurationError: Locale provider adapter "CLDR"cannot be instantiated.
:solr:benchmark:test (SUCCESS): 10 test(s)
> Task :solr:benchmark:wipeTaskTemp
> Task :solr:core:compileTestJava
Note: Some input files use or override a deprecated API.
Note: Recompile with -Xlint:deprecation for details.
> Task :solr:core:testClasses
> Task :solr:modules:analysis-extras:compileJava
Note: /home/jenkins/jenkins-agent/workspace/Solr/Solr-Test-10.1/solr/modules/analysis-extras/src/java/org/apache/solr/schema/ICUCollationField.java uses or overrides a deprecated API.
Note: Recompile with -Xlint:deprecation for details.
> Task :solr:modules:analysis-extras:classes
> Task :solr:modules:analysis-extras:jar
> Task :solr:core:test
WARNING: Using incubator modules: jdk.incubator.vector
WARNING: Using incubator modules: jdk.incubator.vector
WARNING: Using incubator modules: jdk.incubator.vector
WARNING: Using incubator modules: jdk.incubator.vector
WARNING: A command line option has enabled the Security Manager
WARNING: The Security Manager is deprecated and will be removed in a future release
WARNING: A command line option has enabled the Security Manager
WARNING: The Security Manager is deprecated and will be removed in a future release
WARNING: A command line option has enabled the Security Manager
WARNING: The Security Manager is deprecated and will be removed in a future release
WARNING: A command line option has enabled the Security Manager
WARNING: The Security Manager is deprecated and will be removed in a future release
java.security.policy: error adding Permission, java.net.URLPermission:
java.util.ServiceConfigurationError: Locale provider adapter "CLDR"cannot be instantiated.
java.security.policy: error adding Permission, java.net.URLPermission:
java.util.ServiceConfigurationError: Locale provider adapter "CLDR"cannot be instantiated.
java.security.policy: error adding Permission, java.net.URLPermission:
java.util.ServiceConfigurationError: Locale provider adapter "CLDR"cannot be instantiated.
java.security.policy: error adding Permission, java.net.URLPermission:
java.util.ServiceConfigurationError: Locale provider adapter "CLDR"cannot be instantiated.
java.security.policy: error adding Permission, java.net.URLPermission:
java.security.policy: error adding Permission, java.net.URLPermission:
java.util.ServiceConfigurationError: Locale provider adapter "CLDR"cannot be instantiated.
java.util.ServiceConfigurationError: Locale provider adapter "CLDR"cannot be instantiated.
java.security.policy: error adding Permission, java.net.URLPermission:
java.security.policy: error adding Permission, java.net.URLPermission:
java.util.ServiceConfigurationError: Locale provider adapter "CLDR"cannot be instantiated.
java.util.ServiceConfigurationError: Locale provider adapter "CLDR"cannot be instantiated.
java.security.policy: error adding Permission, java.net.URLPermission:
java.util.ServiceConfigurationError: Locale provider adapter "CLDR"cannot be instantiated.
java.security.policy: error adding Permission, java.net.URLPermission:
java.security.policy: error adding Permission, java.net.URLPermission:
java.util.ServiceConfigurationError: Locale provider adapter "CLDR"cannot be instantiated.
java.util.ServiceConfigurationError: Locale provider adapter "CLDR"cannot be instantiated.
java.security.policy: error adding Permission, java.net.URLPermission:
java.util.ServiceConfigurationError: Locale provider adapter "CLDR"cannot be instantiated.
java.security.policy: error adding Permission, java.net.URLPermission:
java.util.ServiceConfigurationError: Locale provider adapter "CLDR"cannot be instantiated.
java.security.policy: error adding Permission, java.net.URLPermission:
java.util.ServiceConfigurationError: Locale provider adapter "CLDR"cannot be instantiated.
java.security.policy: error adding Permission, java.net.URLPermission:
java.util.ServiceConfigurationError: Locale provider adapter "CLDR"cannot be instantiated.
java.security.policy: error adding Permission, java.net.URLPermission:
java.util.ServiceConfigurationError: Locale provider adapter "CLDR"cannot be instantiated.
java.security.policy: error adding Permission, java.net.URLPermission:
java.util.ServiceConfigurationError: Locale provider adapter "CLDR"cannot be instantiated.
java.security.policy: error adding Permission, java.net.URLPermission:
java.util.ServiceConfigurationError: Locale provider adapter "CLDR"cannot be instantiated.
java.security.policy: error adding Permission, java.net.URLPermission:
java.util.ServiceConfigurationError: Locale provider adapter "CLDR"cannot be instantiated.
java.security.policy: error adding Permission, java.net.URLPermission:
java.util.ServiceConfigurationError: Locale provider adapter "CLDR"cannot be instantiated.
[57.560s][warning][jfr,system] Could not initialize JDK events. access denied ("java.lang.RuntimePermission" "accessClassInPackage.jdk.internal.event")
> Task :solr:core:test
WARNING: Test org.apache.solr.TestRandomFaceting wrote 23,668,689 bytes of output.
WARNING: Test org.apache.solr.cloud.TestStressCloudBlindAtomicUpdates wrote 11,493,722 bytes of output.
WARNING: Test org.apache.solr.cloud.TestRandomFlRTGCloud wrote 30,108,831 bytes of output.
[562.503s][warning][jfr,system] Could not initialize JDK events. access denied ("java.lang.RuntimePermission" "accessClassInPackage.jdk.internal.event")
[667.118s][warning][jfr,system] Could not initialize JDK events. access denied ("java.lang.RuntimePermission" "accessClassInPackage.jdk.internal.event")
[694.620s][warning][jfr,system] Could not initialize JDK events. access denied ("java.lang.RuntimePermission" "accessClassInPackage.jdk.internal.event")
> Task :solr:core:test
WARNING: Test org.apache.solr.search.TestRangeQuery wrote 15,544,420 bytes of output.
TestReRankQParserPlugin > testMinExactCount FAILED
java.lang.AssertionError: REQUEST FAILED: xpath=//result/doc[2]/str[@name='id'][.='0']
xml response was: <?xml version="1.0" encoding="UTF-8"?>
<response>
<lst name="responseHeader"><int name="status">0</int><int name="QTime">1</int></lst><result name="response" numFound="200" start="0" maxScore="0.0011321187" numFoundExact="true"><doc><str name="id">10</str><float name="score">4.4537134</float></doc><doc><str name="id">11</str><float name="score">0.0011321187</float></doc><doc><str name="id">12</str><float name="score">0.0011321187</float></doc><doc><str name="id">13</str><float name="score">0.0011321187</float></doc><doc><str name="id">14</str><float name="score">0.0011321187</float></doc><doc><str name="id">15</str><float name="score">0.0011321187</float></doc><doc><str name="id">16</str><float name="score">0.0011321187</float></doc><doc><str name="id">17</str><float name="score">0.0011321187</float></doc><doc><str name="id">18</str><float name="score">0.0011321187</float></doc><doc><str name="id">19</str><float name="score">0.0011321187</float></doc></result>
</response>
request was:q=field_t:0&start=0&rows=10&fl=id,score&sort=score+desc,+id_p_i+asc&rq={!rerank+reRankQuery%3D$rrq+reRankDocs%3D20}&rrq=id:10
at __randomizedtesting.SeedInfo.seed([3DDF7021B5204DEF:485F4AB95AFDB398]:0)
at org.junit.Assert.fail(Assert.java:89)
at org.apache.solr.SolrTestCaseJ4.assertQ(SolrTestCaseJ4.java:847)
at org.apache.solr.SolrTestCaseJ4.assertQ(SolrTestCaseJ4.java:811)
at org.apache.solr.search.TestReRankQParserPlugin.testMinExactCount(TestReRankQParserPlugin.java:1248)
at java.base/jdk.internal.reflect.DirectMethodHandleAccessor.invoke(DirectMethodHandleAccessor.java:103)
at java.base/java.lang.reflect.Method.invoke(Method.java:580)
at com.carrotsearch.randomizedtesting.RandomizedRunner.invoke(RandomizedRunner.java:1780)
at com.carrotsearch.randomizedtesting.RandomizedRunner$8.evaluate(RandomizedRunner.java:959)
at com.carrotsearch.randomizedtesting.RandomizedRunner$9.evaluate(RandomizedRunner.java:995)
at com.carrotsearch.randomizedtesting.RandomizedRunner$10.evaluate(RandomizedRunner.java:1009)
at com.carrotsearch.randomizedtesting.rules.SystemPropertiesRestoreRule$1.evaluate(SystemPropertiesRestoreRule.java:80)
at org.junit.rules.RunRules.evaluate(RunRules.java:20)
at org.apache.lucene.tests.util.TestRuleSetupTeardownChained$1.evaluate(TestRuleSetupTeardownChained.java:48)
at org.apache.lucene.tests.util.AbstractBeforeAfterRule$1.evaluate(AbstractBeforeAfterRule.java:43)
at org.apache.lucene.tests.util.TestRuleThreadAndTestName$1.evaluate(TestRuleThreadAndTestName.java:45)
at org.apache.lucene.tests.util.TestRuleIgnoreAfterMaxFailures$1.evaluate(TestRuleIgnoreAfterMaxFailures.java:60)
at org.apache.lucene.tests.util.TestRuleMarkFailure$1.evaluate(TestRuleMarkFailure.java:44)
at org.junit.rules.RunRules.evaluate(RunRules.java:20)
at com.carrotsearch.randomizedtesting.rules.StatementAdapter.evaluate(StatementAdapter.java:36)
at com.carrotsearch.randomizedtesting.ThreadLeakControl$StatementRunner.run(ThreadLeakControl.java:390)
at com.carrotsearch.randomizedtesting.ThreadLeakControl.forkTimeoutingTask(ThreadLeakControl.java:843)
at com.carrotsearch.randomizedtesting.ThreadLeakControl$3.evaluate(ThreadLeakControl.java:490)
at com.carrotsearch.randomizedtesting.RandomizedRunner.runSingleTest(RandomizedRunner.java:968)
at com.carrotsearch.randomizedtesting.RandomizedRunner$5.evaluate(RandomizedRunner.java:853)
at com.carrotsearch.randomizedtesting.RandomizedRunner$6.evaluate(RandomizedRunner.java:904)
at com.carrotsearch.randomizedtesting.RandomizedRunner$7.evaluate(RandomizedRunner.java:915)
at com.carrotsearch.randomizedtesting.rules.StatementAdapter.evaluate(StatementAdapter.java:36)
at com.carrotsearch.randomizedtesting.rules.StatementAdapter.evaluate(StatementAdapter.java:36)
at org.apache.lucene.tests.util.AbstractBeforeAfterRule$1.evaluate(AbstractBeforeAfterRule.java:43)
at com.carrotsearch.randomizedtesting.rules.SystemPropertiesRestoreRule$1.evaluate(SystemPropertiesRestoreRule.java:80)
at org.junit.rules.RunRules.evaluate(RunRules.java:20)
at org.apache.lucene.tests.util.AbstractBeforeAfterRule$1.evaluate(AbstractBeforeAfterRule.java:43)
at com.carrotsearch.randomizedtesting.rules.StatementAdapter.evaluate(StatementAdapter.java:36)
at org.apache.lucene.tests.util.TestRuleStoreClassName$1.evaluate(TestRuleStoreClassName.java:38)
at com.carrotsearch.randomizedtesting.rules.NoShadowingOrOverridesOnMethodsRule$1.evaluate(NoShadowingOrOverridesOnMethodsRule.java:40)
at com.carrotsearch.randomizedtesting.rules.NoShadowingOrOverridesOnMethodsRule$1.evaluate(NoShadowingOrOverridesOnMethodsRule.java:40)
at com.carrotsearch.randomizedtesting.rules.StatementAdapter.evaluate(StatementAdapter.java:36)
at com.carrotsearch.randomizedtesting.rules.StatementAdapter.evaluate(StatementAdapter.java:36)
at org.apache.lucene.tests.util.TestRuleAssertionsRequired$1.evaluate(TestRuleAssertionsRequired.java:53)
at org.apache.lucene.tests.util.AbstractBeforeAfterRule$1.evaluate(AbstractBeforeAfterRule.java:43)
at org.apache.lucene.tests.util.TestRuleMarkFailure$1.evaluate(TestRuleMarkFailure.java:44)
at org.apache.lucene.tests.util.TestRuleIgnoreAfterMaxFailures$1.evaluate(TestRuleIgnoreAfterMaxFailures.java:60)
at org.apache.lucene.tests.util.TestRuleIgnoreTestSuites$1.evaluate(TestRuleIgnoreTestSuites.java:47)
at org.junit.rules.RunRules.evaluate(RunRules.java:20)
at com.carrotsearch.randomizedtesting.rules.StatementAdapter.evaluate(StatementAdapter.java:36)
at com.carrotsearch.randomizedtesting.ThreadLeakControl$StatementRunner.run(ThreadLeakControl.java:390)
at com.carrotsearch.randomizedtesting.ThreadLeakControl.lambda$forkTimeoutingTask$0(ThreadLeakControl.java:850)
at java.base/java.lang.Thread.run(Thread.java:1583)
org.apache.solr.search.TestReRankQParserPlugin > test suite's output saved to /home/jenkins/jenkins-agent/workspace/Solr/Solr-Test-10.1/solr/core/build/test-results/test/outputs/OUTPUT-org.apache.solr.search.TestReRankQParserPlugin.txt, copied below:
2> 964585 INFO (SUITE-TestReRankQParserPlugin-seed#[3DDF7021B5204DEF]-worker) [] o.a.s.SolrTestCase Setting 'solr.configset.default.confdir' system property to test-framework derived value of '/home/jenkins/jenkins-agent/workspace/Solr/Solr-Test-10.1/solr/server/solr/configsets/_default/conf'
2> 964585 INFO (SUITE-TestReRankQParserPlugin-seed#[3DDF7021B5204DEF]-worker) [] o.a.s.SolrTestCaseJ4 Created dataDir: /home/jenkins/jenkins-agent/workspace/Solr/Solr-Test-10.1/solr/core/build/tmp/tests-tmp/org.apache.solr.search.TestReRankQParserPlugin_3DDF7021B5204DEF-001/data-dir-215-001
2> 964585 WARN (SUITE-TestReRankQParserPlugin-seed#[3DDF7021B5204DEF]-worker) [] o.a.s.SolrTestCaseJ4 startTrackingSearchers: numOpens=2 numCloses=2
2> 964585 INFO (SUITE-TestReRankQParserPlugin-seed#[3DDF7021B5204DEF]-worker) [] o.a.s.u.ErrorLogMuter Creating ErrorLogMuter-regex-263 for ERROR logs matching regex: ignore_exception
2> 964586 INFO (SUITE-TestReRankQParserPlugin-seed#[3DDF7021B5204DEF]-worker) [] o.a.s.SolrTestCaseJ4 Using PointFields (NUMERIC_POINTS_SYSPROP=true) w/NUMERIC_DOCVALUES_SYSPROP=false
2> 964587 INFO (SUITE-TestReRankQParserPlugin-seed#[3DDF7021B5204DEF]-worker) [] o.a.s.SolrTestCaseJ4 Randomized ssl (true) and clientAuth (true) via: @org.apache.solr.util.RandomizeSSL(reason="", value=0.0/0.0, ssl=0.0/0.0, clientAuth=0.0/0.0)
2> 964587 INFO (SUITE-TestReRankQParserPlugin-seed#[3DDF7021B5204DEF]-worker) [] o.a.s.SolrTestCaseJ4 SecureRandom sanity checks: test.solr.allowed.securerandom=null & java.security.egd=file:/dev/./urandom
2> 964587 INFO (SUITE-TestReRankQParserPlugin-seed#[3DDF7021B5204DEF]-worker) [] o.a.s.SolrTestCaseJ4 ####initCore
2> 964590 INFO (SUITE-TestReRankQParserPlugin-seed#[3DDF7021B5204DEF]-worker) [] o.a.s.c.SolrResourceLoader Added lib dirs to classloader: [/home/jenkins/jenkins-agent/workspace/Solr/Solr-Test-10.1/solr/core/build/resources/test/solr/collection1/lib, /home/jenkins/jenkins-agent/workspace/Solr/Solr-Test-10.1/solr/core/build/resources/test/solr/collection1/lib/classes]
2> 964605 WARN (SUITE-TestReRankQParserPlugin-seed#[3DDF7021B5204DEF]-worker) [] o.a.s.c.SolrConfig solrconfig.xml: <boolTofilterOptimizer> is currently not implemented and has no effect.
2> 964618 INFO (SUITE-TestReRankQParserPlugin-seed#[3DDF7021B5204DEF]-worker) [] o.a.s.s.IndexSchema Loaded schema example/1.1 with uniqueid field id
2> 964624 INFO (SUITE-TestReRankQParserPlugin-seed#[3DDF7021B5204DEF]-worker) [] o.a.s.c.OpenTelemetryConfigurator OpenTelemetry loaded with simple propagation only.
2> 964624 INFO (SUITE-TestReRankQParserPlugin-seed#[3DDF7021B5204DEF]-worker) [] o.a.s.m.OtelRuntimeJvmMetrics JVM metrics are disabled
2> 966429 WARN (SUITE-TestReRankQParserPlugin-seed#[3DDF7021B5204DEF]-worker) [] o.e.j.u.s.S.config Trusting all certificates configured for Client@3b0cde93[provider=null,keyStore=null,trustStore=null]
2> 966429 WARN (SUITE-TestReRankQParserPlugin-seed#[3DDF7021B5204DEF]-worker) [] o.e.j.u.s.S.config No Client EndPointIdentificationAlgorithm configured for Client@3b0cde93[provider=null,keyStore=null,trustStore=null]
2> 966431 WARN (SUITE-TestReRankQParserPlugin-seed#[3DDF7021B5204DEF]-worker) [] o.e.j.u.s.S.config Trusting all certificates configured for Client@19ae51a0[provider=null,keyStore=null,trustStore=null]
2> 966431 WARN (SUITE-TestReRankQParserPlugin-seed#[3DDF7021B5204DEF]-worker) [] o.e.j.u.s.S.config No Client EndPointIdentificationAlgorithm configured for Client@19ae51a0[provider=null,keyStore=null,trustStore=null]
2> 966432 WARN (SUITE-TestReRankQParserPlugin-seed#[3DDF7021B5204DEF]-worker) [] o.e.j.u.s.S.config Trusting all certificates configured for Client@251150e8[provider=null,keyStore=null,trustStore=null]
2> 966432 WARN (SUITE-TestReRankQParserPlugin-seed#[3DDF7021B5204DEF]-worker) [] o.e.j.u.s.S.config No Client EndPointIdentificationAlgorithm configured for Client@251150e8[provider=null,keyStore=null,trustStore=null]
2> 966433 WARN (SUITE-TestReRankQParserPlugin-seed#[3DDF7021B5204DEF]-worker) [] o.e.j.u.s.S.config Trusting all certificates configured for Client@71c973bf[provider=null,keyStore=null,trustStore=null]
2> 966433 WARN (SUITE-TestReRankQParserPlugin-seed#[3DDF7021B5204DEF]-worker) [] o.e.j.u.s.S.config No Client EndPointIdentificationAlgorithm configured for Client@71c973bf[provider=null,keyStore=null,trustStore=null]
2> 966434 WARN (SUITE-TestReRankQParserPlugin-seed#[3DDF7021B5204DEF]-worker) [] o.a.s.c.CoreContainer Not all security plugins configured! authentication=disabled authorization=disabled. Solr is only as secure as you make it. Consider configuring authentication/authorization before exposing Solr to users internal or external. See https://s.apache.org/solrsecurity for more info
2> 966441 INFO (coreLoadExecutor-17420-thread-1) [ x:collection1] o.a.s.c.SolrResourceLoader Added lib dirs to classloader: [/home/jenkins/jenkins-agent/workspace/Solr/Solr-Test-10.1/solr/core/build/resources/test/solr/collection1/lib, /home/jenkins/jenkins-agent/workspace/Solr/Solr-Test-10.1/solr/core/build/resources/test/solr/collection1/lib/classes]
2> 966457 WARN (coreLoadExecutor-17420-thread-1) [ x:collection1] o.a.s.c.SolrConfig solrconfig.xml: <boolTofilterOptimizer> is currently not implemented and has no effect.
2> 966470 INFO (coreLoadExecutor-17420-thread-1) [ x:collection1] o.a.s.s.IndexSchema Loaded schema example/1.1 with uniqueid field id
2> 966476 INFO (coreLoadExecutor-17420-thread-1) [ x:collection1] o.a.s.c.CoreContainer Creating SolrCore 'collection1' using configuration from instancedir /home/jenkins/jenkins-agent/workspace/Solr/Solr-Test-10.1/solr/core/build/resources/test/solr/collection1
2> 966476 INFO (coreLoadExecutor-17420-thread-1) [ x:collection1] o.a.s.c.SolrCore Opening new SolrCore at [/home/jenkins/jenkins-agent/workspace/Solr/Solr-Test-10.1/solr/core/build/resources/test/solr/collection1], dataDir=[/home/jenkins/jenkins-agent/workspace/Solr/Solr-Test-10.1/solr/core/build/tmp/tests-tmp/org.apache.solr.search.TestReRankQParserPlugin_3DDF7021B5204DEF-001/data-dir-215-001/]
2> 966476 INFO (coreLoadExecutor-17420-thread-1) [ x:collection1] o.a.s.u.RandomMergePolicy RandomMergePolicy wrapping class org.apache.lucene.index.LogDocMergePolicy: [LogDocMergePolicy: minMergeSize=1000, mergeFactor=33, maxMergeSize=9223372036854775807, maxMergeSizeForForcedMerge=9223372036854775807, calibrateSizeByDeletes=true, maxMergeDocs=2147483647, maxCFSSegmentSizeMB=8.796093022208E12, noCFSRatio=0.35980928597405604]
2> 966505 INFO (coreLoadExecutor-17420-thread-1) [ x:collection1] o.a.s.u.UpdateLog Initializing UpdateLog: dataDir= defaultSyncLevel=FLUSH numRecordsToKeep=100 maxNumLogsToKeep=10
2> 966505 INFO (coreLoadExecutor-17420-thread-1) [ x:collection1] o.a.s.u.CommitTracker Hard AutoCommit: disabled
2> 966505 INFO (coreLoadExecutor-17420-thread-1) [ x:collection1] o.a.s.u.CommitTracker Soft AutoCommit: disabled
2> 966506 INFO (coreLoadExecutor-17420-thread-1) [ x:collection1] o.a.s.u.RandomMergePolicy RandomMergePolicy wrapping class org.apache.lucene.index.TieredMergePolicy: [TieredMergePolicy: maxMergeAtOnce=21, maxMergedSegmentMB=31.86946678161621, floorSegmentMB=0.688568115234375, forceMergeDeletesPctAllowed=10.080580587103253, segmentsPerTier=37.0, maxCFSSegmentSizeMB=8.796093022208E12, noCFSRatio=0.32356830536950254, deletesPctAllowed=42.27071000224098, targetSearchConcurrency=5
2> 966507 WARN (coreLoadExecutor-17420-thread-1) [ x:collection1] o.a.s.r.ManagedResourceStorage Cannot write to config directory /home/jenkins/jenkins-agent/workspace/Solr/Solr-Test-10.1/solr/core/build/resources/test/solr/collection1/conf ; switching to use InMemory storage instead.
2> 966509 INFO (coreLoadExecutor-17420-thread-1) [ x:collection1] o.a.s.h.ReplicationHandler Commits will be reserved for 10000 ms
2> 966509 INFO (searcherExecutor-17422-thread-1-processing-collection1) [ x:collection1] o.a.s.h.c.SpellCheckComponent Loading spell index for spellchecker: direct
2> 966509 INFO (searcherExecutor-17422-thread-1-processing-collection1) [ x:collection1] o.a.s.c.SolrCore Registered new searcher autowarm time: 0 ms
2> 966554 INFO (SUITE-TestReRankQParserPlugin-seed#[3DDF7021B5204DEF]-worker) [] o.a.s.SolrTestCaseJ4 ####initCore end
2> 966558 INFO (TEST-TestReRankQParserPlugin.testRerankQueryParsingShouldFailWithoutMandatoryReRankQueryParameter-seed#[3DDF7021B5204DEF]) [] o.a.s.SolrTestCaseJ4 ###Starting testRerankQueryParsingShouldFailWithoutMandatoryReRankQueryParameter
2> 966559 INFO (TEST-TestReRankQParserPlugin.testRerankQueryParsingShouldFailWithoutMandatoryReRankQueryParameter-seed#[3DDF7021B5204DEF]) [] o.a.s.u.DirectUpdateHandler2 REMOVING ALL DOCUMENTS FROM INDEX
2> 966559 INFO (TEST-TestReRankQParserPlugin.testRerankQueryParsingShouldFailWithoutMandatoryReRankQueryParameter-seed#[3DDF7021B5204DEF]) [] o.a.s.u.p.LogUpdateProcessorFactory {deleteByQuery=*:* (-9223372036854775807)} 0 0
2> 966560 INFO (searcherExecutor-17422-thread-1-processing-collection1) [ x:collection1] o.a.s.c.SolrCore Registered new searcher autowarm time: 0 ms
2> 966561 INFO (TEST-TestReRankQParserPlugin.testRerankQueryParsingShouldFailWithoutMandatoryReRankQueryParameter-seed#[3DDF7021B5204DEF]) [ x:collection1] o.a.s.u.p.LogUpdateProcessorFactory path=/update params={{params(wt=xml),defaults(wt=xml)}}{commit=} 0 1
2> 966562 INFO (TEST-TestReRankQParserPlugin.testRerankQueryParsingShouldFailWithoutMandatoryReRankQueryParameter-seed#[3DDF7021B5204DEF]) [ x:collection1] o.a.s.u.p.LogUpdateProcessorFactory path=/update params={{params(wt=xml),defaults(wt=xml)}}{deleteByQuery=*:* (-1878309140245250048)} 0 0
2> 966563 INFO (TEST-TestReRankQParserPlugin.testRerankQueryParsingShouldFailWithoutMandatoryReRankQueryParameter-seed#[3DDF7021B5204DEF]) [ x:collection1] o.a.s.u.p.LogUpdateProcessorFactory path=/update params={{params(wt=xml),defaults(wt=xml)}}{commit=} 0 0
2> 966564 INFO (TEST-TestReRankQParserPlugin.testRerankQueryParsingShouldFailWithoutMandatoryReRankQueryParameter-seed#[3DDF7021B5204DEF]) [ x:collection1] o.a.s.u.p.LogUpdateProcessorFactory path=/update params={{params(wt=xml),defaults(wt=xml)}}{add=[1 (1878309140246298625)]} 0 0
2> 966567 INFO (searcherExecutor-17422-thread-1-processing-collection1) [ x:collection1] o.a.s.c.SolrCore Registered new searcher autowarm time: 0 ms
2> 966567 INFO (TEST-TestReRankQParserPlugin.testRerankQueryParsingShouldFailWithoutMandatoryReRankQueryParameter-seed#[3DDF7021B5204DEF]) [ x:collection1] o.a.s.u.p.LogUpdateProcessorFactory path=/update params={{params(wt=xml),defaults(wt=xml)}}{commit=} 0 2
2> 966568 INFO (TEST-TestReRankQParserPlugin.testRerankQueryParsingShouldFailWithoutMandatoryReRankQueryParameter-seed#[3DDF7021B5204DEF]) [ x:collection1] o.a.s.u.p.LogUpdateProcessorFactory path=/update params={{params(wt=xml),defaults(wt=xml)}}{add=[2 (1878309140250492928)]} 0 0
2> 966570 INFO (searcherExecutor-17422-thread-1-processing-collection1) [ x:collection1] o.a.s.c.SolrCore Registered new searcher autowarm time: 0 ms
2> 966570 INFO (TEST-TestReRankQParserPlugin.testRerankQueryParsingShouldFailWithoutMandatoryReRankQueryParameter-seed#[3DDF7021B5204DEF]) [ x:collection1] o.a.s.u.p.LogUpdateProcessorFactory path=/update params={{params(wt=xml),defaults(wt=xml)}}{commit=} 0 2
2> 966571 INFO (TEST-TestReRankQParserPlugin.testRerankQueryParsingShouldFailWithoutMandatoryReRankQueryParameter-seed#[3DDF7021B5204DEF]) [] o.a.s.u.ErrorLogMuter Creating ErrorLogMuter-regex-264 for ERROR logs matching regex: reRankQuery parameter is mandatory
2> 966572 INFO (TEST-TestReRankQParserPlugin.testRerankQueryParsingShouldFailWithoutMandatoryReRankQueryParameter-seed#[3DDF7021B5204DEF]) [] o.a.s.c.S.Request path=null params={rq={!rerank+reRankQuery%3D$rqq+reRankDocs%3D200}&q=term_s:YYYY&start=0&rows=2} status=400 QTime=0
2> 966572 INFO (TEST-TestReRankQParserPlugin.testRerankQueryParsingShouldFailWithoutMandatoryReRankQueryParameter-seed#[3DDF7021B5204DEF]) [] o.a.s.u.ErrorLogMuter Closing ErrorLogMuter-regex-264 after muting 1 log messages
2> 966573 INFO (TEST-TestReRankQParserPlugin.testRerankQueryParsingShouldFailWithoutMandatoryReRankQueryParameter-seed#[3DDF7021B5204DEF]) [] o.a.s.SolrTestCaseJ4 ###Ending testRerankQueryParsingShouldFailWithoutMandatoryReRankQueryParameter
2> 966577 INFO (TEST-TestReRankQParserPlugin.testReRankScaler-seed#[3DDF7021B5204DEF]) [] o.a.s.SolrTestCaseJ4 ###Starting testReRankScaler
2> 966577 INFO (TEST-TestReRankQParserPlugin.testReRankScaler-seed#[3DDF7021B5204DEF]) [] o.a.s.u.DirectUpdateHandler2 REMOVING ALL DOCUMENTS FROM INDEX
2> 966577 INFO (TEST-TestReRankQParserPlugin.testReRankScaler-seed#[3DDF7021B5204DEF]) [] o.a.s.u.p.LogUpdateProcessorFactory {deleteByQuery=*:* (-9223372036854775807)} 0 0
2> 966578 INFO (searcherExecutor-17422-thread-1-processing-collection1) [ x:collection1] o.a.s.c.SolrCore Registered new searcher autowarm time: 0 ms
2> 966578 INFO (TEST-TestReRankQParserPlugin.testReRankScaler-seed#[3DDF7021B5204DEF]) [ x:collection1] o.a.s.u.p.LogUpdateProcessorFactory path=/update params={{params(wt=xml),defaults(wt=xml)}}{commit=} 0 1
2> 966579 INFO (TEST-TestReRankQParserPlugin.testReRankScaler-seed#[3DDF7021B5204DEF]) [] o.a.s.SolrTestCaseJ4 ###Ending testReRankScaler
2> 966583 INFO (TEST-TestReRankQParserPlugin.testIntrospection-seed#[3DDF7021B5204DEF]) [] o.a.s.SolrTestCaseJ4 ###Starting testIntrospection
2> 966583 INFO (TEST-TestReRankQParserPlugin.testIntrospection-seed#[3DDF7021B5204DEF]) [] o.a.s.u.DirectUpdateHandler2 REMOVING ALL DOCUMENTS FROM INDEX
2> 966583 INFO (TEST-TestReRankQParserPlugin.testIntrospection-seed#[3DDF7021B5204DEF]) [] o.a.s.u.p.LogUpdateProcessorFactory {deleteByQuery=*:* (-9223372036854775807)} 0 0
2> 966584 INFO (searcherExecutor-17422-thread-1-processing-collection1) [ x:collection1] o.a.s.c.SolrCore Registered new searcher autowarm time: 0 ms
2> 966584 INFO (TEST-TestReRankQParserPlugin.testIntrospection-seed#[3DDF7021B5204DEF]) [ x:collection1] o.a.s.u.p.LogUpdateProcessorFactory path=/update params={{params(wt=xml),defaults(wt=xml)}}{commit=} 0 1
2> 966587 INFO (TEST-TestReRankQParserPlugin.testIntrospection-seed#[3DDF7021B5204DEF]) [] o.a.s.SolrTestCaseJ4 ###Ending testIntrospection
2> 966591 INFO (TEST-TestReRankQParserPlugin.testReRankQParserPluginConstants-seed#[3DDF7021B5204DEF]) [] o.a.s.SolrTestCaseJ4 ###Starting testReRankQParserPluginConstants
2> 966591 INFO (TEST-TestReRankQParserPlugin.testReRankQParserPluginConstants-seed#[3DDF7021B5204DEF]) [] o.a.s.u.DirectUpdateHandler2 REMOVING ALL DOCUMENTS FROM INDEX
2> 966591 INFO (TEST-TestReRankQParserPlugin.testReRankQParserPluginConstants-seed#[3DDF7021B5204DEF]) [] o.a.s.u.p.LogUpdateProcessorFactory {deleteByQuery=*:* (-9223372036854775807)} 0 0
2> 966592 INFO (searcherExecutor-17422-thread-1-processing-collection1) [ x:collection1] o.a.s.c.SolrCore Registered new searcher autowarm time: 0 ms
2> 966592 INFO (TEST-TestReRankQParserPlugin.testReRankQParserPluginConstants-seed#[3DDF7021B5204DEF]) [ x:collection1] o.a.s.u.p.LogUpdateProcessorFactory path=/update params={{params(wt=xml),defaults(wt=xml)}}{commit=} 0 1
2> 966593 INFO (TEST-TestReRankQParserPlugin.testReRankQParserPluginConstants-seed#[3DDF7021B5204DEF]) [] o.a.s.SolrTestCaseJ4 ###Ending testReRankQParserPluginConstants
2> 966596 INFO (TEST-TestReRankQParserPlugin.testReRankScaleQueries-seed#[3DDF7021B5204DEF]) [] o.a.s.SolrTestCaseJ4 ###Starting testReRankScaleQueries
2> 966597 INFO (TEST-TestReRankQParserPlugin.testReRankScaleQueries-seed#[3DDF7021B5204DEF]) [] o.a.s.u.DirectUpdateHandler2 REMOVING ALL DOCUMENTS FROM INDEX
2> 966597 INFO (TEST-TestReRankQParserPlugin.testReRankScaleQueries-seed#[3DDF7021B5204DEF]) [] o.a.s.u.p.LogUpdateProcessorFactory {deleteByQuery=*:* (-9223372036854775807)} 0 0
2> 966598 INFO (searcherExecutor-17422-thread-1-processing-collection1) [ x:collection1] o.a.s.c.SolrCore Registered new searcher autowarm time: 0 ms
2> 966598 INFO (TEST-TestReRankQParserPlugin.testReRankScaleQueries-seed#[3DDF7021B5204DEF]) [ x:collection1] o.a.s.u.p.LogUpdateProcessorFactory path=/update params={{params(wt=xml),defaults(wt=xml)}}{commit=} 0 1
2> 966599 INFO (TEST-TestReRankQParserPlugin.testReRankScaleQueries-seed#[3DDF7021B5204DEF]) [ x:collection1] o.a.s.u.p.LogUpdateProcessorFactory path=/update params={{params(wt=xml),defaults(wt=xml)}}{deleteByQuery=*:* (-1878309140282998784)} 0 0
2> 966599 INFO (TEST-TestReRankQParserPlugin.testReRankScaleQueries-seed#[3DDF7021B5204DEF]) [ x:collection1] o.a.s.u.p.LogUpdateProcessorFactory path=/update params={{params(wt=xml),defaults(wt=xml)}}{commit=} 0 0
2> 966600 INFO (TEST-TestReRankQParserPlugin.testReRankScaleQueries-seed#[3DDF7021B5204DEF]) [ x:collection1] o.a.s.u.p.LogUpdateProcessorFactory path=/update params={{params(wt=xml),defaults(wt=xml)}}{add=[1 (1878309140285095936)]} 0 0
2> 966603 INFO (searcherExecutor-17422-thread-1-processing-collection1) [ x:collection1] o.a.s.c.SolrCore Registered new searcher autowarm time: 0 ms
2> 966603 INFO (TEST-TestReRankQParserPlugin.testReRankScaleQueries-seed#[3DDF7021B5204DEF]) [ x:collection1] o.a.s.u.p.LogUpdateProcessorFactory path=/update params={{params(wt=xml),defaults(wt=xml)}}{commit=} 0 2
2> 966604 INFO (TEST-TestReRankQParserPlugin.testReRankScaleQueries-seed#[3DDF7021B5204DEF]) [ x:collection1] o.a.s.u.p.LogUpdateProcessorFactory path=/update params={{params(wt=xml),defaults(wt=xml)}}{add=[2 (1878309140289290240)]} 0 0
2> 966605 INFO (TEST-TestReRankQParserPlugin.testReRankScaleQueries-seed#[3DDF7021B5204DEF]) [ x:collection1] o.a.s.u.p.LogUpdateProcessorFactory path=/update params={{params(wt=xml),defaults(wt=xml)}}{add=[3 (1878309140290338816)]} 0 0
2> 966607 INFO (searcherExecutor-17422-thread-1-processing-collection1) [ x:collection1] o.a.s.c.SolrCore Registered new searcher autowarm time: 0 ms
2> 966608 INFO (TEST-TestReRankQParserPlugin.testReRankScaleQueries-seed#[3DDF7021B5204DEF]) [ x:collection1] o.a.s.u.p.LogUpdateProcessorFactory path=/update params={{params(wt=xml),defaults(wt=xml)}}{commit=} 0 2
2> 966608 INFO (TEST-TestReRankQParserPlugin.testReRankScaleQueries-seed#[3DDF7021B5204DEF]) [ x:collection1] o.a.s.u.p.LogUpdateProcessorFactory path=/update params={{params(wt=xml),defaults(wt=xml)}}{add=[4 (1878309140293484544)]} 0 0
2> 966609 INFO (TEST-TestReRankQParserPlugin.testReRankScaleQueries-seed#[3DDF7021B5204DEF]) [ x:collection1] o.a.s.u.p.LogUpdateProcessorFactory path=/update params={{params(wt=xml),defaults(wt=xml)}}{add=[5 (1878309140294533120)]} 0 0
2> 966612 INFO (searcherExecutor-17422-thread-1-processing-collection1) [ x:collection1] o.a.s.c.SolrCore Registered new searcher autowarm time: 0 ms
2> 966612 INFO (TEST-TestReRankQParserPlugin.testReRankScaleQueries-seed#[3DDF7021B5204DEF]) [ x:collection1] o.a.s.u.p.LogUpdateProcessorFactory path=/update params={{params(wt=xml),defaults(wt=xml)}}{commit=} 0 2
2> 966613 INFO (TEST-TestReRankQParserPlugin.testReRankScaleQueries-seed#[3DDF7021B5204DEF]) [ x:collection1] o.a.s.u.p.LogUpdateProcessorFactory path=/update params={{params(wt=xml),defaults(wt=xml)}}{add=[6 (1878309140297678848)]} 0 0
2> 966615 INFO (searcherExecutor-17422-thread-1-processing-collection1) [ x:collection1] o.a.s.c.SolrCore Registered new searcher autowarm time: 0 ms
2> 966616 INFO (TEST-TestReRankQParserPlugin.testReRankScaleQueries-seed#[3DDF7021B5204DEF]) [ x:collection1] o.a.s.u.p.LogUpdateProcessorFactory path=/update params={{params(wt=xml),defaults(wt=xml)}}{commit=} 0 2
2> 966619 INFO (TEST-TestReRankQParserPlugin.testReRankScaleQueries-seed#[3DDF7021B5204DEF]) [] o.a.s.c.S.Request path=null params={rq={!rerank+reRankMainScale%3D10-20+reRankScale%3D10-20+reRankWeight%3D1+reRankQuery%3D$rqq+reRankDocs%3D200}&q=term_t:YYYY&fl=id,score&rqq={!func}sum(1.0,$bff)&bff=field(test_ti)&start=0&rows=6&df=text&debugQuery=true} hits=6 status=0 QTime=3
2> 966623 INFO (TEST-TestReRankQParserPlugin.testReRankScaleQueries-seed#[3DDF7021B5204DEF]) [] o.a.s.c.S.Request path=null params={rq={!rerank+reRankMainScale%3D10-20+reRankScale%3D10-20+reRankWeight%3D1+reRankQuery%3D$rqq+reRankDocs%3D200}&q=term_t:YYYY&fl=id,score&rqq={!edismax+bf%3D$bff}*:*&bff=field(test_ti)&start=0&rows=4&df=text&debugQuery=true} hits=6 status=0 QTime=1
2> 966626 INFO (TEST-TestReRankQParserPlugin.testReRankScaleQueries-seed#[3DDF7021B5204DEF]) [] o.a.s.c.S.Request path=null params={rq={!rerank+reRankMainScale%3D10-20+reRankScale%3D10-20+reRankWeight%3D1+reRankQuery%3D$rqq+reRankDocs%3D200}&q=term_t:YYYY&fl=id,score&rqq={!edismax+bf%3D$bff}BBBBBBBB&bff=field(test_ti)&start=0&rows=6&df=text&debugQuery=true} hits=6 status=0 QTime=1
2> 966628 INFO (TEST-TestReRankQParserPlugin.testReRankScaleQueries-seed#[3DDF7021B5204DEF]) [] o.a.s.c.S.Request path=null params={rq={!rerank+reRankMainScale%3D10-20+reRankScale%3D10-20+reRankWeight%3D1+reRankQuery%3D$rqq+reRankDocs%3D4}&q=term_t:YYYY&fl=id,score&rqq={!func}sum(1.0,$bff)&bff=field(test_ti)&start=0&rows=6&df=text} hits=6 status=0 QTime=0
2> 966630 INFO (TEST-TestReRankQParserPlugin.testReRankScaleQueries-seed#[3DDF7021B5204DEF]) [] o.a.s.c.S.Request path=null params={rq={!rerank+reRankMainScale%3D10-19+reRankScale%3D10-20+reRankWeight%3D1+reRankQuery%3D$rqq+reRankDocs%3D4}&q=term_t:YYYY&fq=id:(4+OR+5)&fl=id,score&rqq={!func}sum(1.0,$bff)&bff=field(test_ti)&start=0&rows=6&df=text} hits=2 status=0 QTime=0
2> 966645 INFO (TEST-TestReRankQParserPlugin.testReRankScaleQueries-seed#[3DDF7021B5204DEF]) [] o.a.s.c.S.Request path=null params={rq={!rerank+reRankMainScale%3D10-19+reRankScale%3D10-20+reRankWeight%3D1+reRankQuery%3D$rqq+reRankDocs%3D4}&q=term_t:YYYY&fq=id:(4+OR+5)&fl=id,score&rqq={!func}sum(1.0,$bff)&bff=field(test_ti)&start=0&rows=6&df=text&debugQuery=true} hits=2 status=0 QTime=1
2> 966646 INFO (TEST-TestReRankQParserPlugin.testReRankScaleQueries-seed#[3DDF7021B5204DEF]) [] o.a.s.c.S.Request path=null params={rq={!rerank+reRankMainScale%3D10-19+reRankScale%3D10-20+reRankWeight%3D1+reRankQuery%3D$rqq+reRankDocs%3D4}&q=term_t:YYYY&fq=id:(4+OR+5)&fl=id,score&rqq={!func}sum(1.0,$bff)&bff=field(test_ti)&start=0&rows=6&df=text&debugQuery=true} hits=2 status=0 QTime=0
2> 966648 INFO (TEST-TestReRankQParserPlugin.testReRankScaleQueries-seed#[3DDF7021B5204DEF]) [] o.a.s.c.S.Request path=null params={rq={!rerank+reRankMainScale%3D10-20+reRankWeight%3D1+reRankQuery%3D$rqq+reRankDocs%3D4}&q=term_t:YYYY&fl=id,score&rqq={!edismax+bf%3D$bff}*:*&bff=field(test_ti)&start=0&rows=6&df=text&debugQuery=true} hits=6 status=0 QTime=1
2> 966651 INFO (TEST-TestReRankQParserPlugin.testReRankScaleQueries-seed#[3DDF7021B5204DEF]) [] o.a.s.c.S.Request path=null params={rq={!rerank+reRankMainScale%3D10-20+reRankWeight%3D1+reRankQuery%3D$rqq+reRankDocs%3D4}&q=term_t:YYYY&fl=id,score&rqq={!edismax+bf%3D$bff}*:*&bff=field(test_ti)&start=0&rows=6&df=text&debugQuery=true} hits=6 status=0 QTime=1
2> 966654 INFO (TEST-TestReRankQParserPlugin.testReRankScaleQueries-seed#[3DDF7021B5204DEF]) [] o.a.s.c.S.Request path=null params={rq={!rerank+reRankMainScale%3D10-20+reRankWeight%3D1+reRankQuery%3D$rqq+reRankDocs%3D4}&q=term_t:YYYY&fl=id,score&rqq={!edismax+bf%3D$bff}id:(3+OR+4+OR+6+OR+5)&bff=field(test_ti)&start=0&rows=6&df=text&debug=true} hits=6 status=0 QTime=2
2> 966658 INFO (TEST-TestReRankQParserPlugin.testReRankScaleQueries-seed#[3DDF7021B5204DEF]) [] o.a.s.c.S.Request path=null params={rq={!rerank+reRankMainScale%3D10-20+reRankQuery%3D$rqq+reRankDocs%3D4}&q=term_t:YYYY&fl=id,score&rqq={!edismax+bf%3D$bff}id:(3+OR+4+OR+6+OR+5)&bff=field(test_ti)&start=0&rows=6&df=text&debugQuery=true} hits=6 status=0 QTime=2
2> 966662 INFO (TEST-TestReRankQParserPlugin.testReRankScaleQueries-seed#[3DDF7021B5204DEF]) [] o.a.s.c.S.Request path=null params={rq={!rerank+reRankMainScale%3D10-20+reRankQuery%3D$rqq+reRankDocs%3D4}&q=term_t:YYYY&fl=id,score&rqq={!edismax+bf%3D$bff}id:(3+OR+4+OR+6+OR+5)&bff=field(test_ti)&start=0&rows=6&df=text&debugQuery=true} hits=6 status=0 QTime=2
2> 966663 INFO (TEST-TestReRankQParserPlugin.testReRankScaleQueries-seed#[3DDF7021B5204DEF]) [] o.a.s.SolrTestCaseJ4 ###Ending testReRankScaleQueries
2> 966667 INFO (TEST-TestReRankQParserPlugin.testMinExactCount-seed#[3DDF7021B5204DEF]) [] o.a.s.SolrTestCaseJ4 ###Starting testMinExactCount
2> 966667 INFO (TEST-TestReRankQParserPlugin.testMinExactCount-seed#[3DDF7021B5204DEF]) [] o.a.s.u.DirectUpdateHandler2 REMOVING ALL DOCUMENTS FROM INDEX
2> 966667 INFO (TEST-TestReRankQParserPlugin.testMinExactCount-seed#[3DDF7021B5204DEF]) [] o.a.s.u.p.LogUpdateProcessorFactory {deleteByQuery=*:* (-9223372036854775807)} 0 0
2> 966668 INFO (searcherExecutor-17422-thread-1-processing-collection1) [ x:collection1] o.a.s.c.SolrCore Registered new searcher autowarm time: 0 ms
2> 966669 INFO (TEST-TestReRankQParserPlugin.testMinExactCount-seed#[3DDF7021B5204DEF]) [ x:collection1] o.a.s.u.p.LogUpdateProcessorFactory path=/update params={{params(wt=xml),defaults(wt=xml)}}{commit=} 0 1
2> 966670 INFO (TEST-TestReRankQParserPlugin.testMinExactCount-seed#[3DDF7021B5204DEF]) [ x:collection1] o.a.s.u.p.LogUpdateProcessorFactory path=/update params={{params(wt=xml),defaults(wt=xml)}}{deleteByQuery=*:* (-1878309140357447680)} 0 0
2> 966670 INFO (TEST-TestReRankQParserPlugin.testMinExactCount-seed#[3DDF7021B5204DEF]) [ x:collection1] o.a.s.u.p.LogUpdateProcessorFactory path=/update params={{params(wt=xml),defaults(wt=xml)}}{commit=} 0 0
2> 966672 INFO (TEST-TestReRankQParserPlugin.testMinExactCount-seed#[3DDF7021B5204DEF]) [ x:collection1] o.a.s.u.p.LogUpdateProcessorFactory path=/update params={{params(wt=xml),defaults(wt=xml)}}{add=[0 (1878309140359544832)]} 0 1
2> 966673 INFO (TEST-TestReRankQParserPlugin.testMinExactCount-seed#[3DDF7021B5204DEF]) [ x:collection1] o.a.s.u.p.LogUpdateProcessorFactory path=/update params={{params(wt=xml),defaults(wt=xml)}}{add=[1 (1878309140360593408)]} 0 0
2> 966674 INFO (TEST-TestReRankQParserPlugin.testMinExactCount-seed#[3DDF7021B5204DEF]) [ x:collection1] o.a.s.u.p.LogUpdateProcessorFactory path=/update params={{params(wt=xml),defaults(wt=xml)}}{add=[2 (1878309140362690560)]} 0 0
2> 966675 INFO (TEST-TestReRankQParserPlugin.testMinExactCount-seed#[3DDF7021B5204DEF]) [ x:collection1] o.a.s.u.p.LogUpdateProcessorFactory path=/update params={{params(wt=xml),defaults(wt=xml)}}{add=[3 (1878309140363739136)]} 0 0
2> 966678 INFO (TEST-TestReRankQParserPlugin.testMinExactCount-seed#[3DDF7021B5204DEF]) [ x:collection1] o.a.s.u.p.LogUpdateProcessorFactory path=/update params={{params(wt=xml),defaults(wt=xml)}}{add=[4 (1878309140363739137)]} 0 2
2> 966679 INFO (TEST-TestReRankQParserPlugin.testMinExactCount-seed#[3DDF7021B5204DEF]) [ x:collection1] o.a.s.u.p.LogUpdateProcessorFactory path=/update params={{params(wt=xml),defaults(wt=xml)}}{add=[5 (1878309140366884864)]} 0 0
2> 966680 INFO (TEST-TestReRankQParserPlugin.testMinExactCount-seed#[3DDF7021B5204DEF]) [ x:collection1] o.a.s.u.p.LogUpdateProcessorFactory path=/update params={{params(wt=xml),defaults(wt=xml)}}{add=[6 (1878309140367933440)]} 0 0
2> 966681 INFO (TEST-TestReRankQParserPlugin.testMinExactCount-seed#[3DDF7021B5204DEF]) [ x:collection1] o.a.s.u.p.LogUpdateProcessorFactory path=/update params={{params(wt=xml),defaults(wt=xml)}}{add=[7 (1878309140368982016)]} 0 0
2> 966682 INFO (TEST-TestReRankQParserPlugin.testMinExactCount-seed#[3DDF7021B5204DEF]) [ x:collection1] o.a.s.u.p.LogUpdateProcessorFactory path=/update params={{params(wt=xml),defaults(wt=xml)}}{add=[8 (1878309140370030592)]} 0 0
2> 966685 INFO (TEST-TestReRankQParserPlugin.testMinExactCount-seed#[3DDF7021B5204DEF]) [ x:collection1] o.a.s.u.p.LogUpdateProcessorFactory path=/update params={{params(wt=xml),defaults(wt=xml)}}{add=[9 (1878309140371079168)]} 0 2
2> 966686 INFO (TEST-TestReRankQParserPlugin.testMinExactCount-seed#[3DDF7021B5204DEF]) [ x:collection1] o.a.s.u.p.LogUpdateProcessorFactory path=/update params={{params(wt=xml),defaults(wt=xml)}}{add=[10 (1878309140374224896)]} 0 0
2> 966687 INFO (TEST-TestReRankQParserPlugin.testMinExactCount-seed#[3DDF7021B5204DEF]) [ x:collection1] o.a.s.u.p.LogUpdateProcessorFactory path=/update params={{params(wt=xml),defaults(wt=xml)}}{add=[11 (1878309140375273472)]} 0 0
2> 966688 INFO (TEST-TestReRankQParserPlugin.testMinExactCount-seed#[3DDF7021B5204DEF]) [ x:collection1] o.a.s.u.p.LogUpdateProcessorFactory path=/update params={{params(wt=xml),defaults(wt=xml)}}{add=[12 (1878309140376322048)]} 0 0
2> 966689 INFO (TEST-TestReRankQParserPlugin.testMinExactCount-seed#[3DDF7021B5204DEF]) [ x:collection1] o.a.s.u.p.LogUpdateProcessorFactory path=/update params={{params(wt=xml),defaults(wt=xml)}}{add=[13 (1878309140377370624)]} 0 0
2> 966692 INFO (TEST-TestReRankQParserPlugin.testMinExactCount-seed#[3DDF7021B5204DEF]) [ x:collection1] o.a.s.u.p.LogUpdateProcessorFactory path=/update params={{params(wt=xml),defaults(wt=xml)}}{add=[14 (1878309140378419200)]} 0 2
2> 966693 INFO (TEST-TestReRankQParserPlugin.testMinExactCount-seed#[3DDF7021B5204DEF]) [ x:collection1] o.a.s.u.p.LogUpdateProcessorFactory path=/update params={{params(wt=xml),defaults(wt=xml)}}{add=[15 (1878309140381564928)]} 0 0
2> 966694 INFO (TEST-TestReRankQParserPlugin.testMinExactCount-seed#[3DDF7021B5204DEF]) [ x:collection1] o.a.s.u.p.LogUpdateProcessorFactory path=/update params={{params(wt=xml),defaults(wt=xml)}}{add=[16 (1878309140382613504)]} 0 0
2> 966695 INFO (TEST-TestReRankQParserPlugin.testMinExactCount-seed#[3DDF7021B5204DEF]) [ x:collection1] o.a.s.u.p.LogUpdateProcessorFactory path=/update params={{params(wt=xml),defaults(wt=xml)}}{add=[17 (1878309140383662080)]} 0 0
2> 966696 INFO (TEST-TestReRankQParserPlugin.testMinExactCount-seed#[3DDF7021B5204DEF]) [ x:collection1] o.a.s.u.p.LogUpdateProcessorFactory path=/update params={{params(wt=xml),defaults(wt=xml)}}{add=[18 (1878309140384710656)]} 0 0
2> 966699 INFO (TEST-TestReRankQParserPlugin.testMinExactCount-seed#[3DDF7021B5204DEF]) [ x:collection1] o.a.s.u.p.LogUpdateProcessorFactory path=/update params={{params(wt=xml),defaults(wt=xml)}}{add=[19 (1878309140385759232)]} 0 2
2> 966700 INFO (TEST-TestReRankQParserPlugin.testMinExactCount-seed#[3DDF7021B5204DEF]) [ x:collection1] o.a.s.u.p.LogUpdateProcessorFactory path=/update params={{params(wt=xml),defaults(wt=xml)}}{add=[20 (1878309140388904960)]} 0 0
2> 966701 INFO (TEST-TestReRankQParserPlugin.testMinExactCount-seed#[3DDF7021B5204DEF]) [ x:collection1] o.a.s.u.p.LogUpdateProcessorFactory path=/update params={{params(wt=xml),defaults(wt=xml)}}{add=[21 (1878309140389953536)]} 0 0
2> 966702 INFO (TEST-TestReRankQParserPlugin.testMinExactCount-seed#[3DDF7021B5204DEF]) [ x:collection1] o.a.s.u.p.LogUpdateProcessorFactory path=/update params={{params(wt=xml),defaults(wt=xml)}}{add=[22 (1878309140391002112)]} 0 0
2> 966703 INFO (TEST-TestReRankQParserPlugin.testMinExactCount-seed#[3DDF7021B5204DEF]) [ x:collection1] o.a.s.u.p.LogUpdateProcessorFactory path=/update params={{params(wt=xml),defaults(wt=xml)}}{add=[23 (1878309140392050688)]} 0 0
2> 966706 INFO (TEST-TestReRankQParserPlugin.testMinExactCount-seed#[3DDF7021B5204DEF]) [ x:collection1] o.a.s.u.p.LogUpdateProcessorFactory path=/update params={{params(wt=xml),defaults(wt=xml)}}{add=[24 (1878309140393099264)]} 0 2
2> 966707 INFO (TEST-TestReRankQParserPlugin.testMinExactCount-seed#[3DDF7021B5204DEF]) [ x:collection1] o.a.s.u.p.LogUpdateProcessorFactory path=/update params={{params(wt=xml),defaults(wt=xml)}}{add=[25 (1878309140396244992)]} 0 0
2> 966708 INFO (TEST-TestReRankQParserPlugin.testMinExactCount-seed#[3DDF7021B5204DEF]) [ x:collection1] o.a.s.u.p.LogUpdateProcessorFactory path=/update params={{params(wt=xml),defaults(wt=xml)}}{add=[26 (1878309140397293568)]} 0 0
2> 966709 INFO (TEST-TestReRankQParserPlugin.testMinExactCount-seed#[3DDF7021B5204DEF]) [ x:collection1] o.a.s.u.p.LogUpdateProcessorFactory path=/update params={{params(wt=xml),defaults(wt=xml)}}{add=[27 (1878309140398342144)]} 0 0
2> 966710 INFO (TEST-TestReRankQParserPlugin.testMinExactCount-seed#[3DDF7021B5204DEF]) [ x:collection1] o.a.s.u.p.LogUpdateProcessorFactory path=/update params={{params(wt=xml),defaults(wt=xml)}}{add=[28 (1878309140399390720)]} 0 0
2> 966713 INFO (TEST-TestReRankQParserPlugin.testMinExactCount-seed#[3DDF7021B5204DEF]) [ x:collection1] o.a.s.u.p.LogUpdateProcessorFactory path=/update params={{params(wt=xml),defaults(wt=xml)}}{add=[29 (1878309140400439296)]} 0 2
2> 966714 INFO (TEST-TestReRankQParserPlugin.testMinExactCount-seed#[3DDF7021B5204DEF]) [ x:collection1] o.a.s.u.p.LogUpdateProcessorFactory path=/update params={{params(wt=xml),defaults(wt=xml)}}{add=[30 (1878309140403585024)]} 0 0
2> 966715 INFO (TEST-TestReRankQParserPlugin.testMinExactCount-seed#[3DDF7021B5204DEF]) [ x:collection1] o.a.s.u.p.LogUpdateProcessorFactory path=/update params={{params(wt=xml),defaults(wt=xml)}}{add=[31 (1878309140404633600)]} 0 0
2> 966716 INFO (TEST-TestReRankQParserPlugin.testMinExactCount-seed#[3DDF7021B5204DEF]) [ x:collection1] o.a.s.u.p.LogUpdateProcessorFactory path=/update params={{params(wt=xml),defaults(wt=xml)}}{add=[32 (1878309140405682176)]} 0 0
2> 966717 INFO (TEST-TestReRankQParserPlugin.testMinExactCount-seed#[3DDF7021B5204DEF]) [ x:collection1] o.a.s.u.p.LogUpdateProcessorFactory path=/update params={{params(wt=xml),defaults(wt=xml)}}{add=[33 (1878309140406730752)]} 0 0
2> 966720 INFO (TEST-TestReRankQParserPlugin.testMinExactCount-seed#[3DDF7021B5204DEF]) [ x:collection1] o.a.s.u.p.LogUpdateProcessorFactory path=/update params={{params(wt=xml),defaults(wt=xml)}}{add=[34 (1878309140407779328)]} 0 2
2> 966721 INFO (TEST-TestReRankQParserPlugin.testMinExactCount-seed#[3DDF7021B5204DEF]) [ x:collection1] o.a.s.u.p.LogUpdateProcessorFactory path=/update params={{params(wt=xml),defaults(wt=xml)}}{add=[35 (1878309140410925056)]} 0 0
2> 966722 INFO (TEST-TestReRankQParserPlugin.testMinExactCount-seed#[3DDF7021B5204DEF]) [ x:collection1] o.a.s.u.p.LogUpdateProcessorFactory path=/update params={{params(wt=xml),defaults(wt=xml)}}{add=[36 (1878309140411973632)]} 0 0
2> 966723 INFO (TEST-TestReRankQParserPlugin.testMinExactCount-seed#[3DDF7021B5204DEF]) [ x:collection1] o.a.s.u.p.LogUpdateProcessorFactory path=/update params={{params(wt=xml),defaults(wt=xml)}}{add=[37 (1878309140413022208)]} 0 0
2> 966724 INFO (TEST-TestReRankQParserPlugin.testMinExactCount-seed#[3DDF7021B5204DEF]) [ x:collection1] o.a.s.u.p.LogUpdateProcessorFactory path=/update params={{params(wt=xml),defaults(wt=xml)}}{add=[38 (1878309140414070784)]} 0 0
2> 966727 INFO (TEST-TestReRankQParserPlugin.testMinExactCount-seed#[3DDF7021B5204DEF]) [ x:collection1] o.a.s.u.p.LogUpdateProcessorFactory path=/update params={{params(wt=xml),defaults(wt=xml)}}{add=[39 (1878309140415119360)]} 0 2
2> 966728 INFO (TEST-TestReRankQParserPlugin.testMinExactCount-seed#[3DDF7021B5204DEF]) [ x:collection1] o.a.s.u.p.LogUpdateProcessorFactory path=/update params={{params(wt=xml),defaults(wt=xml)}}{add=[40 (1878309140418265088)]} 0 0
2> 966729 INFO (TEST-TestReRankQParserPlugin.testMinExactCount-seed#[3DDF7021B5204DEF]) [ x:collection1] o.a.s.u.p.LogUpdateProcessorFactory path=/update params={{params(wt=xml),defaults(wt=xml)}}{add=[41 (1878309140420362240)]} 0 0
2> 966730 INFO (TEST-TestReRankQParserPlugin.testMinExactCount-seed#[3DDF7021B5204DEF]) [ x:collection1] o.a.s.u.p.LogUpdateProcessorFactory path=/update params={{params(wt=xml),defaults(wt=xml)}}{add=[42 (1878309140421410816)]} 0 0
2> 966731 INFO (TEST-TestReRankQParserPlugin.testMinExactCount-seed#[3DDF7021B5204DEF]) [ x:collection1] o.a.s.u.p.LogUpdateProcessorFactory path=/update params={{params(wt=xml),defaults(wt=xml)}}{add=[43 (1878309140422459392)]} 0 0
2> 966734 INFO (TEST-TestReRankQParserPlugin.testMinExactCount-seed#[3DDF7021B5204DEF]) [ x:collection1] o.a.s.u.p.LogUpdateProcessorFactory path=/update params={{params(wt=xml),defaults(wt=xml)}}{add=[44 (1878309140422459393)]} 0 2
2> 966735 INFO (TEST-TestReRankQParserPlugin.testMinExactCount-seed#[3DDF7021B5204DEF]) [ x:collection1] o.a.s.u.p.LogUpdateProcessorFactory path=/update params={{params(wt=xml),defaults(wt=xml)}}{add=[45 (1878309140426653696)]} 0 0
2> 966736 INFO (TEST-TestReRankQParserPlugin.testMinExactCount-seed#[3DDF7021B5204DEF]) [ x:collection1] o.a.s.u.p.LogUpdateProcessorFactory path=/update params={{params(wt=xml),defaults(wt=xml)}}{add=[46 (1878309140427702272)]} 0 0
2> 966737 INFO (TEST-TestReRankQParserPlugin.testMinExactCount-seed#[3DDF7021B5204DEF]) [ x:collection1] o.a.s.u.p.LogUpdateProcessorFactory path=/update params={{params(wt=xml),defaults(wt=xml)}}{add=[47 (1878309140428750848)]} 0 0
2> 966738 INFO (TEST-TestReRankQParserPlugin.testMinExactCount-seed#[3DDF7021B5204DEF]) [ x:collection1] o.a.s.u.p.LogUpdateProcessorFactory path=/update params={{params(wt=xml),defaults(wt=xml)}}{add=[48 (1878309140429799424)]} 0 0
2> 966741 INFO (TEST-TestReRankQParserPlugin.testMinExactCount-seed#[3DDF7021B5204DEF]) [ x:collection1] o.a.s.u.p.LogUpdateProcessorFactory path=/update params={{params(wt=xml),defaults(wt=xml)}}{add=[49 (1878309140430848000)]} 0 2
2> 966743 INFO (TEST-TestReRankQParserPlugin.testMinExactCount-seed#[3DDF7021B5204DEF]) [ x:collection1] o.a.s.u.p.LogUpdateProcessorFactory path=/update params={{params(wt=xml),defaults(wt=xml)}}{add=[50 (1878309140433993728)]} 0 0
2> 966744 INFO (TEST-TestReRankQParserPlugin.testMinExactCount-seed#[3DDF7021B5204DEF]) [ x:collection1] o.a.s.u.p.LogUpdateProcessorFactory path=/update params={{params(wt=xml),defaults(wt=xml)}}{add=[51 (1878309140435042304)]} 0 0
2> 966744 INFO (TEST-TestReRankQParserPlugin.testMinExactCount-seed#[3DDF7021B5204DEF]) [ x:collection1] o.a.s.u.p.LogUpdateProcessorFactory path=/update params={{params(wt=xml),defaults(wt=xml)}}{add=[52 (1878309140436090880)]} 0 0
2> 966745 INFO (TEST-TestReRankQParserPlugin.testMinExactCount-seed#[3DDF7021B5204DEF]) [ x:collection1] o.a.s.u.p.LogUpdateProcessorFactory path=/update params={{params(wt=xml),defaults(wt=xml)}}{add=[53 (1878309140437139456)]} 0 0
2> 966749 INFO (TEST-TestReRankQParserPlugin.testMinExactCount-seed#[3DDF7021B5204DEF]) [ x:collection1] o.a.s.u.p.LogUpdateProcessorFactory path=/update params={{params(wt=xml),defaults(wt=xml)}}{add=[54 (1878309140438188032)]} 0 2
2> 966750 INFO (TEST-TestReRankQParserPlugin.testMinExactCount-seed#[3DDF7021B5204DEF]) [ x:collection1] o.a.s.u.p.LogUpdateProcessorFactory path=/update params={{params(wt=xml),defaults(wt=xml)}}{add=[55 (1878309140441333760)]} 0 0
2> 966751 INFO (TEST-TestReRankQParserPlugin.testMinExactCount-seed#[3DDF7021B5204DEF]) [ x:collection1] o.a.s.u.p.LogUpdateProcessorFactory path=/update params={{params(wt=xml),defaults(wt=xml)}}{add=[56 (1878309140442382336)]} 0 0
2> 966752 INFO (TEST-TestReRankQParserPlugin.testMinExactCount-seed#[3DDF7021B5204DEF]) [ x:collection1] o.a.s.u.p.LogUpdateProcessorFactory path=/update params={{params(wt=xml),defaults(wt=xml)}}{add=[57 (1878309140443430912)]} 0 0
2> 966753 INFO (TEST-TestReRankQParserPlugin.testMinExactCount-seed#[3DDF7021B5204DEF]) [ x:collection1] o.a.s.u.p.LogUpdateProcessorFactory path=/update params={{params(wt=xml),defaults(wt=xml)}}{add=[58 (1878309140444479488)]} 0 0
2> 966756 INFO (TEST-TestReRankQParserPlugin.testMinExactCount-seed#[3DDF7021B5204DEF]) [ x:collection1] o.a.s.u.p.LogUpdateProcessorFactory path=/update params={{params(wt=xml),defaults(wt=xml)}}{add=[59 (1878309140445528064)]} 0 2
2> 966757 INFO (TEST-TestReRankQParserPlugin.testMinExactCount-seed#[3DDF7021B5204DEF]) [ x:collection1] o.a.s.u.p.LogUpdateProcessorFactory path=/update params={{params(wt=xml),defaults(wt=xml)}}{add=[60 (1878309140448673792)]} 0 0
2> 966758 INFO (TEST-TestReRankQParserPlugin.testMinExactCount-seed#[3DDF7021B5204DEF]) [ x:collection1] o.a.s.u.p.LogUpdateProcessorFactory path=/update params={{params(wt=xml),defaults(wt=xml)}}{add=[61 (1878309140449722368)]} 0 0
2> 966759 INFO (TEST-TestReRankQParserPlugin.testMinExactCount-seed#[3DDF7021B5204DEF]) [ x:collection1] o.a.s.u.p.LogUpdateProcessorFactory path=/update params={{params(wt=xml),defaults(wt=xml)}}{add=[62 (1878309140450770944)]} 0 0
2> 966760 INFO (TEST-TestReRankQParserPlugin.testMinExactCount-seed#[3DDF7021B5204DEF]) [ x:collection1] o.a.s.u.p.LogUpdateProcessorFactory path=/update params={{params(wt=xml),defaults(wt=xml)}}{add=[63 (1878309140451819520)]} 0 0
2> 966763 INFO (TEST-TestReRankQParserPlugin.testMinExactCount-seed#[3DDF7021B5204DEF]) [ x:collection1] o.a.s.u.p.LogUpdateProcessorFactory path=/update params={{params(wt=xml),defaults(wt=xml)}}{add=[64 (1878309140452868096)]} 0 2
2> 966764 INFO (TEST-TestReRankQParserPlugin.testMinExactCount-seed#[3DDF7021B5204DEF]) [ x:collection1] o.a.s.u.p.LogUpdateProcessorFactory path=/update params={{params(wt=xml),defaults(wt=xml)}}{add=[65 (1878309140457062400)]} 0 0
2> 966765 INFO (TEST-TestReRankQParserPlugin.testMinExactCount-seed#[3DDF7021B5204DEF]) [ x:collection1] o.a.s.u.p.LogUpdateProcessorFactory path=/update params={{params(wt=xml),defaults(wt=xml)}}{add=[66 (1878309140458110976)]} 0 0
2> 966766 INFO (TEST-TestReRankQParserPlugin.testMinExactCount-seed#[3DDF7021B5204DEF]) [ x:collection1] o.a.s.u.p.LogUpdateProcessorFactory path=/update params={{params(wt=xml),defaults(wt=xml)}}{add=[67 (1878309140459159552)]} 0 0
2> 966767 INFO (TEST-TestReRankQParserPlugin.testMinExactCount-seed#[3DDF7021B5204DEF]) [ x:collection1] o.a.s.u.p.LogUpdateProcessorFactory path=/update params={{params(wt=xml),defaults(wt=xml)}}{add=[68 (1878309140460208128)]} 0 0
2> 966770 INFO (TEST-TestReRankQParserPlugin.testMinExactCount-seed#[3DDF7021B5204DEF]) [ x:collection1] o.a.s.u.p.LogUpdateProcessorFactory path=/update params={{params(wt=xml),defaults(wt=xml)}}{add=[69 (1878309140461256704)]} 0 2
2> 966772 INFO (TEST-TestReRankQParserPlugin.testMinExactCount-seed#[3DDF7021B5204DEF]) [ x:collection1] o.a.s.u.p.LogUpdateProcessorFactory path=/update params={{params(wt=xml),defaults(wt=xml)}}{add=[70 (1878309140464402432)]} 0 0
2> 966773 INFO (TEST-TestReRankQParserPlugin.testMinExactCount-seed#[3DDF7021B5204DEF]) [ x:collection1] o.a.s.u.p.LogUpdateProcessorFactory path=/update params={{params(wt=xml),defaults(wt=xml)}}{add=[71 (1878309140465451008)]} 0 0
2> 966774 INFO (TEST-TestReRankQParserPlugin.testMinExactCount-seed#[3DDF7021B5204DEF]) [ x:collection1] o.a.s.u.p.LogUpdateProcessorFactory path=/update params={{params(wt=xml),defaults(wt=xml)}}{add=[72 (1878309140466499584)]} 0 0
2> 966774 INFO (TEST-TestReRankQParserPlugin.testMinExactCount-seed#[3DDF7021B5204DEF]) [ x:collection1] o.a.s.u.p.LogUpdateProcessorFactory path=/update params={{params(wt=xml),defaults(wt=xml)}}{add=[73 (1878309140467548160)]} 0 0
2> 966778 INFO (TEST-TestReRankQParserPlugin.testMinExactCount-seed#[3DDF7021B5204DEF]) [ x:collection1] o.a.s.u.p.LogUpdateProcessorFactory path=/update params={{params(wt=xml),defaults(wt=xml)}}{add=[74 (1878309140468596736)]} 0 2
2> 966779 INFO (TEST-TestReRankQParserPlugin.testMinExactCount-seed#[3DDF7021B5204DEF]) [ x:collection1] o.a.s.u.p.LogUpdateProcessorFactory path=/update params={{params(wt=xml),defaults(wt=xml)}}{add=[75 (1878309140471742464)]} 0 0
2> 966780 INFO (TEST-TestReRankQParserPlugin.testMinExactCount-seed#[3DDF7021B5204DEF]) [ x:collection1] o.a.s.u.p.LogUpdateProcessorFactory path=/update params={{params(wt=xml),defaults(wt=xml)}}{add=[76 (1878309140472791040)]} 0 0
2> 966781 INFO (TEST-TestReRankQParserPlugin.testMinExactCount-seed#[3DDF7021B5204DEF]) [ x:collection1] o.a.s.u.p.LogUpdateProcessorFactory path=/update params={{params(wt=xml),defaults(wt=xml)}}{add=[77 (1878309140473839616)]} 0 0
2> 966782 INFO (TEST-TestReRankQParserPlugin.testMinExactCount-seed#[3DDF7021B5204DEF]) [ x:collection1] o.a.s.u.p.LogUpdateProcessorFactory path=/update params={{params(wt=xml),defaults(wt=xml)}}{add=[78 (1878309140474888192)]} 0 0
2> 966785 INFO (TEST-TestReRankQParserPlugin.testMinExactCount-seed#[3DDF7021B5204DEF]) [ x:collection1] o.a.s.u.p.LogUpdateProcessorFactory path=/update params={{params(wt=xml),defaults(wt=xml)}}{add=[79 (1878309140475936768)]} 0 2
2> 966786 INFO (TEST-TestReRankQParserPlugin.testMinExactCount-seed#[3DDF7021B5204DEF]) [ x:collection1] o.a.s.u.p.LogUpdateProcessorFactory path=/update params={{params(wt=xml),defaults(wt=xml)}}{add=[80 (1878309140479082496)]} 0 0
2> 966787 INFO (TEST-TestReRankQParserPlugin.testMinExactCount-seed#[3DDF7021B5204DEF]) [ x:collection1] o.a.s.u.p.LogUpdateProcessorFactory path=/update params={{params(wt=xml),defaults(wt=xml)}}{add=[81 (1878309140481179648)]} 0 0
2> 966788 INFO (TEST-TestReRankQParserPlugin.testMinExactCount-seed#[3DDF7021B5204DEF]) [ x:collection1] o.a.s.u.p.LogUpdateProcessorFactory path=/update params={{params(wt=xml),defaults(wt=xml)}}{add=[82 (1878309140481179649)]} 0 0
2> 966789 INFO (TEST-TestReRankQParserPlugin.testMinExactCount-seed#[3DDF7021B5204DEF]) [ x:collection1] o.a.s.u.p.LogUpdateProcessorFactory path=/update params={{params(wt=xml),defaults(wt=xml)}}{add=[83 (1878309140482228224)]} 0 0
2> 966792 INFO (TEST-TestReRankQParserPlugin.testMinExactCount-seed#[3DDF7021B5204DEF]) [ x:collection1] o.a.s.u.p.LogUpdateProcessorFactory path=/update params={{params(wt=xml),defaults(wt=xml)}}{add=[84 (1878309140483276800)]} 0 3
2> 966794 INFO (TEST-TestReRankQParserPlugin.testMinExactCount-seed#[3DDF7021B5204DEF]) [ x:collection1] o.a.s.u.p.LogUpdateProcessorFactory path=/update params={{params(wt=xml),defaults(wt=xml)}}{add=[85 (1878309140487471104)]} 0 0
2> 966795 INFO (TEST-TestReRankQParserPlugin.testMinExactCount-seed#[3DDF7021B5204DEF]) [ x:collection1] o.a.s.u.p.LogUpdateProcessorFactory path=/update params={{params(wt=xml),defaults(wt=xml)}}{add=[86 (1878309140488519680)]} 0 0
2> 966796 INFO (TEST-TestReRankQParserPlugin.testMinExactCount-seed#[3DDF7021B5204DEF]) [ x:collection1] o.a.s.u.p.LogUpdateProcessorFactory path=/update params={{params(wt=xml),defaults(wt=xml)}}{add=[87 (1878309140489568256)]} 0 0
2> 966796 INFO (TEST-TestReRankQParserPlugin.testMinExactCount-seed#[3DDF7021B5204DEF]) [ x:collection1] o.a.s.u.p.LogUpdateProcessorFactory path=/update params={{params(wt=xml),defaults(wt=xml)}}{add=[88 (1878309140490616832)]} 0 0
2> 966800 INFO (TEST-TestReRankQParserPlugin.testMinExactCount-seed#[3DDF7021B5204DEF]) [ x:collection1] o.a.s.u.p.LogUpdateProcessorFactory path=/update params={{params(wt=xml),defaults(wt=xml)}}{add=[89 (1878309140491665408)]} 0 3
2> 966801 INFO (TEST-TestReRankQParserPlugin.testMinExactCount-seed#[3DDF7021B5204DEF]) [ x:collection1] o.a.s.u.p.LogUpdateProcessorFactory path=/update params={{params(wt=xml),defaults(wt=xml)}}{add=[90 (1878309140494811136)]} 0 0
2> 966802 INFO (TEST-TestReRankQParserPlugin.testMinExactCount-seed#[3DDF7021B5204DEF]) [ x:collection1] o.a.s.u.p.LogUpdateProcessorFactory path=/update params={{params(wt=xml),defaults(wt=xml)}}{add=[91 (1878309140495859712)]} 0 0
2> 966803 INFO (TEST-TestReRankQParserPlugin.testMinExactCount-seed#[3DDF7021B5204DEF]) [ x:collection1] o.a.s.u.p.LogUpdateProcessorFactory path=/update params={{params(wt=xml),defaults(wt=xml)}}{add=[92 (1878309140496908288)]} 0 0
2> 966804 INFO (TEST-TestReRankQParserPlugin.testMinExactCount-seed#[3DDF7021B5204DEF]) [ x:collection1] o.a.s.u.p.LogUpdateProcessorFactory path=/update params={{params(wt=xml),defaults(wt=xml)}}{add=[93 (1878309140497956864)]} 0 0
2> 966807 INFO (TEST-TestReRankQParserPlugin.testMinExactCount-seed#[3DDF7021B5204DEF]) [ x:collection1] o.a.s.u.p.LogUpdateProcessorFactory path=/update params={{params(wt=xml),defaults(wt=xml)}}{add=[94 (1878309140499005440)]} 0 3
2> 966808 INFO (TEST-TestReRankQParserPlugin.testMinExactCount-seed#[3DDF7021B5204DEF]) [ x:collection1] o.a.s.u.p.LogUpdateProcessorFactory path=/update params={{params(wt=xml),defaults(wt=xml)}}{add=[95 (1878309140503199744)]} 0 0
2> 966809 INFO (TEST-TestReRankQParserPlugin.testMinExactCount-seed#[3DDF7021B5204DEF]) [ x:collection1] o.a.s.u.p.LogUpdateProcessorFactory path=/update params={{params(wt=xml),defaults(wt=xml)}}{add=[96 (1878309140504248320)]} 0 0
2> 966810 INFO (TEST-TestReRankQParserPlugin.testMinExactCount-seed#[3DDF7021B5204DEF]) [ x:collection1] o.a.s.u.p.LogUpdateProcessorFactory path=/update params={{params(wt=xml),defaults(wt=xml)}}{add=[97 (1878309140505296896)]} 0 0
2> 966811 INFO (TEST-TestReRankQParserPlugin.testMinExactCount-seed#[3DDF7021B5204DEF]) [ x:collection1] o.a.s.u.p.LogUpdateProcessorFactory path=/update params={{params(wt=xml),defaults(wt=xml)}}{add=[98 (1878309140506345472)]} 0 0
2> 966815 INFO (TEST-TestReRankQParserPlugin.testMinExactCount-seed#[3DDF7021B5204DEF]) [ x:collection1] o.a.s.u.p.LogUpdateProcessorFactory path=/update params={{params(wt=xml),defaults(wt=xml)}}{add=[99 (1878309140507394048)]} 0 3
2> 966816 INFO (TEST-TestReRankQParserPlugin.testMinExactCount-seed#[3DDF7021B5204DEF]) [ x:collection1] o.a.s.u.p.LogUpdateProcessorFactory path=/update params={{params(wt=xml),defaults(wt=xml)}}{add=[100 (1878309140510539776)]} 0 0
2> 966817 INFO (TEST-TestReRankQParserPlugin.testMinExactCount-seed#[3DDF7021B5204DEF]) [ x:collection1] o.a.s.u.p.LogUpdateProcessorFactory path=/update params={{params(wt=xml),defaults(wt=xml)}}{add=[101 (1878309140511588352)]} 0 0
2> 966818 INFO (TEST-TestReRankQParserPlugin.testMinExactCount-seed#[3DDF7021B5204DEF]) [ x:collection1] o.a.s.u.p.LogUpdateProcessorFactory path=/update params={{params(wt=xml),defaults(wt=xml)}}{add=[102 (1878309140512636928)]} 0 0
2> 966819 INFO (TEST-TestReRankQParserPlugin.testMinExactCount-seed#[3DDF7021B5204DEF]) [ x:collection1] o.a.s.u.p.LogUpdateProcessorFactory path=/update params={{params(wt=xml),defaults(wt=xml)}}{add=[103 (1878309140513685504)]} 0 0
2> 966822 INFO (TEST-TestReRankQParserPlugin.testMinExactCount-seed#[3DDF7021B5204DEF]) [ x:collection1] o.a.s.u.p.LogUpdateProcessorFactory path=/update params={{params(wt=xml),defaults(wt=xml)}}{add=[104 (1878309140514734080)]} 0 3
2> 966823 INFO (TEST-TestReRankQParserPlugin.testMinExactCount-seed#[3DDF7021B5204DEF]) [ x:collection1] o.a.s.u.p.LogUpdateProcessorFactory path=/update params={{params(wt=xml),defaults(wt=xml)}}{add=[105 (1878309140518928384)]} 0 0
2> 966824 INFO (TEST-TestReRankQParserPlugin.testMinExactCount-seed#[3DDF7021B5204DEF]) [ x:collection1] o.a.s.u.p.LogUpdateProcessorFactory path=/update params={{params(wt=xml),defaults(wt=xml)}}{add=[106 (1878309140519976960)]} 0 0
2> 966825 INFO (TEST-TestReRankQParserPlugin.testMinExactCount-seed#[3DDF7021B5204DEF]) [ x:collection1] o.a.s.u.p.LogUpdateProcessorFactory path=/update params={{params(wt=xml),defaults(wt=xml)}}{add=[107 (1878309140521025536)]} 0 0
2> 966826 INFO (TEST-TestReRankQParserPlugin.testMinExactCount-seed#[3DDF7021B5204DEF]) [ x:collection1] o.a.s.u.p.LogUpdateProcessorFactory path=/update params={{params(wt=xml),defaults(wt=xml)}}{add=[108 (1878309140522074112)]} 0 0
2> 966830 INFO (TEST-TestReRankQParserPlugin.testMinExactCount-seed#[3DDF7021B5204DEF]) [ x:collection1] o.a.s.u.p.LogUpdateProcessorFactory path=/update params={{params(wt=xml),defaults(wt=xml)}}{add=[109 (1878309140523122688)]} 0 3
2> 966831 INFO (TEST-TestReRankQParserPlugin.testMinExactCount-seed#[3DDF7021B5204DEF]) [ x:collection1] o.a.s.u.p.LogUpdateProcessorFactory path=/update params={{params(wt=xml),defaults(wt=xml)}}{add=[110 (1878309140526268416)]} 0 0
2> 966832 INFO (TEST-TestR
[...truncated too long message...]
nnot be instantiated.
java.security.policy: error adding Permission, java.net.URLPermission:
java.util.ServiceConfigurationError: Locale provider adapter "CLDR"cannot be instantiated.
java.security.policy: error adding Permission, java.net.URLPermission:
java.util.ServiceConfigurationError: Locale provider adapter "CLDR"cannot be instantiated.
java.security.policy: error adding Permission, java.net.URLPermission:
java.util.ServiceConfigurationError: Locale provider adapter "CLDR"cannot be instantiated.
java.security.policy: error adding Permission, java.net.URLPermission:
java.util.ServiceConfigurationError: Locale provider adapter "CLDR"cannot be instantiated.
java.security.policy: error adding Permission, java.net.URLPermission:
java.util.ServiceConfigurationError: Locale provider adapter "CLDR"cannot be instantiated.
java.security.policy: error adding Permission, java.net.URLPermission:
java.util.ServiceConfigurationError: Locale provider adapter "CLDR"cannot be instantiated.
java.security.policy: error adding Permission, java.net.URLPermission:
java.util.ServiceConfigurationError: Locale provider adapter "CLDR"cannot be instantiated.
java.security.policy: error adding Permission, java.net.URLPermission:
java.util.ServiceConfigurationError: Locale provider adapter "CLDR"cannot be instantiated.
java.security.policy: error adding Permission, java.net.URLPermission:
java.util.ServiceConfigurationError: Locale provider adapter "CLDR"cannot be instantiated.
java.security.policy: error adding Permission, java.net.URLPermission:
java.util.ServiceConfigurationError: Locale provider adapter "CLDR"cannot be instantiated.
java.security.policy: error adding Permission, java.net.URLPermission:
java.util.ServiceConfigurationError: Locale provider adapter "CLDR"cannot be instantiated.
java.security.policy: error adding Permission, java.net.URLPermission:
java.util.ServiceConfigurationError: Locale provider adapter "CLDR"cannot be instantiated.
java.security.policy: error adding Permission, java.net.URLPermission:
java.util.ServiceConfigurationError: Locale provider adapter "CLDR"cannot be instantiated.
java.security.policy: error adding Permission, java.net.URLPermission:
java.util.ServiceConfigurationError: Locale provider adapter "CLDR"cannot be instantiated.
java.security.policy: error adding Permission, java.net.URLPermission:
java.util.ServiceConfigurationError: Locale provider adapter "CLDR"cannot be instantiated.
java.security.policy: error adding Permission, java.net.URLPermission:
java.util.ServiceConfigurationError: Locale provider adapter "CLDR"cannot be instantiated.
java.security.policy: error adding Permission, java.net.URLPermission:
java.util.ServiceConfigurationError: Locale provider adapter "CLDR"cannot be instantiated.
java.security.policy: error adding Permission, java.net.URLPermission:
java.util.ServiceConfigurationError: Locale provider adapter "CLDR"cannot be instantiated.
:solr:modules:scripting:test (SUCCESS): 24 test(s), 19 skipped
> Task :solr:modules:scripting:wipeTaskTemp
> Task :solr:modules:sql:compileTestJava
> Task :solr:modules:sql:copySolrCoreTestResources
> Task :solr:modules:sql:processTestResources
> Task :solr:modules:sql:testClasses
> Task :solr:modules:sql:test
WARNING: Using incubator modules: jdk.incubator.vector
WARNING: Using incubator modules: jdk.incubator.vector
WARNING: Using incubator modules: jdk.incubator.vector
WARNING: A command line option has enabled the Security Manager
WARNING: The Security Manager is deprecated and will be removed in a future release
WARNING: A command line option has enabled the Security Manager
WARNING: The Security Manager is deprecated and will be removed in a future release
WARNING: A command line option has enabled the Security Manager
WARNING: The Security Manager is deprecated and will be removed in a future release
java.security.policy: error adding Permission, java.net.URLPermission:
java.util.ServiceConfigurationError: Locale provider adapter "CLDR"cannot be instantiated.
java.security.policy: error adding Permission, java.net.URLPermission:
java.util.ServiceConfigurationError: Locale provider adapter "CLDR"cannot be instantiated.
java.security.policy: error adding Permission, java.net.URLPermission:
java.util.ServiceConfigurationError: Locale provider adapter "CLDR"cannot be instantiated.
java.security.policy: error adding Permission, java.net.URLPermission:
java.util.ServiceConfigurationError: Locale provider adapter "CLDR"cannot be instantiated.
java.security.policy: error adding Permission, java.net.URLPermission:
java.util.ServiceConfigurationError: Locale provider adapter "CLDR"cannot be instantiated.
java.security.policy: error adding Permission, java.net.URLPermission:
java.util.ServiceConfigurationError: Locale provider adapter "CLDR"cannot be instantiated.
java.security.policy: error adding Permission, java.net.URLPermission:
java.util.ServiceConfigurationError: Locale provider adapter "CLDR"cannot be instantiated.
java.security.policy: error adding Permission, java.net.URLPermission:
java.util.ServiceConfigurationError: Locale provider adapter "CLDR"cannot be instantiated.
java.security.policy: error adding Permission, java.net.URLPermission:
java.util.ServiceConfigurationError: Locale provider adapter "CLDR"cannot be instantiated.
java.security.policy: error adding Permission, java.net.URLPermission:
java.util.ServiceConfigurationError: Locale provider adapter "CLDR"cannot be instantiated.
java.security.policy: error adding Permission, java.net.URLPermission:
java.security.policy: error adding Permission, java.net.URLPermission:
java.util.ServiceConfigurationError: Locale provider adapter "CLDR"cannot be instantiated.
java.util.ServiceConfigurationError: Locale provider adapter "CLDR"cannot be instantiated.
java.security.policy: error adding Permission, java.net.URLPermission:
java.util.ServiceConfigurationError: Locale provider adapter "CLDR"cannot be instantiated.
java.security.policy: error adding Permission, java.net.URLPermission:
java.util.ServiceConfigurationError: Locale provider adapter "CLDR"cannot be instantiated.
java.security.policy: error adding Permission, java.net.URLPermission:
java.util.ServiceConfigurationError: Locale provider adapter "CLDR"cannot be instantiated.
:solr:modules:sql:test (SUCCESS): 36 test(s)
> Task :checkWorkingCopyClean
> Task :solr:modules:sql:wipeTaskTemp
The slowest tests (exceeding 500 ms) during this run:
71.05s TestCpuAllowedLimit.testDistribLimit2 (:solr:core)
64.81s TestRandomCollapseQParserPlugin.testRandomCollapseWithSort (:solr:core)
56.74s TestCloudJSONFacetSKG.testRandom (:solr:core)
56.44s TestCpuAllowedLimit.testDistribLimit (:solr:core)
41.51s PeerSyncReplicationTest.test (:solr:core)
40.15s HttpJettySolrClientTest.testIdleTimeoutWithHttpClient (:solr:solrj-jetty)
35.74s TestRandomFaceting.testRandomFaceting (:solr:core)
34.56s TestCloudSearcherWarming.testPeersyncFailureReplicationSuccess (:solr:core)
31.63s TestRangeQuery.testCompareTypesRandomRangeQueries (:solr:core)
30.96s BasicDistributedZkTest.test (:solr:core)
The slowest suites (exceeding 1s) during this run:
133.32s TestCpuAllowedLimit (:solr:core)
81.56s LeaderElectionIntegrationTest (:solr:core)
72.06s TestRecovery (:solr:core)
71.15s TestRandomCollapseQParserPlugin (:solr:core)
69.18s KnnQParserTest (:solr:core)
67.47s TestCoordinatorRole (:solr:core)
60.82s TestCloudJSONFacetSKG (:solr:core)
58.60s MultiThreadedOCPTest (:solr:core)
54.41s HttpJettySolrClientTest (:solr:solrj-jetty)
54.29s CombinedQuerySolrCloudTest (:solr:core)
ERROR: The following test(s) have failed:
- org.apache.solr.search.TestReRankQParserPlugin.testMinExactCount (:solr:core)
Test history: https://develocity.apache.org/scans/tests?search.rootProjectNames=solr-root&tests.container=org.apache.solr.search.TestReRankQParserPlugin&tests.test=testMinExactCount http://fucit.org/solr-jenkins-reports/history-trend-of-recent-failures.html#series/org.apache.solr.search.TestReRankQParserPlugin.testMinExactCount
Test output: /home/jenkins/jenkins-agent/workspace/Solr/Solr-Test-10.1/solr/core/build/test-results/test/outputs/OUTPUT-org.apache.solr.search.TestReRankQParserPlugin.txt
Reproduce with: ./gradlew :solr:core:test --tests "org.apache.solr.search.TestReRankQParserPlugin.testMinExactCount" -Ptests.haltonfailure=false "-Ptests.jvmargs=-XX:TieredStopAtLevel=1 -XX:+UseParallelGC -XX:ActiveProcessorCount=1 -XX:ReservedCodeCacheSize=120m" -Ptests.seed=3DDF7021B5204DEF -Ptests.multiplier=2 -Ptests.useSecurityManager=true -Ptests.badapples=false -Ptests.file.encoding=UTF-8
[Incubating] Problems report is available at: file:///home/jenkins/jenkins-agent/workspace/Solr/Solr-Test-10.1/build/reports/problems/problems-report.html
Deprecated Gradle features were used in this build, making it incompatible with Gradle 10.
You can use '--warning-mode all' to show the individual deprecation warnings and determine if they come from your own scripts or plugins.
For more on this, please refer to https://docs.gradle.org/9.7.0/userguide/command_line_interface.html#sec:command_line_warnings in the Gradle documentation.
BUILD SUCCESSFUL in 39m 5s
159 actionable tasks: 159 executed
Publishing Build Scan to Develocity...
The Develocity server (develocity.apache.org) rejected the credential with prefix '7x3jzizm4zpygv7psbkg6byvm4'.
Your credential has expired.
Build step 'Invoke Gradle script' changed build result to SUCCESS
Archiving artifacts
‘**/*.events’ doesn’t match anything: ‘**’ exists but not ‘**/*.events’
No artifacts found that match the file pattern "**/*.events,heapdumps/**,**/hs_err_pid*". Configuration error?
Recording test results
[Checks API] No suitable checks publisher found.
Build step 'Publish JUnit test result report' changed build result to UNSTABLE
Email was triggered for: Unstable (Test Failures)
Sending email for trigger: Unstable (Test Failures)