You are viewing a plain text version of this content. The canonical link for it is here.
Posted to scm@geronimo.apache.org by pr...@apache.org on 2007/09/27 23:40:15 UTC

[BUILD] 2.1: Successful

OpenEJB trunk at 579286
Geronimo Revision: 580140 built with tests included
 
See the full build-1600.log file at http://people.apache.org/~prasad/binaries/trunk/20070927/build-1600.log
 
Download the binaries from http://people.apache.org/~prasad/binaries/trunk/20070927
[INFO] BUILD SUCCESSFUL
[INFO] ------------------------------------------------------------------------
[INFO] Total time: 28 minutes 17 seconds
[INFO] Finished at: Thu Sep 27 16:52:41 EDT 2007
[INFO] Final Memory: 219M/996M
[INFO] ------------------------------------------------------------------------
 
TESTSUITE RESULTS (Failures only)
=================================
See detailed results at http://people.apache.org/~prasad/testsuite/ResultsSummary.html
See the full test-1600.log file at http://people.apache.org/~prasad/binaries/trunk/20070927/test-1600.log
 
[INFO] Running console-testsuite.advance-test
[INFO] Tests run: 12, Failures: 1, Errors: 0, Skipped: 0, Time elapsed: 138.593 sec <<< FAILURE!
--
[INFO] Running deployment-testsuite.jca-cms
[INFO] Tests run: 1, Failures: 1, Errors: 0, Skipped: 0, Time elapsed: 0.339 sec <<< FAILURE!
--
[INFO] Running web-testsuite.tomcat
[INFO] Tests run: 1, Failures: 1, Errors: 0, Skipped: 0, Time elapsed: 0.355 sec <<< FAILURE!
--
[INFO] Running web-testsuite.jetty
[INFO] Tests run: 1, Failures: 1, Errors: 0, Skipped: 0, Time elapsed: 30.104 sec <<< FAILURE!
--
[INFO] Running org.apache.geronimo.testsuite.testset.EJBJAXBTest
[INFO] Tests run: 1, Failures: 1, Errors: 0, Skipped: 0, Time elapsed: 0.206 sec <<< FAILURE!
--
[INFO] Running org.apache.geronimo.testsuite.testset.EJBJAXRTest
[INFO] Tests run: 1, Failures: 1, Errors: 0, Skipped: 0, Time elapsed: 0.229 sec <<< FAILURE!
--
[INFO] Running org.apache.geronimo.testsuite.testset.JaxRPCTest
[INFO] Tests run: 3, Failures: 1, Errors: 0, Skipped: 0, Time elapsed: 0.517 sec <<< FAILURE!
--
[INFO] Running org.apache.geronimo.testsuite.testset.EJBStaxTest
[INFO] Tests run: 1, Failures: 1, Errors: 0, Skipped: 0, Time elapsed: 0.228 sec <<< FAILURE!