You are viewing a plain text version of this content. The canonical link for it is here.
Posted to builds@cassandra.apache.org by Apache Jenkins Server <je...@builds.apache.org> on 2025/02/18 19:26:34 UTC
Build complete: Cassandra-trunk #2029 [UNSTABLE] 75ae84534476b7abf1650066898436625bbdcd3a
-------------------------------------------------------------------------------
Build Cassandra-trunk #2029 Still Unstable
URL: https://ci-cassandra.apache.org/job/Cassandra-trunk/2029/
-------------------------------------------------------------------------------
Changes:
[Michael Semb Wever] Adjust 5.0 and trunk Jenkinsfile's splits configuration
-------------------------------------------------------------------------------
Failed Tests:
27 tests failed.
FAILED: dtest-latest.cqlsh_tests.test_cqlsh_copy.TestCqlshCopy.Tests / dtest-latest jdk11 57/64 / test_round_trip_with_rate_file
FAILED: dtest-latest.materialized_views_test.TestMaterializedViews.Tests / dtest-latest jdk11 17/64 / test_complex_mv_select_statements
FAILED: dtest-latest.materialized_views_test.TestMaterializedViews.Tests / dtest-latest jdk17 36/64 / test_view_metadata_cleanup
FAILED: dtest-upgrade-large.upgrade_tests.upgrade_through_versions_test.TestProtoV4Upgrade_AllVersions_RandomPartitioner_EndsAt_Trunk_HEAD.Tests / dtest-upgrade-large jdk11 17/32 / test_parallel_upgrade
FAILED: org.apache.cassandra.auth.GrantAndRevokeTest.Tests / test jdk17 10/16 / testGrantOnAllKeyspaces-_jdk17_x86_64
FAILED: org.apache.cassandra.auth.GrantAndRevokeTest.Tests / test-cdc jdk11 2/8 / testGrantOnAllKeyspaces-cdc_jdk11_x86_64
FAILED: org.apache.cassandra.auth.GrantAndRevokeTest.Tests / test-oa jdk17 10/16 / testGrantOnAllKeyspaces-oa_jdk17_x86_64
FAILED: org.apache.cassandra.db.commitlog.CommitlogShutdownTest.Tests / test-latest jdk11 7/16 / testShutdownWithPendingTasks-latest_jdk11_x86_64
FAILED: org.apache.cassandra.net.ConnectionTest.Tests / test-oa jdk17 1/16 / testMessagePurging-oa_jdk17_x86_64
FAILED: org.apache.cassandra.fuzz.sai.MultiNodeSAITest.Tests / jvm-dtest jdk17 4/12 / mixedFilteringSaiTest-cassandra.testtag_IS_UNDEFINED
FAILED: org.apache.cassandra.fuzz.sai.MultiNodeSAITest.Tests / jvm-dtest jdk11 4/12 / mixedFilteringSaiTest-cassandra.testtag_IS_UNDEFINED
FAILED: org.apache.cassandra.transport.SimpleClientPerfTest.Tests / test-burn jdk11 2/2 / measureLargeWithCompression[5/v5]-_jdk11_x86_64
FAILED: org.apache.cassandra.transport.SimpleClientPerfTest.Tests / test-burn jdk17 2/2 / measureLargeWithCompression[5/v5]-_jdk17_x86_64
FAILED: org.apache.cassandra.transport.SimpleClientPerfTest.Tests / test-burn jdk11 2/2 / measureLargeWithCompression[6/v6-beta]-_jdk11_x86_64
FAILED: org.apache.cassandra.transport.SimpleClientPerfTest.Tests / test-burn jdk17 2/2 / measureLargeWithCompression[6/v6-beta]-_jdk17_x86_64
FAILED: org.apache.cassandra.transport.SimpleClientPerfTest.Tests / test-burn jdk11 2/2 / measureLarge[5/v5]-_jdk11_x86_64
FAILED: org.apache.cassandra.transport.SimpleClientPerfTest.Tests / test-burn jdk17 2/2 / measureLarge[5/v5]-_jdk17_x86_64
FAILED: org.apache.cassandra.transport.SimpleClientPerfTest.Tests / test-burn jdk11 2/2 / measureLarge[6/v6-beta]-_jdk11_x86_64
FAILED: org.apache.cassandra.transport.SimpleClientPerfTest.Tests / test-burn jdk17 2/2 / measureLarge[6/v6-beta]-_jdk17_x86_64
FAILED: org.apache.cassandra.db.compaction.CorruptedSSTablesCompactionsTest.Tests / test-compression jdk11 16/16 / testCorruptedSSTablesWithUnifiedCompactionStrategyParallelized-compression_jdk11_x86_64
FAILED: org.apache.cassandra.db.compaction.CorruptedSSTablesCompactionsTest.Tests / test-compression jdk17 16/16 / testCorruptedSSTablesWithUnifiedCompactionStrategyParallelized-compression_jdk17_x86_64
FAILED: org.apache.cassandra.db.compaction.CorruptedSSTablesCompactionsTest.Tests / test-compression jdk11 16/16 / testCorruptedSSTablesWithLeveledCompactionStrategy-compression_jdk11_x86_64
FAILED: org.apache.cassandra.db.compaction.CorruptedSSTablesCompactionsTest.Tests / test-compression jdk17 16/16 / testCorruptedSSTablesWithLeveledCompactionStrategy-compression_jdk17_x86_64
FAILED: org.apache.cassandra.db.compaction.CorruptedSSTablesCompactionsTest.Tests / test-compression jdk11 16/16 / testCorruptedSSTablesWithSizeTieredCompactionStrategy-compression_jdk11_x86_64
FAILED: org.apache.cassandra.db.compaction.CorruptedSSTablesCompactionsTest.Tests / test-compression jdk17 16/16 / testCorruptedSSTablesWithSizeTieredCompactionStrategy-compression_jdk17_x86_64
FAILED: org.apache.cassandra.db.compaction.CorruptedSSTablesCompactionsTest.Tests / test-compression jdk11 16/16 / testCorruptedSSTablesWithUnifiedCompactionStrategy-compression_jdk11_x86_64
FAILED: org.apache.cassandra.db.compaction.CorruptedSSTablesCompactionsTest.Tests / test-compression jdk17 16/16 / testCorruptedSSTablesWithUnifiedCompactionStrategy-compression_jdk17_x86_64
-------------------------------------------------------------------------------
For complete test report and logs see https://nightlies.apache.org/cassandra/Cassandra-trunk/2029/