You are viewing a plain text version of this content. The canonical link for it is here.
Posted to builds@beam.apache.org by Apache Jenkins Server <je...@builds.apache.org> on 2023/04/11 23:24:08 UTC

Build failed in Jenkins: beam_PostCommit_XVR_PythonUsingJava_Dataflow #1751

See <https://ci-beam.apache.org/job/beam_PostCommit_XVR_PythonUsingJava_Dataflow/1751/display/redirect>

Changes:


------------------------------------------
[...truncated 664.98 KB...]
#8 11.10 Collecting google-resumable-media==2.4.1
#8 11.12   Downloading google_resumable_media-2.4.1-py2.py3-none-any.whl (77 kB)
#8 11.12      ━━━━━━━━━━━━━━━━━━━━━━━━━━━━━━━━━━━━━━━━ 77.7/77.7 kB 11.1 MB/s eta 0:00:00
#8 11.17 Collecting googleapis-common-protos==1.59.0
#8 11.19   Downloading googleapis_common_protos-1.59.0-py2.py3-none-any.whl (223 kB)
#8 11.20      ━━━━━━━━━━━━━━━━━━━━━━━━━━━━━━━━━━━━━━ 223.6/223.6 kB 25.5 MB/s eta 0:00:00
#8 11.45 Collecting greenlet==2.0.2
#8 11.47   Downloading greenlet-2.0.2-cp311-cp311-manylinux_2_17_x86_64.manylinux2014_x86_64.whl (618 kB)
#8 11.48      ━━━━━━━━━━━━━━━━━━━━━━━━━━━━━━━━━━━━━━ 618.8/618.8 kB 46.5 MB/s eta 0:00:00
#8 11.52 Collecting grpc-google-iam-v1==0.12.6
#8 11.54   Downloading grpc_google_iam_v1-0.12.6-py2.py3-none-any.whl (26 kB)
#8 12.53 Collecting grpcio==1.53.0
#8 12.55   Downloading grpcio-1.53.0-cp311-cp311-manylinux_2_17_x86_64.manylinux2014_x86_64.whl (4.9 MB)
#8 12.62      ━━━━━━━━━━━━━━━━━━━━━━━━━━━━━━━━━━━━━━━━ 4.9/4.9 MB 70.2 MB/s eta 0:00:00
#8 12.69 Collecting grpcio-status==1.53.0
#8 12.71   Downloading grpcio_status-1.53.0-py3-none-any.whl (5.1 kB)
#8 12.81 Collecting h5py==3.8.0
#8 12.84   Downloading h5py-3.8.0-cp311-cp311-manylinux_2_17_x86_64.manylinux2014_x86_64.whl (4.7 MB)
#8 12.90      ━━━━━━━━━━━━━━━━━━━━━━━━━━━━━━━━━━━━━━━━ 4.7/4.7 MB 76.4 MB/s eta 0:00:00
#8 13.05 Collecting hdfs==2.7.0
#8 13.06   Downloading hdfs-2.7.0-py3-none-any.whl (34 kB)
#8 13.11 Collecting httplib2==0.21.0
#8 13.12   Downloading httplib2-0.21.0-py3-none-any.whl (96 kB)
#8 13.13      ━━━━━━━━━━━━━━━━━━━━━━━━━━━━━━━━━━━━━━━━ 96.8/96.8 kB 13.2 MB/s eta 0:00:00
#8 13.80 Collecting hypothesis==6.70.2
#8 13.81   Downloading hypothesis-6.70.2-py3-none-any.whl (403 kB)
#8 13.83      ━━━━━━━━━━━━━━━━━━━━━━━━━━━━━━━━━━━━━━ 403.1/403.1 kB 29.4 MB/s eta 0:00:00
#8 13.87 Collecting idna==3.4
#8 13.89   Downloading idna-3.4-py3-none-any.whl (61 kB)
#8 13.90      ━━━━━━━━━━━━━━━━━━━━━━━━━━━━━━━━━━━━━━━━ 61.5/61.5 kB 8.4 MB/s eta 0:00:00
#8 13.93 Collecting iniconfig==2.0.0
#8 13.95   Downloading iniconfig-2.0.0-py3-none-any.whl (5.9 kB)
#8 14.02 Collecting jax==0.4.8
#8 14.05   Downloading jax-0.4.8.tar.gz (1.2 MB)
#8 14.07      ━━━━━━━━━━━━━━━━━━━━━━━━━━━━━━━━━━━━━━━━ 1.2/1.2 MB 57.4 MB/s eta 0:00:00
#8 14.24   Installing build dependencies: started
#8 16.49   Installing build dependencies: finished with status 'done'
#8 16.50   Getting requirements to build wheel: started
#8 16.76   Getting requirements to build wheel: finished with status 'done'
#8 16.76   Preparing metadata (pyproject.toml): started
#8 17.11   Preparing metadata (pyproject.toml): finished with status 'done'
#8 17.17 Collecting joblib==1.2.0
#8 17.19   Downloading joblib-1.2.0-py3-none-any.whl (297 kB)
#8 17.20      ━━━━━━━━━━━━━━━━━━━━━━━━━━━━━━━━━━━━━━ 298.0/298.0 kB 28.2 MB/s eta 0:00:00
#8 17.25 Collecting keras==2.12.0
#8 17.27   Downloading keras-2.12.0-py2.py3-none-any.whl (1.7 MB)
#8 17.30      ━━━━━━━━━━━━━━━━━━━━━━━━━━━━━━━━━━━━━━━━ 1.7/1.7 MB 69.8 MB/s eta 0:00:00
#8 17.35 Collecting libclang==16.0.0
#8 17.37   Downloading libclang-16.0.0-py2.py3-none-manylinux2010_x86_64.whl (22.9 MB)
#8 17.67      ━━━━━━━━━━━━━━━━━━━━━━━━━━━━━━━━━━━━━━━━ 22.9/22.9 MB 49.0 MB/s eta 0:00:00
#8 17.79 Collecting Markdown==3.4.3
#8 17.81   Downloading Markdown-3.4.3-py3-none-any.whl (93 kB)
#8 17.82      ━━━━━━━━━━━━━━━━━━━━━━━━━━━━━━━━━━━━━━━━ 93.9/93.9 kB 12.6 MB/s eta 0:00:00
#8 17.92 Collecting MarkupSafe==2.1.2
#8 17.93   Downloading MarkupSafe-2.1.2-cp311-cp311-manylinux_2_17_x86_64.manylinux2014_x86_64.whl (27 kB)
#8 18.07 Collecting ml-dtypes==0.0.4
#8 18.09   Downloading ml_dtypes-0.0.4-cp311-cp311-manylinux_2_17_x86_64.manylinux2014_x86_64.whl (154 kB)
#8 18.10      ━━━━━━━━━━━━━━━━━━━━━━━━━━━━━━━━━━━━━━ 154.9/154.9 kB 19.4 MB/s eta 0:00:00
#8 18.16 Collecting mmh3==3.1.0
#8 18.18   Downloading mmh3-3.1.0-cp311-cp311-manylinux_2_5_x86_64.manylinux1_x86_64.manylinux_2_17_x86_64.manylinux2014_x86_64.whl (38 kB)
#8 18.27 Collecting mock==5.0.1
#8 18.29   Downloading mock-5.0.1-py3-none-any.whl (30 kB)
#8 18.34 Collecting nltk==3.8.1
#8 18.37   Downloading nltk-3.8.1-py3-none-any.whl (1.5 MB)
#8 18.40      ━━━━━━━━━━━━━━━━━━━━━━━━━━━━━━━━━━━━━━━━ 1.5/1.5 MB 65.4 MB/s eta 0:00:00
#8 18.44 Collecting nose==1.3.7
#8 18.46   Downloading nose-1.3.7-py3-none-any.whl (154 kB)
#8 18.47      ━━━━━━━━━━━━━━━━━━━━━━━━━━━━━━━━━━━━━━ 154.7/154.7 kB 18.8 MB/s eta 0:00:00
#8 18.85 Collecting numpy==1.23.5
#8 18.87   Downloading numpy-1.23.5-cp311-cp311-manylinux_2_17_x86_64.manylinux2014_x86_64.whl (17.1 MB)
#8 20.68      ━━━━━━━━━━━━━━━━━━━━━━━━━━━━━━━━━━━━━━━━ 17.1/17.1 MB 65.9 MB/s eta 0:00:00
#8 20.78 Collecting oauth2client==4.1.3
#8 20.80   Downloading oauth2client-4.1.3-py2.py3-none-any.whl (98 kB)
#8 20.81      ━━━━━━━━━━━━━━━━━━━━━━━━━━━━━━━━━━━━━━━━ 98.2/98.2 kB 12.7 MB/s eta 0:00:00
#8 20.86 Collecting oauthlib==3.2.2
#8 20.87   Downloading oauthlib-3.2.2-py3-none-any.whl (151 kB)
#8 20.88      ━━━━━━━━━━━━━━━━━━━━━━━━━━━━━━━━━━━━━━ 151.7/151.7 kB 18.9 MB/s eta 0:00:00
#8 20.92 Collecting objsize==0.6.1
#8 20.94   Downloading objsize-0.6.1-py3-none-any.whl (9.3 kB)
#8 20.98 Collecting opt-einsum==3.3.0
#8 20.99   Downloading opt_einsum-3.3.0-py3-none-any.whl (65 kB)
#8 21.00      ━━━━━━━━━━━━━━━━━━━━━━━━━━━━━━━━━━━━━━━━ 65.5/65.5 kB 9.0 MB/s eta 0:00:00
#8 21.38 Collecting orjson==3.8.9
#8 21.40   Downloading orjson-3.8.9-cp311-cp311-manylinux_2_28_x86_64.whl (144 kB)
#8 21.41      ━━━━━━━━━━━━━━━━━━━━━━━━━━━━━━━━━━━━━━ 144.1/144.1 kB 15.4 MB/s eta 0:00:00
#8 21.46 Collecting overrides==6.5.0
#8 21.47   Downloading overrides-6.5.0-py3-none-any.whl (17 kB)
#8 21.53 Collecting packaging==23.0
#8 21.54   Downloading packaging-23.0-py3-none-any.whl (42 kB)
#8 21.55      ━━━━━━━━━━━━━━━━━━━━━━━━━━━━━━━━━━━━━━━━ 42.7/42.7 kB 5.9 MB/s eta 0:00:00
#8 21.82 Collecting pandas==1.5.3
#8 21.84   Downloading pandas-1.5.3-cp311-cp311-manylinux_2_17_x86_64.manylinux2014_x86_64.whl (12.0 MB)
#8 21.97      ━━━━━━━━━━━━━━━━━━━━━━━━━━━━━━━━━━━━━━━━ 12.0/12.0 MB 89.9 MB/s eta 0:00:00
#8 22.06 Collecting parameterized==0.8.1
#8 22.07   Downloading parameterized-0.8.1-py2.py3-none-any.whl (26 kB)

> Task :sdks:python:installGcpTest

> Task :sdks:python:container:py311:docker FAILED
#8 22.12 Collecting pluggy==1.0.0
#8 22.13   Downloading pluggy-1.0.0-py2.py3-none-any.whl (13 kB)
#8 22.20 Collecting proto-plus==1.22.2
#8 22.21   Downloading proto_plus-1.22.2-py3-none-any.whl (47 kB)
#8 22.22      ━━━━━━━━━━━━━━━━━━━━━━━━━━━━━━━━━━━━━━━━ 47.9/47.9 kB 6.9 MB/s eta 0:00:00
#8 22.56 Collecting protobuf==4.22.1
#8 22.58   Downloading protobuf-4.22.1-cp37-abi3-manylinux2014_x86_64.whl (302 kB)
#8 22.60      ━━━━━━━━━━━━━━━━━━━━━━━━━━━━━━━━━━━━━━ 302.4/302.4 kB 28.9 MB/s eta 0:00:00
#8 22.75 Collecting psycopg2-binary==2.9.6
#8 22.78   Downloading psycopg2_binary-2.9.6-cp311-cp311-manylinux_2_17_x86_64.manylinux2014_x86_64.whl (3.0 MB)
#8 22.83      ━━━━━━━━━━━━━━━━━━━━━━━━━━━━━━━━━━━━━━━━ 3.0/3.0 MB 71.1 MB/s eta 0:00:00
#8 22.98 Collecting pyarrow==11.0.0
#8 23.00   Downloading pyarrow-11.0.0-cp311-cp311-manylinux_2_17_x86_64.manylinux2014_x86_64.whl (34.9 MB)
#8 23.53      ━━━━━━━━━━━━━━━━━━━━━━━━━━━━━━━━━━━━━━━━ 34.9/34.9 MB 31.8 MB/s eta 0:00:00
#8 23.71 Collecting pyasn1==0.4.8
#8 23.73   Downloading pyasn1-0.4.8-py2.py3-none-any.whl (77 kB)
#8 23.74      ━━━━━━━━━━━━━━━━━━━━━━━━━━━━━━━━━━━━━━━━ 77.1/77.1 kB 10.1 MB/s eta 0:00:00
#8 23.79 Collecting pyasn1-modules==0.2.8
#8 23.80   Downloading pyasn1_modules-0.2.8-py2.py3-none-any.whl (155 kB)
#8 23.82      ━━━━━━━━━━━━━━━━━━━━━━━━━━━━━━━━━━━━━━ 155.3/155.3 kB 13.7 MB/s eta 0:00:00
#8 23.96 Collecting pycparser==2.21
#8 23.98   Downloading pycparser-2.21-py2.py3-none-any.whl (118 kB)
#8 23.99      ━━━━━━━━━━━━━━━━━━━━━━━━━━━━━━━━━━━━━━ 118.7/118.7 kB 14.1 MB/s eta 0:00:00
#8 24.02 Collecting pydot==1.4.2
#8 24.04   Downloading pydot-1.4.2-py2.py3-none-any.whl (21 kB)
#8 24.09 Collecting PyHamcrest==1.10.1
#8 24.10   Downloading PyHamcrest-1.10.1-py3-none-any.whl (48 kB)
#8 24.11      ━━━━━━━━━━━━━━━━━━━━━━━━━━━━━━━━━━━━━━━━ 48.9/48.9 kB 6.0 MB/s eta 0:00:00
#8 24.65 Collecting pymongo==4.3.3
#8 24.68   Downloading pymongo-4.3.3-cp311-cp311-manylinux_2_17_x86_64.manylinux2014_x86_64.whl (494 kB)
#8 24.70      ━━━━━━━━━━━━━━━━━━━━━━━━━━━━━━━━━━━━━━ 494.9/494.9 kB 33.5 MB/s eta 0:00:00
#8 24.75 Collecting PyMySQL==1.0.3
#8 24.77   Downloading PyMySQL-1.0.3-py3-none-any.whl (43 kB)
#8 24.78      ━━━━━━━━━━━━━━━━━━━━━━━━━━━━━━━━━━━━━━━━ 43.7/43.7 kB 5.7 MB/s eta 0:00:00
#8 24.84 Collecting pyparsing==3.0.9
#8 24.86   Downloading pyparsing-3.0.9-py3-none-any.whl (98 kB)
#8 24.88      ━━━━━━━━━━━━━━━━━━━━━━━━━━━━━━━━━━━━━━━━ 98.3/98.3 kB 11.1 MB/s eta 0:00:00
#8 24.98 Collecting pytest==7.2.2
#8 25.07   Downloading pytest-7.2.2-py3-none-any.whl (317 kB)
#8 25.08      ━━━━━━━━━━━━━━━━━━━━━━━━━━━━━━━━━━━━━━ 317.2/317.2 kB 27.4 MB/s eta 0:00:00
#8 25.13 Collecting pytest-timeout==2.1.0
#8 25.14   Downloading pytest_timeout-2.1.0-py3-none-any.whl (12 kB)
#8 25.21 Collecting pytest-xdist==3.2.1
#8 25.23   Downloading pytest_xdist-3.2.1-py3-none-any.whl (41 kB)
#8 25.24      ━━━━━━━━━━━━━━━━━━━━━━━━━━━━━━━━━━━━━━━━ 41.0/41.0 kB 4.9 MB/s eta 0:00:00
#8 25.28 Collecting python-dateutil==2.8.2
#8 25.31   Downloading python_dateutil-2.8.2-py2.py3-none-any.whl (247 kB)
#8 25.32      ━━━━━━━━━━━━━━━━━━━━━━━━━━━━━━━━━━━━━━ 247.7/247.7 kB 25.1 MB/s eta 0:00:00
#8 25.41 Collecting pytz==2023.3
#8 25.43   Downloading pytz-2023.3-py2.py3-none-any.whl (502 kB)
#8 25.45      ━━━━━━━━━━━━━━━━━━━━━━━━━━━━━━━━━━━━━━ 502.3/502.3 kB 30.2 MB/s eta 0:00:00
#8 25.54 Collecting PyYAML==6.0
#8 25.56   Downloading PyYAML-6.0-cp311-cp311-manylinux_2_17_x86_64.manylinux2014_x86_64.whl (757 kB)
#8 25.58      ━━━━━━━━━━━━━━━━━━━━━━━━━━━━━━━━━━━━━━ 757.9/757.9 kB 42.2 MB/s eta 0:00:00
#8 26.34 Collecting regex==2023.3.23
#8 26.36   Downloading regex-2023.3.23-cp311-cp311-manylinux_2_17_x86_64.manylinux2014_x86_64.whl (780 kB)
#8 26.38      ━━━━━━━━━━━━━━━━━━━━━━━━━━━━━━━━━━━━━━ 781.0/781.0 kB 41.2 MB/s eta 0:00:00
#8 26.45 Collecting requests==2.28.2
#8 26.47   Downloading requests-2.28.2-py3-none-any.whl (62 kB)
#8 26.48      ━━━━━━━━━━━━━━━━━━━━━━━━━━━━━━━━━━━━━━━━ 62.8/62.8 kB 8.9 MB/s eta 0:00:00
#8 26.52 Collecting requests-mock==1.10.0
#8 26.53   Downloading requests_mock-1.10.0-py2.py3-none-any.whl (28 kB)
#8 26.57 Collecting requests-oauthlib==1.3.1
#8 26.59   Downloading requests_oauthlib-1.3.1-py2.py3-none-any.whl (23 kB)
#8 26.64 Collecting rsa==4.9
#8 26.65   Downloading rsa-4.9-py3-none-any.whl (34 kB)
#8 26.97 Collecting scikit-learn==1.2.2
#8 26.99   Downloading scikit_learn-1.2.2-cp311-cp311-manylinux_2_17_x86_64.manylinux2014_x86_64.whl (9.6 MB)
#8 27.10      ━━━━━━━━━━━━━━━━━━━━━━━━━━━━━━━━━━━━━━━━ 9.6/9.6 MB 88.4 MB/s eta 0:00:00
#8 27.39 Collecting scipy==1.10.1
#8 27.41   Downloading scipy-1.10.1-cp311-cp311-manylinux_2_17_x86_64.manylinux2014_x86_64.whl (34.1 MB)
#8 27.90      ━━━━━━━━━━━━━━━━━━━━━━━━━━━━━━━━━━━━━━━━ 34.1/34.1 MB 32.3 MB/s eta 0:00:00
#8 28.07 Collecting six==1.16.0
#8 28.09   Downloading six-1.16.0-py2.py3-none-any.whl (11 kB)
#8 28.14 Collecting sortedcontainers==2.4.0
#8 28.15   Downloading sortedcontainers-2.4.0-py2.py3-none-any.whl (29 kB)
#8 28.21 Collecting soupsieve==2.4
#8 28.23   Downloading soupsieve-2.4-py3-none-any.whl (37 kB)
#8 28.76 Collecting SQLAlchemy==1.4.47
#8 28.78   Downloading SQLAlchemy-1.4.47-cp311-cp311-manylinux_2_5_x86_64.manylinux1_x86_64.manylinux_2_17_x86_64.manylinux2014_x86_64.whl (1.6 MB)
#8 28.83      ━━━━━━━━━━━━━━━━━━━━━━━━━━━━━━━━━━━━━━━━ 1.6/1.6 MB 33.0 MB/s eta 0:00:00
#8 28.90 Collecting sqlparse==0.4.3
#8 28.92   Downloading sqlparse-0.4.3-py3-none-any.whl (42 kB)
#8 28.93      ━━━━━━━━━━━━━━━━━━━━━━━━━━━━━━━━━━━━━━━━ 42.8/42.8 kB 3.6 MB/s eta 0:00:00
#8 28.98 Collecting tenacity==8.2.2
#8 29.00   Downloading tenacity-8.2.2-py3-none-any.whl (24 kB)
#8 29.10 Collecting tensorboard==2.12.1
#8 29.12   Downloading tensorboard-2.12.1-py3-none-any.whl (5.6 MB)
#8 29.20      ━━━━━━━━━━━━━━━━━━━━━━━━━━━━━━━━━━━━━━━━ 5.6/5.6 MB 75.3 MB/s eta 0:00:00
#8 29.26 Collecting tensorboard-data-server==0.7.0
#8 29.28   Downloading tensorboard_data_server-0.7.0-py3-none-manylinux2014_x86_64.whl (6.6 MB)
#8 29.36      ━━━━━━━━━━━━━━━━━━━━━━━━━━━━━━━━━━━━━━━━ 6.6/6.6 MB 80.9 MB/s eta 0:00:00
#8 29.42 Collecting tensorboard-plugin-wit==1.8.1
#8 29.44   Downloading tensorboard_plugin_wit-1.8.1-py3-none-any.whl (781 kB)
#8 29.46      ━━━━━━━━━━━━━━━━━━━━━━━━━━━━━━━━━━━━━━ 781.3/781.3 kB 50.4 MB/s eta 0:00:00
#8 29.68 Collecting tensorflow==2.12.0
#8 29.69   Downloading tensorflow-2.12.0-cp311-cp311-manylinux_2_17_x86_64.manylinux2014_x86_64.whl (586.0 MB)
#8 30.80      ━━━━━╸                                  86.0/586.0 MB 84.0 MB/s eta 0:00:06
#8 31.08 ERROR: Wheel 'tensorflow' located at /tmp/pip-unpack-865x903y/tensorflow-2.12.0-cp311-cp311-manylinux_2_17_x86_64.manylinux2014_x86_64.whl is invalid.
#8 31.10 
#8 31.10 [notice] A new release of pip available: 22.3.1 -> 23.0.1
#8 31.10 [notice] To update, run: pip install --upgrade pip
#8 ERROR: executor failed running [/bin/sh -c pip install --no-deps -r /tmp/base_image_requirements.txt &&     python -c "import nltk; nltk.download('stopwords')" &&     rm /root/nltk_data/corpora/stopwords.zip &&     python -c "from google.protobuf.internal import api_implementation; assert api_implementation._implementation_type == 'upb'; print ('Verified fast protobuf used.')" &&     rm -rf /root/.cache/pip &&     rm -rf /tmp/base_image_requirements.txt]: exit code: 1
------
 > [beam  4/16] RUN     pip install --no-deps -r /tmp/base_image_requirements.txt &&     python -c "import nltk; nltk.download('stopwords')" &&     rm /root/nltk_data/corpora/stopwords.zip &&     python -c "from google.protobuf.internal import api_implementation; assert api_implementation._implementation_type == 'upb'; print ('Verified fast protobuf used.')" &&     rm -rf /root/.cache/pip &&     rm -rf /tmp/base_image_requirements.txt:
#8 29.42 Collecting tensorboard-plugin-wit==1.8.1
#8 29.44   Downloading tensorboard_plugin_wit-1.8.1-py3-none-any.whl (781 kB)
#8 29.46      ━━━━━━━━━━━━━━━━━━━━━━━━━━━━━━━━━━━━━━ 781.3/781.3 kB 50.4 MB/s eta 0:00:00
#8 29.68 Collecting tensorflow==2.12.0
#8 29.69   Downloading tensorflow-2.12.0-cp311-cp311-manylinux_2_17_x86_64.manylinux2014_x86_64.whl (586.0 MB)
#8 30.80      ━━━━━╸                                  86.0/586.0 MB 84.0 MB/s eta 0:00:06
#8 31.08 ERROR: Wheel 'tensorflow' located at /tmp/pip-unpack-865x903y/tensorflow-2.12.0-cp311-cp311-manylinux_2_17_x86_64.manylinux2014_x86_64.whl is invalid.
#8 31.10 
#8 31.10 [notice] A new release of pip available: 22.3.1 -> 23.0.1
#8 31.10 [notice] To update, run: pip install --upgrade pip
------
ERROR: failed to solve: executor failed running [/bin/sh -c pip install --no-deps -r /tmp/base_image_requirements.txt &&     python -c "import nltk; nltk.download('stopwords')" &&     rm /root/nltk_data/corpora/stopwords.zip &&     python -c "from google.protobuf.internal import api_implementation; assert api_implementation._implementation_type == 'upb'; print ('Verified fast protobuf used.')" &&     rm -rf /root/.cache/pip &&     rm -rf /tmp/base_image_requirements.txt]: exit code: 1

> Task :sdks:python:installGcpTest
Successfully installed PyJWT-2.6.0 apache-beam-2.48.0.dev0 attrs-22.2.0 azure-core-1.26.4 azure-identity-1.12.0 azure-storage-blob-12.15.0 boto3-1.26.111 botocore-1.29.111 cachetools-4.2.4 certifi-2022.12.7 cffi-1.15.1 charset-normalizer-3.1.0 cloudpickle-2.2.1 crcmod-1.7 cryptography-40.0.1 deprecation-2.1.0 dill-0.3.1.1 dnspython-2.3.0 docker-6.0.1 docopt-0.6.2 execnet-1.9.0 fastavro-1.7.3 fasteners-0.18 freezegun-1.2.2 google-api-core-2.11.0 google-apitools-0.5.31 google-auth-2.17.2 google-auth-httplib2-0.1.0 google-cloud-bigquery-3.9.0 google-cloud-bigquery-storage-2.19.1 google-cloud-bigtable-2.17.0 google-cloud-core-2.3.2 google-cloud-datastore-2.15.1 google-cloud-dlp-3.12.1 google-cloud-language-2.9.1 google-cloud-pubsub-2.16.0 google-cloud-pubsublite-1.8.1 google-cloud-recommendations-ai-0.10.3 google-cloud-spanner-3.30.0 google-cloud-videointelligence-2.11.1 google-cloud-vision-3.4.1 google-crc32c-1.5.0 google-resumable-media-2.4.1 googleapis-common-protos-1.59.0 greenlet-2.0.2 grpc-google-iam-v1-0.12.6 grpcio-status-1.53.0 hdfs-2.7.0 httplib2-0.21.0 hypothesis-6.71.0 idna-3.4 iniconfig-2.0.0 isodate-0.6.1 jmespath-1.0.1 joblib-1.2.0 mock-5.0.1 msal-1.21.0 msal-extensions-1.0.0 oauth2client-4.1.3 objsize-0.6.1 orjson-3.8.10 overrides-6.5.0 pandas-1.5.3 parameterized-0.8.1 portalocker-2.7.0 proto-plus-1.22.2 psycopg2-binary-2.9.6 pyarrow-11.0.0 pyasn1-0.4.8 pyasn1-modules-0.2.8 pycparser-2.21 pydot-1.4.2 pyhamcrest-1.10.1 pymongo-4.3.3 pymysql-1.0.3 pyparsing-3.0.9 pytest-7.3.0 pytest-timeout-2.1.0 pytest-xdist-3.2.1 python-dateutil-2.8.2 pytz-2023.3 pyyaml-6.0 regex-2023.3.23 requests-2.28.2 requests_mock-1.10.0 rsa-4.9 s3transfer-0.6.0 scikit-learn-1.2.2 scipy-1.10.1 sortedcontainers-2.4.0 sqlalchemy-1.4.47 sqlparse-0.4.3 tenacity-8.2.2 testcontainers-3.7.1 threadpoolctl-3.1.0 typing-extensions-4.5.0 urllib3-1.26.15 websocket-client-1.5.1 wrapt-1.15.0 zstandard-0.20.0

FAILURE: Build failed with an exception.

* What went wrong:
Execution failed for task ':sdks:python:container:py311:docker'.
> Process 'command 'docker'' finished with non-zero exit value 1

* Try:
> Run with --stacktrace option to get the stack trace.
> Run with --info or --debug option to get more log output.

* Get more help at https://help.gradle.org

Deprecated Gradle features were used in this build, making it incompatible with Gradle 8.0.

You can use '--warning-mode all' to show the individual deprecation warnings and determine if they come from your own scripts or plugins.

See https://docs.gradle.org/7.5.1/userguide/command_line_interface.html#sec:command_line_warnings

Execution optimizations have been disabled for 1 invalid unit(s) of work during this build to ensure correctness.
Please consult deprecation warnings for more details.

BUILD FAILED in 1m 41s
140 actionable tasks: 19 executed, 121 up-to-date

Publishing build scan...
https://gradle.com/s/kwlgvfuxwjdpw

Build step 'Invoke Gradle script' changed build result to FAILURE
Build step 'Invoke Gradle script' marked build as failure

---------------------------------------------------------------------
To unsubscribe, e-mail: builds-unsubscribe@beam.apache.org
For additional commands, e-mail: builds-help@beam.apache.org


Jenkins build is back to normal : beam_PostCommit_XVR_PythonUsingJava_Dataflow #1752

Posted by Apache Jenkins Server <je...@builds.apache.org>.
See <https://ci-beam.apache.org/job/beam_PostCommit_XVR_PythonUsingJava_Dataflow/1752/display/redirect>


---------------------------------------------------------------------
To unsubscribe, e-mail: builds-unsubscribe@beam.apache.org
For additional commands, e-mail: builds-help@beam.apache.org