You are viewing a plain text version of this content. The canonical link for it is here.
Posted to builds@solr.apache.org by Policeman Jenkins Server <je...@thetaphi.de> on 2023/11/07 19:03:16 UTC

[JENKINS] Solr-main-MacOSX (64bit/hotspot/jdk-17.0.5) - Build # 3598 - Still Failing!

Build: https://jenkins.thetaphi.de/job/Solr-main-MacOSX/3598/
Java: 64bit/hotspot/jdk-17.0.5 -XX:+UseCompressedOops -XX:+UseParallelGC

1 tests failed.
FAILED:  org.apache.solr.cloud.HttpPartitionOnCommitTest.test

Error Message:
org.apache.solr.client.solrj.impl.BaseHttpSolrClient$RemoteSolrException: Error from server at http://127.0.0.1:53691/solr: Underlying core creation failed while creating collection: c8n_2x2_commits

Stack Trace:
org.apache.solr.client.solrj.impl.BaseHttpSolrClient$RemoteSolrException: Error from server at http://127.0.0.1:53691/solr: Underlying core creation failed while creating collection: c8n_2x2_commits
	at __randomizedtesting.SeedInfo.seed([EBD2C8C636BB7B75:6386F71C9847168D]:0)
	at app//org.apache.solr.client.solrj.impl.HttpSolrClient.executeMethod(HttpSolrClient.java:734)
	at app//org.apache.solr.client.solrj.impl.HttpSolrClient.request(HttpSolrClient.java:253)
	at app//org.apache.solr.client.solrj.impl.HttpSolrClient.request(HttpSolrClient.java:234)
	at app//org.apache.solr.client.solrj.SolrClient.request(SolrClient.java:1193)
	at app//org.apache.solr.cloud.AbstractBasicDistributedZkTestBase.createCollection(AbstractBasicDistributedZkTestBase.java:1172)
	at app//org.apache.solr.cloud.AbstractFullDistribZkTestBase.createCollection(AbstractFullDistribZkTestBase.java:2023)
	at app//org.apache.solr.cloud.HttpPartitionOnCommitTest.multiShardTest(HttpPartitionOnCommitTest.java:76)
	at app//org.apache.solr.cloud.HttpPartitionOnCommitTest.test(HttpPartitionOnCommitTest.java:67)
	at java.base@17.0.5/jdk.internal.reflect.NativeMethodAccessorImpl.invoke0(Native Method)
	at java.base@17.0.5/jdk.internal.reflect.NativeMethodAccessorImpl.invoke(NativeMethodAccessorImpl.java:77)
	at java.base@17.0.5/jdk.internal.reflect.DelegatingMethodAccessorImpl.invoke(DelegatingMethodAccessorImpl.java:43)
	at java.base@17.0.5/java.lang.reflect.Method.invoke(Method.java:568)
	at app//com.carrotsearch.randomizedtesting.RandomizedRunner.invoke(RandomizedRunner.java:1758)
	at app//com.carrotsearch.randomizedtesting.RandomizedRunner$8.evaluate(RandomizedRunner.java:946)
	at app//com.carrotsearch.randomizedtesting.RandomizedRunner$9.evaluate(RandomizedRunner.java:982)
	at app//com.carrotsearch.randomizedtesting.RandomizedRunner$10.evaluate(RandomizedRunner.java:996)
	at app//org.apache.solr.BaseDistributedSearchTestCase$ShardsRepeatRule$ShardsFixedStatement.callStatement(BaseDistributedSearchTestCase.java:1079)
	at app//org.apache.solr.BaseDistributedSearchTestCase$ShardsRepeatRule$ShardsStatement.evaluate(BaseDistributedSearchTestCase.java:1050)
	at app//com.carrotsearch.randomizedtesting.rules.SystemPropertiesRestoreRule$1.evaluate(SystemPropertiesRestoreRule.java:80)
	at app//org.junit.rules.RunRules.evaluate(RunRules.java:20)
	at app//org.apache.lucene.tests.util.TestRuleSetupTeardownChained$1.evaluate(TestRuleSetupTeardownChained.java:48)
	at app//org.apache.lucene.tests.util.AbstractBeforeAfterRule$1.evaluate(AbstractBeforeAfterRule.java:43)
	at app//org.apache.lucene.tests.util.TestRuleThreadAndTestName$1.evaluate(TestRuleThreadAndTestName.java:45)
	at app//org.apache.lucene.tests.util.TestRuleIgnoreAfterMaxFailures$1.evaluate(TestRuleIgnoreAfterMaxFailures.java:60)
	at app//org.apache.lucene.tests.util.TestRuleMarkFailure$1.evaluate(TestRuleMarkFailure.java:44)
	at app//org.junit.rules.RunRules.evaluate(RunRules.java:20)
	at app//com.carrotsearch.randomizedtesting.rules.StatementAdapter.evaluate(StatementAdapter.java:36)
	at app//com.carrotsearch.randomizedtesting.ThreadLeakControl$StatementRunner.run(ThreadLeakControl.java:390)
	at app//com.carrotsearch.randomizedtesting.ThreadLeakControl.forkTimeoutingTask(ThreadLeakControl.java:843)
	at app//com.carrotsearch.randomizedtesting.ThreadLeakControl$3.evaluate(ThreadLeakControl.java:490)
	at app//com.carrotsearch.randomizedtesting.RandomizedRunner.runSingleTest(RandomizedRunner.java:955)
	at app//com.carrotsearch.randomizedtesting.RandomizedRunner$5.evaluate(RandomizedRunner.java:840)
	at app//com.carrotsearch.randomizedtesting.RandomizedRunner$6.evaluate(RandomizedRunner.java:891)
	at app//com.carrotsearch.randomizedtesting.RandomizedRunner$7.evaluate(RandomizedRunner.java:902)
	at app//com.carrotsearch.randomizedtesting.rules.StatementAdapter.evaluate(StatementAdapter.java:36)
	at app//com.carrotsearch.randomizedtesting.rules.StatementAdapter.evaluate(StatementAdapter.java:36)
	at app//org.apache.lucene.tests.util.AbstractBeforeAfterRule$1.evaluate(AbstractBeforeAfterRule.java:43)
	at app//com.carrotsearch.randomizedtesting.rules.SystemPropertiesRestoreRule$1.evaluate(SystemPropertiesRestoreRule.java:80)
	at app//org.junit.rules.RunRules.evaluate(RunRules.java:20)
	at app//org.apache.lucene.tests.util.AbstractBeforeAfterRule$1.evaluate(AbstractBeforeAfterRule.java:43)
	at app//com.carrotsearch.randomizedtesting.rules.StatementAdapter.evaluate(StatementAdapter.java:36)
	at app//org.apache.lucene.tests.util.TestRuleStoreClassName$1.evaluate(TestRuleStoreClassName.java:38)
	at app//com.carrotsearch.randomizedtesting.rules.NoShadowingOrOverridesOnMethodsRule$1.evaluate(NoShadowingOrOverridesOnMethodsRule.java:40)
	at app//com.carrotsearch.randomizedtesting.rules.NoShadowingOrOverridesOnMethodsRule$1.evaluate(NoShadowingOrOverridesOnMethodsRule.java:40)
	at app//com.carrotsearch.randomizedtesting.rules.StatementAdapter.evaluate(StatementAdapter.java:36)
	at app//com.carrotsearch.randomizedtesting.rules.StatementAdapter.evaluate(StatementAdapter.java:36)
	at app//org.apache.lucene.tests.util.TestRuleAssertionsRequired$1.evaluate(TestRuleAssertionsRequired.java:53)
	at app//org.apache.lucene.tests.util.AbstractBeforeAfterRule$1.evaluate(AbstractBeforeAfterRule.java:43)
	at app//org.apache.lucene.tests.util.TestRuleMarkFailure$1.evaluate(TestRuleMarkFailure.java:44)
	at app//org.apache.lucene.tests.util.TestRuleIgnoreAfterMaxFailures$1.evaluate(TestRuleIgnoreAfterMaxFailures.java:60)
	at app//org.apache.lucene.tests.util.TestRuleIgnoreTestSuites$1.evaluate(TestRuleIgnoreTestSuites.java:47)
	at app//org.junit.rules.RunRules.evaluate(RunRules.java:20)
	at app//com.carrotsearch.randomizedtesting.rules.StatementAdapter.evaluate(StatementAdapter.java:36)
	at app//com.carrotsearch.randomizedtesting.ThreadLeakControl$StatementRunner.run(ThreadLeakControl.java:390)
	at app//com.carrotsearch.randomizedtesting.ThreadLeakControl.lambda$forkTimeoutingTask$0(ThreadLeakControl.java:850)
	at java.base@17.0.5/java.lang.Thread.run(Thread.java:833)

[JENKINS] Solr-main-MacOSX (64bit/hotspot/jdk-11.0.15) - Build # 3600 - Still unstable!

Posted by Policeman Jenkins Server <je...@thetaphi.de>.
Build: https://jenkins.thetaphi.de/job/Solr-main-MacOSX/3600/
Java: 64bit/hotspot/jdk-11.0.15 -XX:+UseCompressedOops -XX:+UseParallelGC

1 tests failed.
FAILED:  org.apache.solr.cli.PackageToolTest.testPackageTool

Error Message:
java.lang.AssertionError: Could not get expected value  '1.1.0' for path 'config/requestHandler/\/mypath2/_packageinfo_/version' full output: {
  "responseHeader":{
    "status":0,
    "QTime":0},
  "config":{
    "requestHandler":{
      "/mypath2":{
        "name":"/mypath2",
        "class":"question-answer:fullstory.QARequestHandler",
        "_packageinfo_":{
          "package":"question-answer",
          "version":"1.0.0",
          "files":["/package/question-answer/1.0.0/question-answer-request-handler-1.0.jar.tmp"],
          "manifest":"/package/question-answer/1.0.0/manifest.json",
          "manifestSHA512":"6245d2b13983e41a03f8d4051a101148a800d0b66a9cadee01b5bb34cb49fb912bc17d2ce7efd415fcb1f8b8d4e3410c7cbf131ccff23dfcde926071bf497096"}}}}},  from server:  http://127.0.0.1:50082/solr/abc

Stack Trace:
java.lang.AssertionError: Could not get expected value  '1.1.0' for path 'config/requestHandler/\/mypath2/_packageinfo_/version' full output: {
  "responseHeader":{
    "status":0,
    "QTime":0},
  "config":{
    "requestHandler":{
      "/mypath2":{
        "name":"/mypath2",
        "class":"question-answer:fullstory.QARequestHandler",
        "_packageinfo_":{
          "package":"question-answer",
          "version":"1.0.0",
          "files":["/package/question-answer/1.0.0/question-answer-request-handler-1.0.jar.tmp"],
          "manifest":"/package/question-answer/1.0.0/manifest.json",
          "manifestSHA512":"6245d2b13983e41a03f8d4051a101148a800d0b66a9cadee01b5bb34cb49fb912bc17d2ce7efd415fcb1f8b8d4e3410c7cbf131ccff23dfcde926071bf497096"}}}}},  from server:  http://127.0.0.1:50082/solr/abc
	at __randomizedtesting.SeedInfo.seed([8B90808EF961587:65419526FA919882]:0)
	at org.junit.Assert.fail(Assert.java:89)
	at org.junit.Assert.assertTrue(Assert.java:42)
	at org.apache.solr.cli.PackageToolTest.testForResponseElement(PackageToolTest.java:352)
	at org.apache.solr.cli.PackageToolTest.assertPackageVersion(PackageToolTest.java:316)
	at org.apache.solr.cli.PackageToolTest.testPackageTool(PackageToolTest.java:231)
	at java.base/jdk.internal.reflect.NativeMethodAccessorImpl.invoke0(Native Method)
	at java.base/jdk.internal.reflect.NativeMethodAccessorImpl.invoke(NativeMethodAccessorImpl.java:62)
	at java.base/jdk.internal.reflect.DelegatingMethodAccessorImpl.invoke(DelegatingMethodAccessorImpl.java:43)
	at java.base/java.lang.reflect.Method.invoke(Method.java:566)
	at com.carrotsearch.randomizedtesting.RandomizedRunner.invoke(RandomizedRunner.java:1758)
	at com.carrotsearch.randomizedtesting.RandomizedRunner$8.evaluate(RandomizedRunner.java:946)
	at com.carrotsearch.randomizedtesting.RandomizedRunner$9.evaluate(RandomizedRunner.java:982)
	at com.carrotsearch.randomizedtesting.RandomizedRunner$10.evaluate(RandomizedRunner.java:996)
	at com.carrotsearch.randomizedtesting.rules.SystemPropertiesRestoreRule$1.evaluate(SystemPropertiesRestoreRule.java:80)
	at org.junit.rules.RunRules.evaluate(RunRules.java:20)
	at org.apache.lucene.tests.util.TestRuleSetupTeardownChained$1.evaluate(TestRuleSetupTeardownChained.java:48)
	at org.apache.lucene.tests.util.AbstractBeforeAfterRule$1.evaluate(AbstractBeforeAfterRule.java:43)
	at org.apache.lucene.tests.util.TestRuleThreadAndTestName$1.evaluate(TestRuleThreadAndTestName.java:45)
	at org.apache.lucene.tests.util.TestRuleIgnoreAfterMaxFailures$1.evaluate(TestRuleIgnoreAfterMaxFailures.java:60)
	at org.apache.lucene.tests.util.TestRuleMarkFailure$1.evaluate(TestRuleMarkFailure.java:44)
	at org.junit.rules.RunRules.evaluate(RunRules.java:20)
	at com.carrotsearch.randomizedtesting.rules.StatementAdapter.evaluate(StatementAdapter.java:36)
	at com.carrotsearch.randomizedtesting.ThreadLeakControl$StatementRunner.run(ThreadLeakControl.java:390)
	at com.carrotsearch.randomizedtesting.ThreadLeakControl.forkTimeoutingTask(ThreadLeakControl.java:843)
	at com.carrotsearch.randomizedtesting.ThreadLeakControl$3.evaluate(ThreadLeakControl.java:490)
	at com.carrotsearch.randomizedtesting.RandomizedRunner.runSingleTest(RandomizedRunner.java:955)
	at com.carrotsearch.randomizedtesting.RandomizedRunner$5.evaluate(RandomizedRunner.java:840)
	at com.carrotsearch.randomizedtesting.RandomizedRunner$6.evaluate(RandomizedRunner.java:891)
	at com.carrotsearch.randomizedtesting.RandomizedRunner$7.evaluate(RandomizedRunner.java:902)
	at com.carrotsearch.randomizedtesting.rules.StatementAdapter.evaluate(StatementAdapter.java:36)
	at com.carrotsearch.randomizedtesting.rules.StatementAdapter.evaluate(StatementAdapter.java:36)
	at org.apache.lucene.tests.util.AbstractBeforeAfterRule$1.evaluate(AbstractBeforeAfterRule.java:43)
	at com.carrotsearch.randomizedtesting.rules.SystemPropertiesRestoreRule$1.evaluate(SystemPropertiesRestoreRule.java:80)
	at org.junit.rules.RunRules.evaluate(RunRules.java:20)
	at org.apache.lucene.tests.util.AbstractBeforeAfterRule$1.evaluate(AbstractBeforeAfterRule.java:43)
	at com.carrotsearch.randomizedtesting.rules.StatementAdapter.evaluate(StatementAdapter.java:36)
	at org.apache.lucene.tests.util.TestRuleStoreClassName$1.evaluate(TestRuleStoreClassName.java:38)
	at com.carrotsearch.randomizedtesting.rules.NoShadowingOrOverridesOnMethodsRule$1.evaluate(NoShadowingOrOverridesOnMethodsRule.java:40)
	at com.carrotsearch.randomizedtesting.rules.NoShadowingOrOverridesOnMethodsRule$1.evaluate(NoShadowingOrOverridesOnMethodsRule.java:40)
	at com.carrotsearch.randomizedtesting.rules.StatementAdapter.evaluate(StatementAdapter.java:36)
	at com.carrotsearch.randomizedtesting.rules.StatementAdapter.evaluate(StatementAdapter.java:36)
	at org.apache.lucene.tests.util.TestRuleAssertionsRequired$1.evaluate(TestRuleAssertionsRequired.java:53)
	at org.apache.lucene.tests.util.AbstractBeforeAfterRule$1.evaluate(AbstractBeforeAfterRule.java:43)
	at org.apache.lucene.tests.util.TestRuleMarkFailure$1.evaluate(TestRuleMarkFailure.java:44)
	at org.apache.lucene.tests.util.TestRuleIgnoreAfterMaxFailures$1.evaluate(TestRuleIgnoreAfterMaxFailures.java:60)
	at org.apache.lucene.tests.util.TestRuleIgnoreTestSuites$1.evaluate(TestRuleIgnoreTestSuites.java:47)
	at org.junit.rules.RunRules.evaluate(RunRules.java:20)
	at com.carrotsearch.randomizedtesting.rules.StatementAdapter.evaluate(StatementAdapter.java:36)
	at com.carrotsearch.randomizedtesting.ThreadLeakControl$StatementRunner.run(ThreadLeakControl.java:390)
	at com.carrotsearch.randomizedtesting.ThreadLeakControl.lambda$forkTimeoutingTask$0(ThreadLeakControl.java:850)
	at java.base/java.lang.Thread.run(Thread.java:829)

[JENKINS] Solr-main-MacOSX (64bit/hotspot/jdk-19) - Build # 3599 - Still Failing!

Posted by Policeman Jenkins Server <je...@thetaphi.de>.
Build: https://jenkins.thetaphi.de/job/Solr-main-MacOSX/3599/
Java: 64bit/hotspot/jdk-19 -XX:+UseCompressedOops -XX:+UseParallelGC

All tests passed