You are viewing a plain text version of this content. The canonical link for it is here.
Posted to dev@geronimo.apache.org by ga...@apache.org on 2010/11/26 05:57:50 UTC
[BUILD] trunk: Failed for Revision: 1039238
Geronimo Revision: 1039238 built with tests included
See the full build-2100.log file at http://people.apache.org/builds/geronimo/server/binaries/trunk/20101125/build-2100.log
Download the binaries from http://people.apache.org/builds/geronimo/server/binaries/trunk/20101125
[INFO] BUILD SUCCESSFUL
[INFO] ------------------------------------------------------------------------
[INFO] Total time: 40 minutes 40 seconds
[INFO] Finished at: Thu Nov 25 21:41:56 EST 2010
[INFO] Final Memory: 483M/1007M
[INFO] ------------------------------------------------------------------------
TESTSUITE RESULTS (Failures only)
=================================
Assembly: tomcat
=================================
See full test results and logs at http://people.apache.org/builds/geronimo/server/binaries/trunk/20101125/logs-2100-tomcat/
Running TestSuite
Tests run: 2, Failures: 2, Errors: 0, Skipped: 0, Time elapsed: 10.657 sec <<< FAILURE!
--
Running TestSuite
Tests run: 1, Failures: 1, Errors: 0, Skipped: 0, Time elapsed: 7.633 sec <<< FAILURE!
Assembly: jetty
=================================
See full test results and logs at http://people.apache.org/builds/geronimo/server/binaries/trunk/20101125/logs-2100-jetty/
Running TestSuite
Tests run: 2, Failures: 1, Errors: 0, Skipped: 0, Time elapsed: 1.504 sec <<< FAILURE!
--
Running TestSuite
Tests run: 2, Failures: 2, Errors: 0, Skipped: 0, Time elapsed: 10.672 sec <<< FAILURE!
--
Running TestSuite
Tests run: 1, Failures: 1, Errors: 0, Skipped: 0, Time elapsed: 9.548 sec <<< FAILURE!
Samples: trunk
=================================
Log: http://people.apache.org/builds/geronimo/server/binaries/trunk/20101125/samples-2100.log
Build status: FAILED