You are viewing a plain text version of this content. The canonical link for it is here.
Posted to builds@beam.apache.org by Apache Jenkins Server <je...@builds.apache.org> on 2019/02/28 10:57:17 UTC

Build failed in Jenkins: beam_PostCommit_Python_Verify #7531

See <https://builds.apache.org/job/beam_PostCommit_Python_Verify/7531/display/redirect?page=changes>

Changes:

[mxm] Move abstract methods in JobServerDriver after field declarations

[mxm] [BEAM-6731] Bundle Java ExpansionService with Flink JobServer

------------------------------------------
[...truncated 137.58 KB...]
+ TEST_DIR=./apache_beam/io/hdfs_integration_test
+ ROOT_DIR=./apache_beam/io/hdfs_integration_test/../../../../..
+ CONTEXT_DIR=./apache_beam/io/hdfs_integration_test/../../../../../build/hdfs_integration
+ rm -r ./apache_beam/io/hdfs_integration_test/../../../../../build/hdfs_integration
rm: cannot remove './apache_beam/io/hdfs_integration_test/../../../../../build/hdfs_integration': No such file or directory
+ true
+ mkdir -p ./apache_beam/io/hdfs_integration_test/../../../../../build/hdfs_integration/sdks
+ cp ./apache_beam/io/hdfs_integration_test/docker-compose.yml ./apache_beam/io/hdfs_integration_test/Dockerfile ./apache_beam/io/hdfs_integration_test/hdfscli.cfg ./apache_beam/io/hdfs_integration_test/hdfs_integration_test.sh ./apache_beam/io/hdfs_integration_test/../../../../../build/hdfs_integration/
+ cp -r ./apache_beam/io/hdfs_integration_test/../../../../../sdks/python ./apache_beam/io/hdfs_integration_test/../../../../../build/hdfs_integration/sdks/
+ cp -r ./apache_beam/io/hdfs_integration_test/../../../../../model ./apache_beam/io/hdfs_integration_test/../../../../../build/hdfs_integration/
++ echo hdfs_IT-jenkins-beam_PostCommit_Python_Verify-7531
+ PROJECT_NAME=hdfs_IT-jenkins-beam_PostCommit_Python_Verify-7531
+ '[' -z jenkins-beam_PostCommit_Python_Verify-7531 ']'
+ COLOR_OPT=--no-ansi
+ COMPOSE_OPT='-p hdfs_IT-jenkins-beam_PostCommit_Python_Verify-7531 --no-ansi'
+ cd ./apache_beam/io/hdfs_integration_test/../../../../../build/hdfs_integration
+ docker network prune --force
+ trap finally EXIT
+ docker-compose -p hdfs_IT-jenkins-beam_PostCommit_Python_Verify-7531 --no-ansi build
namenode uses an image, skipping
datanode uses an image, skipping
Building test
Step 1/9 : FROM python:2
 ---> e49a53a4af5c
Step 2/9 : WORKDIR /app
 ---> Using cache
 ---> 39c2db1ef75c
Step 3/9 : ENV HDFSCLI_CONFIG /app/sdks/python/apache_beam/io/hdfs_integration_test/hdfscli.cfg
 ---> Using cache
 ---> b98faca55ee7
Step 4/9 : RUN pip install --no-cache-dir holdup gsutil
 ---> Using cache
 ---> 86a5f3458108
Step 5/9 : RUN gsutil cp gs://dataflow-samples/shakespeare/kinglear.txt .
 ---> Using cache
 ---> 74b16e40bb49
Step 6/9 : ADD sdks/python /app/sdks/python
 ---> fb58b1b250ca
Removing intermediate container 4df6c89572f0
Step 7/9 : ADD model /app/model
 ---> 15737e135bd5
Removing intermediate container 6e868d7760d6
Step 8/9 : RUN cd sdks/python &&     python setup.py sdist &&     pip install --no-cache-dir $(ls dist/apache-beam-*.tar.gz | tail -n1)[gcp]
 ---> Running in 903b051117f7
Service 'test' failed to build: grpc: the connection is unavailable
+ finally
+ docker-compose -p hdfs_IT-jenkins-beam_PostCommit_Python_Verify-7531 --no-ansi down
Removing network hdfs_it-jenkins-beam_postcommit_python_verify-7531_test_net
Network hdfs_it-jenkins-beam_postcommit_python_verify-7531_test_net not found.

real	0m0.239s
user	0m0.167s
sys	0m0.065s

> Task :beam-sdks-python:hdfsIntegrationTest FAILED

> Task :beam-sdks-python:postCommitIT


###########################################################################
# Build pipeline options if not provided in --pipeline_opts from commandline

if [[ -z $PIPELINE_OPTS ]]; then

  # Check that the script is running in a known directory.
  if [[ $PWD != *sdks/python* ]]; then
    echo 'Unable to locate Apache Beam Python SDK root directory'
    exit 1
  fi

  # Go to the Apache Beam Python SDK root
  if [[ "*sdks/python" != $PWD ]]; then
    cd $(pwd | sed 's/sdks\/python.*/sdks\/python/')
  fi

  # Create a tarball if not exists
  if [[ $(find ${SDK_LOCATION}) ]]; then
    SDK_LOCATION=$(find ${SDK_LOCATION})
  else
    python setup.py -q sdist
    SDK_LOCATION=$(find dist/apache-beam-*.tar.gz)
  fi

  # Install test dependencies for ValidatesRunner tests.
  echo "pyhamcrest" > postcommit_requirements.txt
  echo "mock" >> postcommit_requirements.txt

  # Options used to run testing pipeline on Cloud Dataflow Service. Also used for
  # running on DirectRunner (some options ignored).
  opts=(
    "--runner=$RUNNER"
    "--project=$PROJECT"
    "--staging_location=$GCS_LOCATION/staging-it"
    "--temp_location=$GCS_LOCATION/temp-it"
    "--output=$GCS_LOCATION/py-it-cloud/output"
    "--sdk_location=$SDK_LOCATION"
    "--requirements_file=postcommit_requirements.txt"
    "--num_workers=$NUM_WORKERS"
    "--sleep_secs=$SLEEP_SECS"
  )

  # Add --streaming if provided
  if [[ "$STREAMING" = true ]]; then
    opts+=("--streaming")
  fi

  # Add --dataflow_worker_jar if provided
  if [[ ! -z "$WORKER_JAR" ]]; then
    opts+=("--dataflow_worker_jar=$WORKER_JAR")
  fi

  if [[ ! -z "$KMS_KEY_NAME" ]]; then
    opts+=(
      "--kms_key_name=$KMS_KEY_NAME"
      "--dataflow_kms_key=$KMS_KEY_NAME"
    )
  fi

  PIPELINE_OPTS=$(IFS=" " ; echo "${opts[*]}")

fi
pwd | sed 's/sdks\/python.*/sdks\/python/'
find ${SDK_LOCATION}
find ${SDK_LOCATION}
IFS=" " ; echo "${opts[*]}"

###########################################################################
# Run tests and validate that jobs finish successfully.

echo ">>> RUNNING integration tests with pipeline options: $PIPELINE_OPTS"
python setup.py nosetests \
  --test-pipeline-options="$PIPELINE_OPTS" \
  $TEST_OPTS
>>> RUNNING integration tests with pipeline options: --runner=TestDataflowRunner --project=apache-beam-testing --staging_location=gs://temp-storage-for-end-to-end-tests/staging-it --temp_location=gs://temp-storage-for-end-to-end-tests/temp-it --output=gs://temp-storage-for-end-to-end-tests/py-it-cloud/output --sdk_location=build/apache-beam.tar.gz --requirements_file=postcommit_requirements.txt --num_workers=1 --sleep_secs=20 --kms_key_name=projects/apache-beam-testing/locations/global/keyRings/beam-it/cryptoKeys/test --dataflow_kms_key=projects/apache-beam-testing/locations/global/keyRings/beam-it/cryptoKeys/test
<https://builds.apache.org/job/beam_PostCommit_Python_Verify/ws/src/build/gradleenv/1327086738/local/lib/python2.7/site-packages/setuptools/dist.py>:475: UserWarning: Normalizing '2.12.0.dev' to '2.12.0.dev0'
  normalized_version,
running nosetests
running egg_info
writing requirements to apache_beam.egg-info/requires.txt
writing apache_beam.egg-info/PKG-INFO
writing top-level names to apache_beam.egg-info/top_level.txt
writing dependency_links to apache_beam.egg-info/dependency_links.txt
writing entry points to apache_beam.egg-info/entry_points.txt
reading manifest file 'apache_beam.egg-info/SOURCES.txt'
reading manifest template 'MANIFEST.in'
warning: no files found matching 'README.md'
warning: no files found matching 'NOTICE'
warning: no files found matching 'LICENSE'
writing manifest file 'apache_beam.egg-info/SOURCES.txt'
<https://builds.apache.org/job/beam_PostCommit_Python_Verify/ws/src/sdks/python/apache_beam/examples/cookbook/bigquery_tornadoes.py>:90: BeamDeprecationWarning: options is deprecated since First stable release. References to <pipeline>.options will not be supported
  if 'temp_location' in p.options.get_all_options():
<https://builds.apache.org/job/beam_PostCommit_Python_Verify/ws/src/sdks/python/apache_beam/io/gcp/bigquery.py>:835: BeamDeprecationWarning: options is deprecated since First stable release. References to <pipeline>.options will not be supported
  standard_options = p.options.view_as(StandardOptions)
<https://builds.apache.org/job/beam_PostCommit_Python_Verify/ws/src/sdks/python/apache_beam/io/gcp/bigquery.py>:835: BeamDeprecationWarning: options is deprecated since First stable release. References to <pipeline>.options will not be supported
  standard_options = p.options.view_as(StandardOptions)
<https://builds.apache.org/job/beam_PostCommit_Python_Verify/ws/src/sdks/python/apache_beam/io/gcp/bigquery.py>:835: BeamDeprecationWarning: options is deprecated since First stable release. References to <pipeline>.options will not be supported
  standard_options = p.options.view_as(StandardOptions)
<https://builds.apache.org/job/beam_PostCommit_Python_Verify/ws/src/sdks/python/apache_beam/io/gcp/bigquery.py>:835: BeamDeprecationWarning: options is deprecated since First stable release. References to <pipeline>.options will not be supported
  standard_options = p.options.view_as(StandardOptions)
test_bigquery_tornadoes_it (apache_beam.examples.cookbook.bigquery_tornadoes_it_test.BigqueryTornadoesIT) ... ok
test_autocomplete_it (apache_beam.examples.complete.autocomplete_test.AutocompleteTest) ... ok
test_datastore_wordcount_it (apache_beam.examples.cookbook.datastore_wordcount_it_test.DatastoreWordCountIT) ... ok
test_leader_board_it (apache_beam.examples.complete.game.leader_board_it_test.LeaderBoardIT) ... ok
test_wordcount_fnapi_it (apache_beam.examples.wordcount_it_test.WordCountIT) ... ok
<https://builds.apache.org/job/beam_PostCommit_Python_Verify/ws/src/sdks/python/apache_beam/io/gcp/bigquery.py>:835: BeamDeprecationWarning: options is deprecated since First stable release. References to <pipeline>.options will not be supported
  standard_options = p.options.view_as(StandardOptions)
test_streaming_wordcount_it (apache_beam.examples.streaming_wordcount_it_test.StreamingWordCountIT) ... ok
test_wordcount_it (apache_beam.examples.wordcount_it_test.WordCountIT) ... ok
test_game_stats_it (apache_beam.examples.complete.game.game_stats_it_test.GameStatsIT) ... ok
test_copy (apache_beam.io.gcp.gcsio_integration_test.GcsIOIntegrationTest) ... ok
test_copy_batch (apache_beam.io.gcp.gcsio_integration_test.GcsIOIntegrationTest) ... ok
test_copy_batch_kms (apache_beam.io.gcp.gcsio_integration_test.GcsIOIntegrationTest) ... ok
test_copy_batch_rewrite_token (apache_beam.io.gcp.gcsio_integration_test.GcsIOIntegrationTest) ... ok
test_copy_kms (apache_beam.io.gcp.gcsio_integration_test.GcsIOIntegrationTest) ... ok
test_copy_rewrite_token (apache_beam.io.gcp.gcsio_integration_test.GcsIOIntegrationTest) ... ok
test_avro_it (apache_beam.examples.fastavro_it_test.FastavroIT) ... ok
test_user_score_it (apache_beam.examples.complete.game.user_score_it_test.UserScoreIT) ... ok
test_hourly_team_score_it (apache_beam.examples.complete.game.hourly_team_score_it_test.HourlyTeamScoreIT) ... ok
test_bigquery_read_1M_python (apache_beam.io.gcp.bigquery_io_read_it_test.BigqueryIOReadIT) ... ok
test_parquetio_it (apache_beam.io.parquetio_it_test.TestParquetIT) ... ok
test_streaming_data_only (apache_beam.io.gcp.pubsub_integration_test.PubSubIntegrationTest) ... ok
test_streaming_with_attributes (apache_beam.io.gcp.pubsub_integration_test.PubSubIntegrationTest) ... ok
test_multiple_destinations_transform (apache_beam.io.gcp.bigquery_file_loads_test.BigQueryFileLoadsIT) ... ok
test_one_job_fails_all_jobs_fail (apache_beam.io.gcp.bigquery_file_loads_test.BigQueryFileLoadsIT) ... ok
test_big_query_legacy_sql (apache_beam.io.gcp.big_query_query_to_table_it_test.BigQueryQueryToTableIT) ... ok
test_big_query_new_types (apache_beam.io.gcp.big_query_query_to_table_it_test.BigQueryQueryToTableIT) ... ok
test_big_query_standard_sql (apache_beam.io.gcp.big_query_query_to_table_it_test.BigQueryQueryToTableIT) ... ok
test_big_query_standard_sql_kms_key (apache_beam.io.gcp.big_query_query_to_table_it_test.BigQueryQueryToTableIT) ... SKIP: This test requires BQ Dataflow native source support for KMS, which is not available yet.
test_datastore_write_limit (apache_beam.io.gcp.datastore_write_it_test.DatastoreWriteIT) ... ok

----------------------------------------------------------------------
XML: <https://builds.apache.org/job/beam_PostCommit_Python_Verify/ws/src/sdks/python/nosetests.xml>
----------------------------------------------------------------------
Ran 28 tests in 2792.360s

OK (SKIP=1)
Found: https://console.cloud.google.com/dataflow/jobsDetail/locations/us-central1/jobs/2019-02-28_02_10_51-18352994455126780859?project=apache-beam-testing.
Found: https://console.cloud.google.com/dataflow/jobsDetail/locations/us-central1/jobs/2019-02-28_02_18_25-234091479595754389?project=apache-beam-testing.
Found: https://console.cloud.google.com/dataflow/jobsDetail/locations/us-central1/jobs/2019-02-28_02_25_18-12901572690363490229?project=apache-beam-testing.
Found: https://console.cloud.google.com/dataflow/jobsDetail/locations/us-central1/jobs/2019-02-28_02_31_05-4619019953661337624?project=apache-beam-testing.
Found: https://console.cloud.google.com/dataflow/jobsDetail/locations/us-central1/jobs/2019-02-28_02_38_08-3671724475947320386?project=apache-beam-testing.
Found: https://console.cloud.google.com/dataflow/jobsDetail/locations/us-central1/jobs/2019-02-28_02_44_15-16204829205607562846?project=apache-beam-testing.
Found: https://console.cloud.google.com/dataflow/jobsDetail/locations/us-central1/jobs/2019-02-28_02_50_38-13047804758048692360?project=apache-beam-testing.
Found: https://console.cloud.google.com/dataflow/jobsDetail/locations/us-central1/jobs/2019-02-28_02_10_53-6439251600593355585?project=apache-beam-testing.
Found: https://console.cloud.google.com/dataflow/jobsDetail/locations/us-central1/jobs/2019-02-28_02_26_02-9475996518404325763?project=apache-beam-testing.
Found: https://console.cloud.google.com/dataflow/jobsDetail/locations/us-central1/jobs/2019-02-28_02_32_44-5786416908697692330?project=apache-beam-testing.
Found: https://console.cloud.google.com/dataflow/jobsDetail/locations/us-central1/jobs/2019-02-28_02_10_52-8108134143141076091?project=apache-beam-testing.
Found: https://console.cloud.google.com/dataflow/jobsDetail/locations/us-central1/jobs/2019-02-28_02_10_54-1879478276129112277?project=apache-beam-testing.
Found: https://console.cloud.google.com/dataflow/jobsDetail/locations/us-central1/jobs/2019-02-28_02_23_12-334078827962940969?project=apache-beam-testing.
Found: https://console.cloud.google.com/dataflow/jobsDetail/locations/us-central1/jobs/2019-02-28_02_33_27-2542843178769584675?project=apache-beam-testing.
Found: https://console.cloud.google.com/dataflow/jobsDetail/locations/us-central1/jobs/2019-02-28_02_42_26-17337541907567283594?project=apache-beam-testing.
Found: https://console.cloud.google.com/dataflow/jobsDetail/locations/us-central1/jobs/2019-02-28_02_10_51-10595068646615295709?project=apache-beam-testing.
Found: https://console.cloud.google.com/dataflow/jobsDetail/locations/us-central1/jobs/2019-02-28_02_10_51-10073403125919456876?project=apache-beam-testing.
Found: https://console.cloud.google.com/dataflow/jobsDetail/locations/us-central1/jobs/2019-02-28_02_17_40-12283548390732575299?project=apache-beam-testing.
Found: https://console.cloud.google.com/dataflow/jobsDetail/locations/us-central1/jobs/2019-02-28_02_24_06-5686529625655304253?project=apache-beam-testing.
Found: https://console.cloud.google.com/dataflow/jobsDetail/locations/us-central1/jobs/2019-02-28_02_32_08-1783719122968485044?project=apache-beam-testing.
Found: https://console.cloud.google.com/dataflow/jobsDetail/locations/us-central1/jobs/2019-02-28_02_10_51-4555358194409875432?project=apache-beam-testing.
Found: https://console.cloud.google.com/dataflow/jobsDetail/locations/us-central1/jobs/2019-02-28_02_17_02-2003273154453694243?project=apache-beam-testing.
Found: https://console.cloud.google.com/dataflow/jobsDetail/locations/us-central1/jobs/2019-02-28_02_24_32-16156148762387067388?project=apache-beam-testing.
Found: https://console.cloud.google.com/dataflow/jobsDetail/locations/us-central1/jobs/2019-02-28_02_10_52-5343885140871444742?project=apache-beam-testing.
Found: https://console.cloud.google.com/dataflow/jobsDetail/locations/us-central1/jobs/2019-02-28_02_19_09-14796772130252719322?project=apache-beam-testing.
Found: https://console.cloud.google.com/dataflow/jobsDetail/locations/us-central1/jobs/2019-02-28_02_28_14-2965749875120605368?project=apache-beam-testing.

FAILURE: Build failed with an exception.

* Where:
Build file '<https://builds.apache.org/job/beam_PostCommit_Python_Verify/ws/src/sdks/python/build.gradle'> line: 317

* What went wrong:
Execution failed for task ':beam-sdks-python:hdfsIntegrationTest'.
> Process 'command 'sh'' finished with non-zero exit value 1

* Try:
Run with --stacktrace option to get the stack trace. Run with --info or --debug option to get more log output. Run with --scan to get full insights.

* Get more help at https://help.gradle.org

Deprecated Gradle features were used in this build, making it incompatible with Gradle 6.0.
Use '--warning-mode all' to show the individual deprecation warnings.
See https://docs.gradle.org/5.2.1/userguide/command_line_interface.html#sec:command_line_warnings

BUILD FAILED in 48m 39s
6 actionable tasks: 6 executed

Publishing build scan...
https://gradle.com/s/qdrda2ugbyn3a

Build step 'Invoke Gradle script' changed build result to FAILURE
Build step 'Invoke Gradle script' marked build as failure

---------------------------------------------------------------------
To unsubscribe, e-mail: builds-unsubscribe@beam.apache.org
For additional commands, e-mail: builds-help@beam.apache.org


Jenkins build is back to normal : beam_PostCommit_Python_Verify #7532

Posted by Apache Jenkins Server <je...@builds.apache.org>.
See <https://builds.apache.org/job/beam_PostCommit_Python_Verify/7532/display/redirect>


---------------------------------------------------------------------
To unsubscribe, e-mail: builds-unsubscribe@beam.apache.org
For additional commands, e-mail: builds-help@beam.apache.org