You are viewing a plain text version of this content. The canonical link for it is here.
Posted to commits@logging.apache.org by Apache Jenkins Server <je...@builds.apache.org> on 2017/07/06 09:49:36 UTC
Build failed in Jenkins: logging-log4net » feature/cd-pipeline #78
See <https://builds.apache.org/job/logging-log4net/job/feature%252Fcd-pipeline/78/display/redirect>
------------------------------------------
Branch indexing
Connecting to https://api.github.com using dpsenner/****** (dpsenner at github)
Obtained Jenkinsfile from 00eea53a9495e6c470a495ece6ca914d0a3fc754
[Pipeline] node
Running on ubuntu-4 in /home/jenkins/jenkins-slave/workspace/log4net_feature_cd-pipeline-76KUCPODUF6LCE45226EBUR4GNVLYPMYVC23Z4ITBOMNJT3CA2WA
[Pipeline] {
[Pipeline] timeout
Timeout set to expire in 1 hr 0 min
[Pipeline] {
[Pipeline] stage
[Pipeline] { (checkout)
[Pipeline] deleteDir
[Pipeline] checkout
Cloning the remote Git repository
Cloning repository https://github.com/apache/logging-log4net.git
> git init /home/jenkins/jenkins-slave/workspace/log4net_feature_cd-pipeline-76KUCPODUF6LCE45226EBUR4GNVLYPMYVC23Z4ITBOMNJT3CA2WA # timeout=10
Fetching upstream changes from https://github.com/apache/logging-log4net.git
> git --version # timeout=10
using GIT_ASKPASS to set credentials dpsenner at github
> git fetch --tags --progress https://github.com/apache/logging-log4net.git +refs/heads/*:refs/remotes/origin/*
> git config remote.origin.url https://github.com/apache/logging-log4net.git # timeout=10
> git config --add remote.origin.fetch +refs/heads/*:refs/remotes/origin/* # timeout=10
> git config remote.origin.url https://github.com/apache/logging-log4net.git # timeout=10
Fetching upstream changes from https://github.com/apache/logging-log4net.git
using GIT_ASKPASS to set credentials dpsenner at github
> git fetch --tags --progress https://github.com/apache/logging-log4net.git +refs/heads/*:refs/remotes/origin/*
> git config remote.origin1.url https://github.com/apache/logging-log4net.git # timeout=10
Fetching upstream changes from https://github.com/apache/logging-log4net.git
using GIT_ASKPASS to set credentials dpsenner at github
> git fetch --tags --progress https://github.com/apache/logging-log4net.git +refs/pull/*/head:refs/remotes/origin/pr/*
Checking out Revision 00eea53a9495e6c470a495ece6ca914d0a3fc754 (feature/cd-pipeline)
> git config core.sparsecheckout # timeout=10
> git checkout -f 00eea53a9495e6c470a495ece6ca914d0a3fc754
> git rev-list a308192e70c53672c23fafcf914d7480c54a39cc # timeout=10
[Pipeline] }
[Pipeline] // stage
[Pipeline] stage
[Pipeline] { (build net-3.5)
[Pipeline] node
Running on windows-2012-1 in f:\jenkins\jenkins-slave\workspace\log4net_feature_cd-pipeline-76KUCPODUF6LCE45226EBUR4GNVLYPMYVC23Z4ITBOMNJT3CA2WA
[Pipeline] {
[Pipeline] withEnv
[Pipeline] {
[Pipeline] deleteDir
[Pipeline] checkout
Cloning the remote Git repository
Cloning repository https://github.com/apache/logging-log4net.git
> git init f:\jenkins\jenkins-slave\workspace\log4net_feature_cd-pipeline-76KUCPODUF6LCE45226EBUR4GNVLYPMYVC23Z4ITBOMNJT3CA2WA # timeout=10
Fetching upstream changes from https://github.com/apache/logging-log4net.git
> git --version # timeout=10
using GIT_ASKPASS to set credentials dpsenner at github
> git fetch --tags --progress https://github.com/apache/logging-log4net.git +refs/heads/*:refs/remotes/origin/*
> git config remote.origin.url https://github.com/apache/logging-log4net.git # timeout=10
> git config --add remote.origin.fetch +refs/heads/*:refs/remotes/origin/* # timeout=10
> git config remote.origin.url https://github.com/apache/logging-log4net.git # timeout=10
Fetching upstream changes from https://github.com/apache/logging-log4net.git
using GIT_ASKPASS to set credentials dpsenner at github
> git fetch --tags --progress https://github.com/apache/logging-log4net.git +refs/heads/*:refs/remotes/origin/*
> git config remote.origin1.url https://github.com/apache/logging-log4net.git # timeout=10
Fetching upstream changes from https://github.com/apache/logging-log4net.git
using GIT_ASKPASS to set credentials dpsenner at github
> git fetch --tags --progress https://github.com/apache/logging-log4net.git +refs/pull/*/head:refs/remotes/origin/pr/*
Checking out Revision 00eea53a9495e6c470a495ece6ca914d0a3fc754 (feature/cd-pipeline)
> git config core.sparsecheckout # timeout=10
> git checkout -f 00eea53a9495e6c470a495ece6ca914d0a3fc754
[Pipeline] bat
[log4net_feature_cd-pipeline-76KUCPODUF6LCE45226EBUR4GNVLYPMYVC23Z4ITBOMNJT3CA2WA] Running batch script
f:\jenkins\jenkins-slave\workspace\log4net_feature_cd-pipeline-76KUCPODUF6LCE45226EBUR4GNVLYPMYVC23Z4ITBOMNJT3CA2WA>F:\jenkins\tools\nant\nant-0.92\bin\NAnt.exe -t:net-3.5 -buildfile:log4net.build compile-net-3.5
NAnt 0.92 (Build 0.92.4543.0; release; 6/9/2012)
Copyright (C) 2001-2012 Gerry Shaw
http://nant.sourceforge.net
BUILD FAILED
f:\jenkins\jenkins-slave\workspace\log4net_feature_cd-pipeline-76KUCPODUF6LCE45226EBUR4GNVLYPMYVC23Z4ITBOMNJT3CA2WA\log4net.build(1772,10):
Error loading buildfile.
The '=' character, hexadecimal value 0x3D, cannot be included in a name. Line 1772, position 10.
For more information regarding the cause of the build failure, run the build again in debug mode.
Try 'nant -help' for more information
[Pipeline] }
[Pipeline] // withEnv
[Pipeline] }
[Pipeline] // node
[Pipeline] }
[Pipeline] // stage
[Pipeline] stage
[Pipeline] { (build net-3.5-cp)
Stage 'build net-3.5-cp' skipped due to earlier failure(s)
[Pipeline] }
[Pipeline] // stage
[Pipeline] stage
[Pipeline] { (build net-4.0)
Stage 'build net-4.0' skipped due to earlier failure(s)
[Pipeline] }
[Pipeline] // stage
[Pipeline] stage
[Pipeline] { (build net-4.0-cp)
Stage 'build net-4.0-cp' skipped due to earlier failure(s)
[Pipeline] }
[Pipeline] // stage
[Pipeline] stage
[Pipeline] { (build net-4.5)
Stage 'build net-4.5' skipped due to earlier failure(s)
[Pipeline] }
[Pipeline] // stage
[Pipeline] stage
[Pipeline] { (build mono-2.0)
Stage 'build mono-2.0' skipped due to earlier failure(s)
[Pipeline] }
[Pipeline] // stage
[Pipeline] stage
[Pipeline] { (build mono-3.5)
Stage 'build mono-3.5' skipped due to earlier failure(s)
[Pipeline] }
[Pipeline] // stage
[Pipeline] stage
[Pipeline] { (build mono-4.0)
Stage 'build mono-4.0' skipped due to earlier failure(s)
[Pipeline] }
[Pipeline] // stage
[Pipeline] stage
[Pipeline] { (build netstandard)
Stage 'build netstandard' skipped due to earlier failure(s)
[Pipeline] }
[Pipeline] // stage
[Pipeline] stage
[Pipeline] { (build site)
Stage 'build site' skipped due to earlier failure(s)
[Pipeline] }
[Pipeline] // stage
[Pipeline] stage
[Pipeline] { (prepare package)
Stage 'prepare package' skipped due to earlier failure(s)
[Pipeline] }
[Pipeline] // stage
[Pipeline] stage
[Pipeline] { (check test results)
Stage 'check test results' skipped due to earlier failure(s)
[Pipeline] }
[Pipeline] // stage
[Pipeline] stage
[Pipeline] { (publish site)
Stage 'publish site' skipped due to earlier failure(s)
[Pipeline] }
[Pipeline] // stage
[Pipeline] stage
[Pipeline] { (Declarative: Post Actions)
Build failed in Jenkins: logging-log4net » feature/cd-pipeline #81
Posted by Apache Jenkins Server <je...@builds.apache.org>.
See <https://builds.apache.org/job/logging-log4net/job/feature%252Fcd-pipeline/81/display/redirect>
------------------------------------------
[...truncated 125.99 KB...]
BUILD SUCCEEDED - 0 non-fatal error(s), 12 warning(s)
Total time: 3 seconds.
[Pipeline] stash
Stashed 6 file(s)
[Pipeline] sh
[log4net_feature_cd-pipeline-76KUCPODUF6LCE45226EBUR4GNVLYPMYVC23Z4ITBOMNJT3CA2WA] Running shell script
+ nant -t:mono-4.0 -buildfile:tests/nant.build runtests-mono-4.0
NAnt 0.92 (Build 0.92.4526.0; rc1; 05/23/2012)
Copyright (C) 2001-2012 Gerry Shaw
http://nant.sourceforge.net
Buildfile: file:///home/jenkins/jenkins-slave/workspace/log4net_feature_cd-pipeline-76KUCPODUF6LCE45226EBUR4GNVLYPMYVC23Z4ITBOMNJT3CA2WA/tests/nant.build
Target framework: Mono 4.0 Profile
Target(s) specified: runtests-mono-4.0
check-current-build-config:
set-build-configuration:
set-debug-build-configuration:
check-current-build-config:
set-build-configuration-flags:
check-bin-dir:
[mkdir] Creating directory '/home/jenkins/jenkins-slave/workspace/log4net_feature_cd-pipeline-76KUCPODUF6LCE45226EBUR4GNVLYPMYVC23Z4ITBOMNJT3CA2WA/tests/bin'.
check-doc-dir:
[mkdir] Creating directory '/home/jenkins/jenkins-slave/workspace/log4net_feature_cd-pipeline-76KUCPODUF6LCE45226EBUR4GNVLYPMYVC23Z4ITBOMNJT3CA2WA/tests/doc'.
check-sdkdoc-dir:
check-sdkdoc-debug:
check-build-debug:
check-build-defines:
set-mono-4.0-runtime-configuration:
check-log4net-basedir:
check-current-bin-dir:
[mkdir] Creating directory '/home/jenkins/jenkins-slave/workspace/log4net_feature_cd-pipeline-76KUCPODUF6LCE45226EBUR4GNVLYPMYVC23Z4ITBOMNJT3CA2WA/tests/bin/mono/4.0/debug'.
clean-current-bin-dir:
[echo] Cleaning the bin/mono/4.0/debug binaries directory.
[delete] Deleting directory '/home/jenkins/jenkins-slave/workspace/log4net_feature_cd-pipeline-76KUCPODUF6LCE45226EBUR4GNVLYPMYVC23Z4ITBOMNJT3CA2WA/tests/bin/mono/4.0/debug'.
[mkdir] Creating directory '/home/jenkins/jenkins-slave/workspace/log4net_feature_cd-pipeline-76KUCPODUF6LCE45226EBUR4GNVLYPMYVC23Z4ITBOMNJT3CA2WA/tests/bin/mono/4.0/debug'.
check-log4net-output-dir:
check-log4net-assembly:
[echo] Testing if file exists: ..//bin/mono/4.0/debug/log4net.dll
install-nunit:
[get] Retrieving 'https://github.com/nunit/nunitv2/releases/download/2.6.4/NUnit-2.6.4.zip' to '/home/jenkins/jenkins-slave/workspace/log4net_feature_cd-pipeline-76KUCPODUF6LCE45226EBUR4GNVLYPMYVC23Z4ITBOMNJT3CA2WA/tests/.tmp-nunit.zip'.
[unzip] Unzipping '/home/jenkins/jenkins-slave/workspace/log4net_feature_cd-pipeline-76KUCPODUF6LCE45226EBUR4GNVLYPMYVC23Z4ITBOMNJT3CA2WA/tests/.tmp-nunit.zip' to '/home/jenkins/jenkins-slave/workspace/log4net_feature_cd-pipeline-76KUCPODUF6LCE45226EBUR4GNVLYPMYVC23Z4ITBOMNJT3CA2WA/tests/.tmp-nunit'.
[copy] Copying 1 file to '/home/jenkins/jenkins-slave/workspace/log4net_feature_cd-pipeline-76KUCPODUF6LCE45226EBUR4GNVLYPMYVC23Z4ITBOMNJT3CA2WA/tests/lib/mono/4.0/debug'.
[delete] Deleting file /home/jenkins/jenkins-slave/workspace/log4net_feature_cd-pipeline-76KUCPODUF6LCE45226EBUR4GNVLYPMYVC23Z4ITBOMNJT3CA2WA/tests/.tmp-nunit.zip.
[delete] Deleting directory '/home/jenkins/jenkins-slave/workspace/log4net_feature_cd-pipeline-76KUCPODUF6LCE45226EBUR4GNVLYPMYVC23Z4ITBOMNJT3CA2WA/tests/.tmp-nunit'.
compile-mono-4.0:
[copy] Copying 3 files to '/home/jenkins/jenkins-slave/workspace/log4net_feature_cd-pipeline-76KUCPODUF6LCE45226EBUR4GNVLYPMYVC23Z4ITBOMNJT3CA2WA/tests/bin/mono/4.0/debug'.
[copy] Copying 1 file to '/home/jenkins/jenkins-slave/workspace/log4net_feature_cd-pipeline-76KUCPODUF6LCE45226EBUR4GNVLYPMYVC23Z4ITBOMNJT3CA2WA/tests/bin/mono/4.0/debug'.
[csc] Compiling 46 files to '/home/jenkins/jenkins-slave/workspace/log4net_feature_cd-pipeline-76KUCPODUF6LCE45226EBUR4GNVLYPMYVC23Z4ITBOMNJT3CA2WA/tests/bin/mono/4.0/debug/log4net.Tests.dll'.
runtests-mono-4.0:
[nunit2] log4net:WARN Exception while rendering format [IGNORE THIS WARNING - EXCEPTION EXPECTED Before {0} After {1} {2}]
[nunit2] System.FormatException: Index (zero based) must be greater than or equal to zero and less than the size of the argument list.
[nunit2] at System.Text.StringBuilder.AppendFormat (IFormatProvider provider, System.String format, System.Object[] args) <0x4044bc20 + 0x009cb> in <filename unknown>:0
[nunit2] at System.String.Format (IFormatProvider provider, System.String format, System.Object[] args) <0x4044ba60 + 0x00093> in <filename unknown>:0
[nunit2] at log4net.Util.SystemStringFormat.StringFormat (IFormatProvider provider, System.String format, System.Object[] args) <0x40562650 + 0x00068> in <filename unknown>:0
[nunit2] log4net:ERROR Hello
[nunit2] log4net:ERROR World
[nunit2] log4net:ERROR This will be recorded.
[nunit2] log4net:ERROR This will be recorded.
[nunit2]
[nunit2] /home/jenkins/jenkins-slave/workspace/log4net_feature_cd-pipeline-76KUCPODUF6LCE45226EBUR4GNVLYPMYVC23Z4ITBOMNJT3CA2WA/tests/nant.build(828,10):
[nunit2] Tests Failed.
BUILD SUCCEEDED - 1 non-fatal error(s), 0 warning(s)
Total time: 20.2 seconds.
[Pipeline] stash
Stashed 1 file(s)
[Pipeline] }
$ docker stop --time=1 a646692b16ff594628628d37fe604b1b6767ea5e9eb0031464b60bcb5a720d22
$ docker rm -f a646692b16ff594628628d37fe604b1b6767ea5e9eb0031464b60bcb5a720d22
[Pipeline] // withDockerContainer
[Pipeline] }
[Pipeline] // stage
[Pipeline] stage
[Pipeline] { (build netstandard)
[Pipeline] getContext
[Pipeline] readFile
[Pipeline] sh
[log4net_feature_cd-pipeline-76KUCPODUF6LCE45226EBUR4GNVLYPMYVC23Z4ITBOMNJT3CA2WA] Running shell script
+ docker build -t 220643b688e1e37454b379682087ec420123d257 -f buildtools/docker/builder-netstandard/Dockerfile buildtools/docker/builder-netstandard
Sending build context to Docker daemon 2.048 kB
Step 1 : FROM microsoft/dotnet
---> e692284946db
Step 2 : MAINTAINER "dev@logging.apache.org"
---> Using cache
---> 4a76b9d068f2
Step 3 : RUN apt-get update && apt-get install -y nant git
---> Using cache
---> 3e13e04d3894
Successfully built 3e13e04d3894
[Pipeline] dockerFingerprintFrom
[Pipeline] sh
[log4net_feature_cd-pipeline-76KUCPODUF6LCE45226EBUR4GNVLYPMYVC23Z4ITBOMNJT3CA2WA] Running shell script
+ docker inspect -f . 220643b688e1e37454b379682087ec420123d257
.
[Pipeline] withDockerContainer
ubuntu-2 does not seem to be running inside a container
$ docker run -t -d -u 2396:2396 -w /home/jenkins/jenkins-slave/workspace/log4net_feature_cd-pipeline-76KUCPODUF6LCE45226EBUR4GNVLYPMYVC23Z4ITBOMNJT3CA2WA -v /home/jenkins/jenkins-slave/workspace/log4net_feature_cd-pipeline-76KUCPODUF6LCE45226EBUR4GNVLYPMYVC23Z4ITBOMNJT3CA2WA:/home/jenkins/jenkins-slave/workspace/log4net_feature_cd-pipeline-76KUCPODUF6LCE45226EBUR4GNVLYPMYVC23Z4ITBOMNJT3CA2WA:rw -v /home/jenkins/jenkins-slave/workspace/log4net_feature_cd-pipeline-76KUCPODUF6LCE45226EBUR4GNVLYPMYVC23Z4ITBOMNJT3CA2WA@tmp:/home/jenkins/jenkins-slave/workspace/log4net_feature_cd-pipeline-76KUCPODUF6LCE45226EBUR4GNVLYPMYVC23Z4ITBOMNJT3CA2WA@tmp:rw -e ******** -e ******** -e ******** -e ******** -e ******** -e ******** -e ******** -e ******** -e ******** -e ******** -e ******** -e ******** -e ******** -e ******** -e ******** -e ******** -e ******** -e ******** -e ******** -e ******** -e ******** -e ******** -e ******** --entrypoint cat 220643b688e1e37454b379682087ec420123d257
[Pipeline] {
[Pipeline] sh
[log4net_feature_cd-pipeline-76KUCPODUF6LCE45226EBUR4GNVLYPMYVC23Z4ITBOMNJT3CA2WA] Running shell script
++ pwd
+ export PACKAGEHOME=/home/jenkins/jenkins-slave/workspace/log4net_feature_cd-pipeline-76KUCPODUF6LCE45226EBUR4GNVLYPMYVC23Z4ITBOMNJT3CA2WA/.nuget/
+ PACKAGEHOME=/home/jenkins/jenkins-slave/workspace/log4net_feature_cd-pipeline-76KUCPODUF6LCE45226EBUR4GNVLYPMYVC23Z4ITBOMNJT3CA2WA/.nuget/
[Pipeline] sh
[log4net_feature_cd-pipeline-76KUCPODUF6LCE45226EBUR4GNVLYPMYVC23Z4ITBOMNJT3CA2WA] Running shell script
+ rm -rf bin/ tests/
[Pipeline] checkout
> git rev-parse --is-inside-work-tree # timeout=10
Fetching changes from 2 remote Git repositories
> git config remote.origin.url https://github.com/apache/logging-log4net.git # timeout=10
Fetching upstream changes from https://github.com/apache/logging-log4net.git
> git --version # timeout=10
using GIT_ASKPASS to set credentials dpsenner at github
> git fetch --tags --progress https://github.com/apache/logging-log4net.git +refs/heads/*:refs/remotes/origin/*
> git config remote.origin1.url https://github.com/apache/logging-log4net.git # timeout=10
Fetching upstream changes from https://github.com/apache/logging-log4net.git
using GIT_ASKPASS to set credentials dpsenner at github
> git fetch --tags --progress https://github.com/apache/logging-log4net.git +refs/pull/*/head:refs/remotes/origin/pr/*
Checking out Revision 6265127777736467f4ff933510ababd6885152bc (feature/cd-pipeline)
> git config core.sparsecheckout # timeout=10
> git checkout -f 6265127777736467f4ff933510ababd6885152bc
[Pipeline] sh
[log4net_feature_cd-pipeline-76KUCPODUF6LCE45226EBUR4GNVLYPMYVC23Z4ITBOMNJT3CA2WA] Running shell script
+ nant compile-netstandard
NAnt 0.92 (Build 0.92.4526.0; rc1; 05/23/2012)
Copyright (C) 2001-2012 Gerry Shaw
http://nant.sourceforge.net
Buildfile: file:///home/jenkins/jenkins-slave/workspace/log4net_feature_cd-pipeline-76KUCPODUF6LCE45226EBUR4GNVLYPMYVC23Z4ITBOMNJT3CA2WA/log4net.build
Target framework: Mono 4.0 Profile
Target(s) specified: compile-netstandard
check-current-build-config:
set-build-configuration:
set-debug-build-configuration:
check-current-build-config:
set-build-configuration-flags:
compile-netstandard:
set-debug-build-configuration:
check-current-build-config:
set-build-configuration-flags:
compile-netstandard-current-configuration:
[exec] 1.0.4
[echo] dotnet restore --configfile NuGet.Config
[exec] MSBUILD : error MSB1001: Unknown switch.
[exec] Switch: --configfile NuGet.Config
[exec]
[exec] For switch syntax, type "MSBuild /help"
BUILD FAILED
/home/jenkins/jenkins-slave/workspace/log4net_feature_cd-pipeline-76KUCPODUF6LCE45226EBUR4GNVLYPMYVC23Z4ITBOMNJT3CA2WA/log4net.build(1767,8):
External Program Failed: dotnet (return code was 1)
Total time: 1.9 seconds.
[Pipeline] }
$ docker stop --time=1 eedeef85e95a5318d217416af657213a4e8a30468a421145c51d883efd61a377
$ docker rm -f eedeef85e95a5318d217416af657213a4e8a30468a421145c51d883efd61a377
[Pipeline] // withDockerContainer
[Pipeline] }
[Pipeline] // stage
[Pipeline] stage
[Pipeline] { (build site)
Stage 'build site' skipped due to earlier failure(s)
[Pipeline] }
[Pipeline] // stage
[Pipeline] stage
[Pipeline] { (prepare package)
Stage 'prepare package' skipped due to earlier failure(s)
[Pipeline] }
[Pipeline] // stage
[Pipeline] stage
[Pipeline] { (check test results)
Stage 'check test results' skipped due to earlier failure(s)
[Pipeline] }
[Pipeline] // stage
[Pipeline] stage
[Pipeline] { (publish site)
Stage 'publish site' skipped due to earlier failure(s)
[Pipeline] }
[Pipeline] // stage
[Pipeline] stage
[Pipeline] { (Declarative: Post Actions)
Build failed in Jenkins: logging-log4net » feature/cd-pipeline #80
Posted by Apache Jenkins Server <je...@builds.apache.org>.
See <https://builds.apache.org/job/logging-log4net/job/feature%252Fcd-pipeline/80/display/redirect>
------------------------------------------
Branch indexing
Connecting to https://api.github.com using dpsenner/****** (dpsenner at github)
Obtained Jenkinsfile from 2db4df2013e20bc3ef8975e35485532be896aab1
[Pipeline] node
Running on H15 in /home/jenkins/jenkins-slave/workspace/log4net_feature_cd-pipeline-76KUCPODUF6LCE45226EBUR4GNVLYPMYVC23Z4ITBOMNJT3CA2WA
[Pipeline] {
[Pipeline] timeout
Timeout set to expire in 1 hr 0 min
[Pipeline] {
[Pipeline] stage
[Pipeline] { (checkout)
[Pipeline] deleteDir
[Pipeline] checkout
Cloning the remote Git repository
Cloning repository https://github.com/apache/logging-log4net.git
> git init /home/jenkins/jenkins-slave/workspace/log4net_feature_cd-pipeline-76KUCPODUF6LCE45226EBUR4GNVLYPMYVC23Z4ITBOMNJT3CA2WA # timeout=10
Fetching upstream changes from https://github.com/apache/logging-log4net.git
> git --version # timeout=10
using GIT_ASKPASS to set credentials dpsenner at github
> git fetch --tags --progress https://github.com/apache/logging-log4net.git +refs/heads/*:refs/remotes/origin/*
> git config remote.origin.url https://github.com/apache/logging-log4net.git # timeout=10
> git config --add remote.origin.fetch +refs/heads/*:refs/remotes/origin/* # timeout=10
> git config remote.origin.url https://github.com/apache/logging-log4net.git # timeout=10
Fetching upstream changes from https://github.com/apache/logging-log4net.git
using GIT_ASKPASS to set credentials dpsenner at github
> git fetch --tags --progress https://github.com/apache/logging-log4net.git +refs/heads/*:refs/remotes/origin/*
> git config remote.origin1.url https://github.com/apache/logging-log4net.git # timeout=10
Fetching upstream changes from https://github.com/apache/logging-log4net.git
using GIT_ASKPASS to set credentials dpsenner at github
> git fetch --tags --progress https://github.com/apache/logging-log4net.git +refs/pull/*/head:refs/remotes/origin/pr/*
Checking out Revision 2db4df2013e20bc3ef8975e35485532be896aab1 (feature/cd-pipeline)
> git config core.sparsecheckout # timeout=10
> git checkout -f 2db4df2013e20bc3ef8975e35485532be896aab1
> git rev-list e17124f1b1b470051ad08aa67bf0ac1902a0505c # timeout=10
[Pipeline] }
[Pipeline] // stage
[Pipeline] stage
[Pipeline] { (build net-3.5)
[Pipeline] node
Running on windows-2012-2 in f:\jenkins\jenkins-slave\workspace\log4net_feature_cd-pipeline-76KUCPODUF6LCE45226EBUR4GNVLYPMYVC23Z4ITBOMNJT3CA2WA
[Pipeline] {
[Pipeline] withEnv
[Pipeline] {
[Pipeline] deleteDir
[Pipeline] checkout
Cloning the remote Git repository
Cloning repository https://github.com/apache/logging-log4net.git
> git init f:\jenkins\jenkins-slave\workspace\log4net_feature_cd-pipeline-76KUCPODUF6LCE45226EBUR4GNVLYPMYVC23Z4ITBOMNJT3CA2WA # timeout=10
Fetching upstream changes from https://github.com/apache/logging-log4net.git
> git --version # timeout=10
using GIT_ASKPASS to set credentials dpsenner at github
> git fetch --tags --progress https://github.com/apache/logging-log4net.git +refs/heads/*:refs/remotes/origin/*
> git config remote.origin.url https://github.com/apache/logging-log4net.git # timeout=10
> git config --add remote.origin.fetch +refs/heads/*:refs/remotes/origin/* # timeout=10
> git config remote.origin.url https://github.com/apache/logging-log4net.git # timeout=10
Fetching upstream changes from https://github.com/apache/logging-log4net.git
using GIT_ASKPASS to set credentials dpsenner at github
> git fetch --tags --progress https://github.com/apache/logging-log4net.git +refs/heads/*:refs/remotes/origin/*
> git config remote.origin1.url https://github.com/apache/logging-log4net.git # timeout=10
Fetching upstream changes from https://github.com/apache/logging-log4net.git
using GIT_ASKPASS to set credentials dpsenner at github
> git fetch --tags --progress https://github.com/apache/logging-log4net.git +refs/pull/*/head:refs/remotes/origin/pr/*
Checking out Revision 2db4df2013e20bc3ef8975e35485532be896aab1 (feature/cd-pipeline)
> git config core.sparsecheckout # timeout=10
> git checkout -f 2db4df2013e20bc3ef8975e35485532be896aab1
[Pipeline] bat
[log4net_feature_cd-pipeline-76KUCPODUF6LCE45226EBUR4GNVLYPMYVC23Z4ITBOMNJT3CA2WA] Running batch script
f:\jenkins\jenkins-slave\workspace\log4net_feature_cd-pipeline-76KUCPODUF6LCE45226EBUR4GNVLYPMYVC23Z4ITBOMNJT3CA2WA>F:\jenkins\tools\nant\nant-0.92\bin\NAnt.exe -t:net-3.5 -buildfile:log4net.build compile-net-3.5
NAnt 0.92 (Build 0.92.4543.0; release; 6/9/2012)
Copyright (C) 2001-2012 Gerry Shaw
http://nant.sourceforge.net
BUILD FAILED
f:\jenkins\jenkins-slave\workspace\log4net_feature_cd-pipeline-76KUCPODUF6LCE45226EBUR4GNVLYPMYVC23Z4ITBOMNJT3CA2WA\log4net.build(1772,10):
Error loading buildfile.
The '=' character, hexadecimal value 0x3D, cannot be included in a name. Line 1772, position 10.
For more information regarding the cause of the build failure, run the build again in debug mode.
Try 'nant -help' for more information
[Pipeline] }
[Pipeline] // withEnv
[Pipeline] }
[Pipeline] // node
[Pipeline] }
[Pipeline] // stage
[Pipeline] stage
[Pipeline] { (build net-3.5-cp)
Stage 'build net-3.5-cp' skipped due to earlier failure(s)
[Pipeline] }
[Pipeline] // stage
[Pipeline] stage
[Pipeline] { (build net-4.0)
Stage 'build net-4.0' skipped due to earlier failure(s)
[Pipeline] }
[Pipeline] // stage
[Pipeline] stage
[Pipeline] { (build net-4.0-cp)
Stage 'build net-4.0-cp' skipped due to earlier failure(s)
[Pipeline] }
[Pipeline] // stage
[Pipeline] stage
[Pipeline] { (build net-4.5)
Stage 'build net-4.5' skipped due to earlier failure(s)
[Pipeline] }
[Pipeline] // stage
[Pipeline] stage
[Pipeline] { (build mono-2.0)
Stage 'build mono-2.0' skipped due to earlier failure(s)
[Pipeline] }
[Pipeline] // stage
[Pipeline] stage
[Pipeline] { (build mono-3.5)
Stage 'build mono-3.5' skipped due to earlier failure(s)
[Pipeline] }
[Pipeline] // stage
[Pipeline] stage
[Pipeline] { (build mono-4.0)
Stage 'build mono-4.0' skipped due to earlier failure(s)
[Pipeline] }
[Pipeline] // stage
[Pipeline] stage
[Pipeline] { (build netstandard)
Stage 'build netstandard' skipped due to earlier failure(s)
[Pipeline] }
[Pipeline] // stage
[Pipeline] stage
[Pipeline] { (build site)
Stage 'build site' skipped due to earlier failure(s)
[Pipeline] }
[Pipeline] // stage
[Pipeline] stage
[Pipeline] { (prepare package)
Stage 'prepare package' skipped due to earlier failure(s)
[Pipeline] }
[Pipeline] // stage
[Pipeline] stage
[Pipeline] { (check test results)
Stage 'check test results' skipped due to earlier failure(s)
[Pipeline] }
[Pipeline] // stage
[Pipeline] stage
[Pipeline] { (publish site)
Stage 'publish site' skipped due to earlier failure(s)
[Pipeline] }
[Pipeline] // stage
[Pipeline] stage
[Pipeline] { (Declarative: Post Actions)
[Pipeline] step
Build failed in Jenkins: logging-log4net » feature/cd-pipeline #79
Posted by Apache Jenkins Server <je...@builds.apache.org>.
See <https://builds.apache.org/job/logging-log4net/job/feature%252Fcd-pipeline/79/display/redirect>
------------------------------------------
Branch indexing
Connecting to https://api.github.com using dpsenner/****** (dpsenner at github)
Obtained Jenkinsfile from e17124f1b1b470051ad08aa67bf0ac1902a0505c
[Pipeline] node
Running on H23 in /home/jenkins/jenkins-slave/workspace/log4net_feature_cd-pipeline-76KUCPODUF6LCE45226EBUR4GNVLYPMYVC23Z4ITBOMNJT3CA2WA
[Pipeline] {
[Pipeline] timeout
Timeout set to expire in 1 hr 0 min
[Pipeline] {
[Pipeline] stage
[Pipeline] { (checkout)
[Pipeline] deleteDir
[Pipeline] checkout
Cloning the remote Git repository
Cloning repository https://github.com/apache/logging-log4net.git
> git init /home/jenkins/jenkins-slave/workspace/log4net_feature_cd-pipeline-76KUCPODUF6LCE45226EBUR4GNVLYPMYVC23Z4ITBOMNJT3CA2WA # timeout=10
Fetching upstream changes from https://github.com/apache/logging-log4net.git
> git --version # timeout=10
using GIT_ASKPASS to set credentials dpsenner at github
> git fetch --tags --progress https://github.com/apache/logging-log4net.git +refs/heads/*:refs/remotes/origin/*
> git config remote.origin.url https://github.com/apache/logging-log4net.git # timeout=10
> git config --add remote.origin.fetch +refs/heads/*:refs/remotes/origin/* # timeout=10
> git config remote.origin.url https://github.com/apache/logging-log4net.git # timeout=10
Fetching upstream changes from https://github.com/apache/logging-log4net.git
using GIT_ASKPASS to set credentials dpsenner at github
> git fetch --tags --progress https://github.com/apache/logging-log4net.git +refs/heads/*:refs/remotes/origin/*
> git config remote.origin1.url https://github.com/apache/logging-log4net.git # timeout=10
Fetching upstream changes from https://github.com/apache/logging-log4net.git
using GIT_ASKPASS to set credentials dpsenner at github
> git fetch --tags --progress https://github.com/apache/logging-log4net.git +refs/pull/*/head:refs/remotes/origin/pr/*
Checking out Revision e17124f1b1b470051ad08aa67bf0ac1902a0505c (feature/cd-pipeline)
> git config core.sparsecheckout # timeout=10
> git checkout -f e17124f1b1b470051ad08aa67bf0ac1902a0505c
> git rev-list 00eea53a9495e6c470a495ece6ca914d0a3fc754 # timeout=10
[Pipeline] }
[Pipeline] // stage
[Pipeline] stage
[Pipeline] { (build net-3.5)
[Pipeline] node
Running on windows-2012-2 in f:\jenkins\jenkins-slave\workspace\log4net_feature_cd-pipeline-76KUCPODUF6LCE45226EBUR4GNVLYPMYVC23Z4ITBOMNJT3CA2WA
[Pipeline] {
[Pipeline] withEnv
[Pipeline] {
[Pipeline] deleteDir
[Pipeline] checkout
Cloning the remote Git repository
Cloning repository https://github.com/apache/logging-log4net.git
> git init f:\jenkins\jenkins-slave\workspace\log4net_feature_cd-pipeline-76KUCPODUF6LCE45226EBUR4GNVLYPMYVC23Z4ITBOMNJT3CA2WA # timeout=10
Fetching upstream changes from https://github.com/apache/logging-log4net.git
> git --version # timeout=10
using GIT_ASKPASS to set credentials dpsenner at github
> git fetch --tags --progress https://github.com/apache/logging-log4net.git +refs/heads/*:refs/remotes/origin/*
> git config remote.origin.url https://github.com/apache/logging-log4net.git # timeout=10
> git config --add remote.origin.fetch +refs/heads/*:refs/remotes/origin/* # timeout=10
> git config remote.origin.url https://github.com/apache/logging-log4net.git # timeout=10
Fetching upstream changes from https://github.com/apache/logging-log4net.git
using GIT_ASKPASS to set credentials dpsenner at github
> git fetch --tags --progress https://github.com/apache/logging-log4net.git +refs/heads/*:refs/remotes/origin/*
> git config remote.origin1.url https://github.com/apache/logging-log4net.git # timeout=10
Fetching upstream changes from https://github.com/apache/logging-log4net.git
using GIT_ASKPASS to set credentials dpsenner at github
> git fetch --tags --progress https://github.com/apache/logging-log4net.git +refs/pull/*/head:refs/remotes/origin/pr/*
Checking out Revision e17124f1b1b470051ad08aa67bf0ac1902a0505c (feature/cd-pipeline)
> git config core.sparsecheckout # timeout=10
> git checkout -f e17124f1b1b470051ad08aa67bf0ac1902a0505c
[Pipeline] bat
[log4net_feature_cd-pipeline-76KUCPODUF6LCE45226EBUR4GNVLYPMYVC23Z4ITBOMNJT3CA2WA] Running batch script
f:\jenkins\jenkins-slave\workspace\log4net_feature_cd-pipeline-76KUCPODUF6LCE45226EBUR4GNVLYPMYVC23Z4ITBOMNJT3CA2WA>F:\jenkins\tools\nant\nant-0.92\bin\NAnt.exe -t:net-3.5 -buildfile:log4net.build compile-net-3.5
NAnt 0.92 (Build 0.92.4543.0; release; 6/9/2012)
Copyright (C) 2001-2012 Gerry Shaw
http://nant.sourceforge.net
BUILD FAILED
f:\jenkins\jenkins-slave\workspace\log4net_feature_cd-pipeline-76KUCPODUF6LCE45226EBUR4GNVLYPMYVC23Z4ITBOMNJT3CA2WA\log4net.build(1772,10):
Error loading buildfile.
The '=' character, hexadecimal value 0x3D, cannot be included in a name. Line 1772, position 10.
For more information regarding the cause of the build failure, run the build again in debug mode.
Try 'nant -help' for more information
[Pipeline] }
[Pipeline] // withEnv
[Pipeline] }
[Pipeline] // node
[Pipeline] }
[Pipeline] // stage
[Pipeline] stage
[Pipeline] { (build net-3.5-cp)
Stage 'build net-3.5-cp' skipped due to earlier failure(s)
[Pipeline] }
[Pipeline] // stage
[Pipeline] stage
[Pipeline] { (build net-4.0)
Stage 'build net-4.0' skipped due to earlier failure(s)
[Pipeline] }
[Pipeline] // stage
[Pipeline] stage
[Pipeline] { (build net-4.0-cp)
Stage 'build net-4.0-cp' skipped due to earlier failure(s)
[Pipeline] }
[Pipeline] // stage
[Pipeline] stage
[Pipeline] { (build net-4.5)
Stage 'build net-4.5' skipped due to earlier failure(s)
[Pipeline] }
[Pipeline] // stage
[Pipeline] stage
[Pipeline] { (build mono-2.0)
Stage 'build mono-2.0' skipped due to earlier failure(s)
[Pipeline] }
[Pipeline] // stage
[Pipeline] stage
[Pipeline] { (build mono-3.5)
Stage 'build mono-3.5' skipped due to earlier failure(s)
[Pipeline] }
[Pipeline] // stage
[Pipeline] stage
[Pipeline] { (build mono-4.0)
Stage 'build mono-4.0' skipped due to earlier failure(s)
[Pipeline] }
[Pipeline] // stage
[Pipeline] stage
[Pipeline] { (build netstandard)
Stage 'build netstandard' skipped due to earlier failure(s)
[Pipeline] }
[Pipeline] // stage
[Pipeline] stage
[Pipeline] { (build site)
Stage 'build site' skipped due to earlier failure(s)
[Pipeline] }
[Pipeline] // stage
[Pipeline] stage
[Pipeline] { (prepare package)
Stage 'prepare package' skipped due to earlier failure(s)
[Pipeline] }
[Pipeline] // stage
[Pipeline] stage
[Pipeline] { (check test results)
Stage 'check test results' skipped due to earlier failure(s)
[Pipeline] }
[Pipeline] // stage
[Pipeline] stage
[Pipeline] { (publish site)
Stage 'publish site' skipped due to earlier failure(s)
[Pipeline] }
[Pipeline] // stage
[Pipeline] stage
[Pipeline] { (Declarative: Post Actions)
[Pipeline] step