You are viewing a plain text version of this content. The canonical link for it is here.
Posted to dev@accumulo.apache.org by Apache Jenkins Server <je...@builds.apache.org> on 2012/03/13 21:01:58 UTC

Build failed in Jenkins: Accumulo-Trunk #263

See <https://builds.apache.org/job/Accumulo-Trunk/263/changes>

Changes:

[bimargulies] ACCUMULO-464: hoist all subdirs of src to the toplevel, and tweak pathnames to go match.

------------------------------------------
[...truncated 1313 lines...]
A         examples/simple/src/main/java/org/apache/accumulo
A         examples/simple/src/main/java/org/apache/accumulo/examples
A         examples/simple/src/main/java/org/apache/accumulo/examples/simple
A         examples/simple/src/main/java/org/apache/accumulo/examples/simple/isolation
AU        examples/simple/src/main/java/org/apache/accumulo/examples/simple/isolation/InterferenceTest.java
A         examples/simple/src/main/java/org/apache/accumulo/examples/simple/shard
AU        examples/simple/src/main/java/org/apache/accumulo/examples/simple/shard/Query.java
AU        examples/simple/src/main/java/org/apache/accumulo/examples/simple/shard/Index.java
AU        examples/simple/src/main/java/org/apache/accumulo/examples/simple/shard/Reverse.java
AU        examples/simple/src/main/java/org/apache/accumulo/examples/simple/shard/ContinuousQuery.java
A         examples/simple/src/main/java/org/apache/accumulo/examples/simple/mapreduce
AU        examples/simple/src/main/java/org/apache/accumulo/examples/simple/mapreduce/WordCount.java
AU        examples/simple/src/main/java/org/apache/accumulo/examples/simple/mapreduce/RegexExample.java
A         examples/simple/src/main/java/org/apache/accumulo/examples/simple/mapreduce/UniqueColumns.java
AU        examples/simple/src/main/java/org/apache/accumulo/examples/simple/mapreduce/TableToFile.java
AU        examples/simple/src/main/java/org/apache/accumulo/examples/simple/mapreduce/RowHash.java
AU        examples/simple/src/main/java/org/apache/accumulo/examples/simple/mapreduce/TeraSortIngest.java
A         examples/simple/src/main/java/org/apache/accumulo/examples/simple/mapreduce/bulk
AU        examples/simple/src/main/java/org/apache/accumulo/examples/simple/mapreduce/bulk/BulkIngestExample.java
AU        examples/simple/src/main/java/org/apache/accumulo/examples/simple/mapreduce/bulk/GenerateTestData.java
AU        examples/simple/src/main/java/org/apache/accumulo/examples/simple/mapreduce/bulk/SetupTable.java
AU        examples/simple/src/main/java/org/apache/accumulo/examples/simple/mapreduce/bulk/VerifyIngest.java
A         examples/simple/src/main/java/org/apache/accumulo/examples/simple/constraints
AU        examples/simple/src/main/java/org/apache/accumulo/examples/simple/constraints/MaxMutationSize.java
AU        examples/simple/src/main/java/org/apache/accumulo/examples/simple/constraints/AlphaNumKeyConstraint.java
AU        examples/simple/src/main/java/org/apache/accumulo/examples/simple/constraints/NumericValueConstraint.java
A         examples/simple/src/main/java/org/apache/accumulo/examples/simple/filedata
AU        examples/simple/src/main/java/org/apache/accumulo/examples/simple/filedata/FileDataQuery.java
AU        examples/simple/src/main/java/org/apache/accumulo/examples/simple/filedata/ChunkInputFormat.java
AU        examples/simple/src/main/java/org/apache/accumulo/examples/simple/filedata/FileDataIngest.java
AU        examples/simple/src/main/java/org/apache/accumulo/examples/simple/filedata/ChunkInputStream.java
AU        examples/simple/src/main/java/org/apache/accumulo/examples/simple/filedata/KeyUtil.java
AU        examples/simple/src/main/java/org/apache/accumulo/examples/simple/filedata/VisibilityCombiner.java
AU        examples/simple/src/main/java/org/apache/accumulo/examples/simple/filedata/ChunkCombiner.java
AU        examples/simple/src/main/java/org/apache/accumulo/examples/simple/filedata/CharacterHistogram.java
A         examples/simple/src/main/java/org/apache/accumulo/examples/simple/dirlist
AU        examples/simple/src/main/java/org/apache/accumulo/examples/simple/dirlist/Viewer.java
AU        examples/simple/src/main/java/org/apache/accumulo/examples/simple/dirlist/QueryUtil.java
AU        examples/simple/src/main/java/org/apache/accumulo/examples/simple/dirlist/FileCount.java
AU        examples/simple/src/main/java/org/apache/accumulo/examples/simple/dirlist/Ingest.java
A         examples/simple/src/main/java/org/apache/accumulo/examples/simple/helloworld
AU        examples/simple/src/main/java/org/apache/accumulo/examples/simple/helloworld/InsertWithBatchWriter.java
AU        examples/simple/src/main/java/org/apache/accumulo/examples/simple/helloworld/ReadData.java
AU        examples/simple/src/main/java/org/apache/accumulo/examples/simple/helloworld/InsertWithOutputFormat.java
A         examples/simple/src/main/java/org/apache/accumulo/examples/simple/client
AU        examples/simple/src/main/java/org/apache/accumulo/examples/simple/client/RandomBatchWriter.java
AU        examples/simple/src/main/java/org/apache/accumulo/examples/simple/client/Flush.java
AU        examples/simple/src/main/java/org/apache/accumulo/examples/simple/client/ReadWriteExample.java
AU        examples/simple/src/main/java/org/apache/accumulo/examples/simple/client/SequentialBatchWriter.java
AU        examples/simple/src/main/java/org/apache/accumulo/examples/simple/client/RowOperations.java
AU        examples/simple/src/main/java/org/apache/accumulo/examples/simple/client/RandomBatchScanner.java
A         examples/simple/src/main/java/org/apache/accumulo/examples/simple/combiner
AU        examples/simple/src/main/java/org/apache/accumulo/examples/simple/combiner/StatsCombiner.java
AU        examples/simple/pom.xml
A         examples/wikisearch
A         examples/wikisearch/query
A         examples/wikisearch/query/src
A         examples/wikisearch/query/src/assembly
AU        examples/wikisearch/query/src/assembly/dist.xml
A         examples/wikisearch/query/src/test
A         examples/wikisearch/query/src/test/java
A         examples/wikisearch/query/src/test/java/org
A         examples/wikisearch/query/src/test/java/org/apache
A         examples/wikisearch/query/src/test/java/org/apache/accumulo
A         examples/wikisearch/query/src/test/java/org/apache/accumulo/examples
A         examples/wikisearch/query/src/test/java/org/apache/accumulo/examples/wikisearch
A         examples/wikisearch/query/src/test/java/org/apache/accumulo/examples/wikisearch/logic
AU        examples/wikisearch/query/src/test/java/org/apache/accumulo/examples/wikisearch/logic/StandaloneStatusReporter.java
AU        examples/wikisearch/query/src/test/java/org/apache/accumulo/examples/wikisearch/logic/TestQueryLogic.java
A         examples/wikisearch/query/src/test/resources
AU        examples/wikisearch/query/src/test/resources/enwiki-20110901-001.xml
A         examples/wikisearch/query/src/main
A         examples/wikisearch/query/src/main/java
A         examples/wikisearch/query/src/main/java/org
A         examples/wikisearch/query/src/main/java/org/apache
A         examples/wikisearch/query/src/main/java/org/apache/accumulo
A         examples/wikisearch/query/src/main/java/org/apache/accumulo/examples
A         examples/wikisearch/query/src/main/java/org/apache/accumulo/examples/wikisearch
A         examples/wikisearch/query/src/main/java/org/apache/accumulo/examples/wikisearch/sample
AU        examples/wikisearch/query/src/main/java/org/apache/accumulo/examples/wikisearch/sample/Results.java
AU        examples/wikisearch/query/src/main/java/org/apache/accumulo/examples/wikisearch/sample/Field.java
AU        examples/wikisearch/query/src/main/java/org/apache/accumulo/examples/wikisearch/sample/Document.java
A         examples/wikisearch/query/src/main/java/org/apache/accumulo/examples/wikisearch/jexl
AU        examples/wikisearch/query/src/main/java/org/apache/accumulo/examples/wikisearch/jexl/Arithmetic.java
A         examples/wikisearch/query/src/main/java/org/apache/accumulo/examples/wikisearch/function
AU        examples/wikisearch/query/src/main/java/org/apache/accumulo/examples/wikisearch/function/QueryFunctions.java
A         examples/wikisearch/query/src/main/java/org/apache/accumulo/examples/wikisearch/query
AU        examples/wikisearch/query/src/main/java/org/apache/accumulo/examples/wikisearch/query/Query.java
AU        examples/wikisearch/query/src/main/java/org/apache/accumulo/examples/wikisearch/query/IQuery.java
A         examples/wikisearch/query/src/main/java/org/apache/accumulo/examples/wikisearch/iterator
AU        examples/wikisearch/query/src/main/java/org/apache/accumulo/examples/wikisearch/iterator/BooleanLogicTreeNode.java
AU        examples/wikisearch/query/src/main/java/org/apache/accumulo/examples/wikisearch/iterator/DefaultIteratorEnvironment.java
AU        examples/wikisearch/query/src/main/java/org/apache/accumulo/examples/wikisearch/iterator/OptimizedQueryIterator.java
AU        examples/wikisearch/query/src/main/java/org/apache/accumulo/examples/wikisearch/iterator/FieldIndexIterator.java
AU        examples/wikisearch/query/src/main/java/org/apache/accumulo/examples/wikisearch/iterator/BooleanLogicIterator.java
AU        examples/wikisearch/query/src/main/java/org/apache/accumulo/examples/wikisearch/iterator/ReadAheadIterator.java
AU        examples/wikisearch/query/src/main/java/org/apache/accumulo/examples/wikisearch/iterator/UniqFieldNameValueIterator.java
AU        examples/wikisearch/query/src/main/java/org/apache/accumulo/examples/wikisearch/iterator/EvaluatingIterator.java
AU        examples/wikisearch/query/src/main/java/org/apache/accumulo/examples/wikisearch/iterator/OrIterator.java
AU        examples/wikisearch/query/src/main/java/org/apache/accumulo/examples/wikisearch/iterator/AndIterator.java
AU        examples/wikisearch/query/src/main/java/org/apache/accumulo/examples/wikisearch/iterator/AbstractEvaluatingIterator.java
A         examples/wikisearch/query/src/main/java/org/apache/accumulo/examples/wikisearch/parser
AU        examples/wikisearch/query/src/main/java/org/apache/accumulo/examples/wikisearch/parser/QueryParser.java
AU        examples/wikisearch/query/src/main/java/org/apache/accumulo/examples/wikisearch/parser/FieldIndexQueryReWriter.java
AU        examples/wikisearch/query/src/main/java/org/apache/accumulo/examples/wikisearch/parser/TreeNode.java
AU        examples/wikisearch/query/src/main/java/org/apache/accumulo/examples/wikisearch/parser/RangeCalculator.java
AU        examples/wikisearch/query/src/main/java/org/apache/accumulo/examples/wikisearch/parser/TreeBuilder.java
AU        examples/wikisearch/query/src/main/java/org/apache/accumulo/examples/wikisearch/parser/EventFields.java
AU        examples/wikisearch/query/src/main/java/org/apache/accumulo/examples/wikisearch/parser/QueryEvaluator.java
AU        examples/wikisearch/query/src/main/java/org/apache/accumulo/examples/wikisearch/parser/JexlOperatorConstants.java
A         examples/wikisearch/query/src/main/java/org/apache/accumulo/examples/wikisearch/logic
AU        examples/wikisearch/query/src/main/java/org/apache/accumulo/examples/wikisearch/logic/QueryLogic.java
AU        examples/wikisearch/query/src/main/java/org/apache/accumulo/examples/wikisearch/logic/AbstractQueryLogic.java
AU        examples/wikisearch/query/src/main/java/org/apache/accumulo/examples/wikisearch/logic/ContentLogic.java
A         examples/wikisearch/query/src/main/java/org/apache/accumulo/examples/wikisearch/util
AU        examples/wikisearch/query/src/main/java/org/apache/accumulo/examples/wikisearch/util/BaseKeyParser.java
AU        examples/wikisearch/query/src/main/java/org/apache/accumulo/examples/wikisearch/util/FieldIndexKeyParser.java
AU        examples/wikisearch/query/src/main/java/org/apache/accumulo/examples/wikisearch/util/KeyParser.java
A         examples/wikisearch/query/src/main/resources
A         examples/wikisearch/query/src/main/resources/META-INF
A         examples/wikisearch/query/src/main/resources/META-INF/ejb-jar.xml.example
AU        examples/wikisearch/query/src/main/resources/META-INF/MANIFEST.MF
AU        examples/wikisearch/query/pom.xml
AU        examples/wikisearch/README.parallel
A         examples/wikisearch/ingest
A         examples/wikisearch/ingest/conf
A         examples/wikisearch/ingest/conf/wikipedia.xml.example
AU        examples/wikisearch/ingest/conf/wikipedia_parallel.xml.example
A         examples/wikisearch/ingest/src
A         examples/wikisearch/ingest/src/assembly
AU        examples/wikisearch/ingest/src/assembly/dist.xml
A         examples/wikisearch/ingest/src/test
A         examples/wikisearch/ingest/src/test/java
A         examples/wikisearch/ingest/src/test/java/org
A         examples/wikisearch/ingest/src/test/java/org/apache
A         examples/wikisearch/ingest/src/test/java/org/apache/accumulo
A         examples/wikisearch/ingest/src/test/java/org/apache/accumulo/examples
A         examples/wikisearch/ingest/src/test/java/org/apache/accumulo/examples/wikisearch
A         examples/wikisearch/ingest/src/test/java/org/apache/accumulo/examples/wikisearch/normalizer
AU        examples/wikisearch/ingest/src/test/java/org/apache/accumulo/examples/wikisearch/normalizer/testNumberNormalizer.java
A         examples/wikisearch/ingest/src/test/java/org/apache/accumulo/examples/wikisearch/reader
AU        examples/wikisearch/ingest/src/test/java/org/apache/accumulo/examples/wikisearch/reader/AggregatingRecordReaderTest.java
A         examples/wikisearch/ingest/src/test/java/org/apache/accumulo/examples/wikisearch/ingest
AU        examples/wikisearch/ingest/src/test/java/org/apache/accumulo/examples/wikisearch/ingest/StandaloneStatusReporter.java
AU        examples/wikisearch/ingest/src/test/java/org/apache/accumulo/examples/wikisearch/ingest/WikipediaInputSplitTest.java
AU        examples/wikisearch/ingest/src/test/java/org/apache/accumulo/examples/wikisearch/ingest/WikipediaMapperTest.java
A         examples/wikisearch/ingest/src/test/java/org/apache/accumulo/examples/wikisearch/iterator
AU        examples/wikisearch/ingest/src/test/java/org/apache/accumulo/examples/wikisearch/iterator/GlobalIndexUidTest.java
AU        examples/wikisearch/ingest/src/test/java/org/apache/accumulo/examples/wikisearch/iterator/TextIndexTest.java
A         examples/wikisearch/ingest/src/test/resources
AU        examples/wikisearch/ingest/src/test/resources/enwiki-20110901-001.xml
A         examples/wikisearch/ingest/src/main
A         examples/wikisearch/ingest/src/main/protobuf
AU        examples/wikisearch/ingest/src/main/protobuf/TermWeight.proto
AU        examples/wikisearch/ingest/src/main/protobuf/Uid.proto
AU        examples/wikisearch/ingest/src/main/protobuf/compile_protos.sh
A         examples/wikisearch/ingest/src/main/java
A         examples/wikisearch/ingest/src/main/java/org
A         examples/wikisearch/ingest/src/main/java/org/apache
A         examples/wikisearch/ingest/src/main/java/org/apache/accumulo
A         examples/wikisearch/ingest/src/main/java/org/apache/accumulo/examples
A         examples/wikisearch/ingest/src/main/java/org/apache/accumulo/examples/wikisearch
A         examples/wikisearch/ingest/src/main/java/org/apache/accumulo/examples/wikisearch/output
AU        examples/wikisearch/ingest/src/main/java/org/apache/accumulo/examples/wikisearch/output/SortingRFileOutputFormat.java
AU        examples/wikisearch/ingest/src/main/java/org/apache/accumulo/examples/wikisearch/output/BufferingRFileRecordWriter.java
A         examples/wikisearch/ingest/src/main/java/org/apache/accumulo/examples/wikisearch/protobuf
AU        examples/wikisearch/ingest/src/main/java/org/apache/accumulo/examples/wikisearch/protobuf/TermWeight.java
AU        examples/wikisearch/ingest/src/main/java/org/apache/accumulo/examples/wikisearch/protobuf/Uid.java
A         examples/wikisearch/ingest/src/main/java/org/apache/accumulo/examples/wikisearch/normalizer
AU        examples/wikisearch/ingest/src/main/java/org/apache/accumulo/examples/wikisearch/normalizer/Normalizer.java
AU        examples/wikisearch/ingest/src/main/java/org/apache/accumulo/examples/wikisearch/normalizer/NumberNormalizer.java
AU        examples/wikisearch/ingest/src/main/java/org/apache/accumulo/examples/wikisearch/normalizer/LcNoDiacriticsNormalizer.java
AU        examples/wikisearch/ingest/src/main/java/org/apache/accumulo/examples/wikisearch/normalizer/NoOpNormalizer.java
A         examples/wikisearch/ingest/src/main/java/org/apache/accumulo/examples/wikisearch/reader
AU        examples/wikisearch/ingest/src/main/java/org/apache/accumulo/examples/wikisearch/reader/AggregatingRecordReader.java
AU        examples/wikisearch/ingest/src/main/java/org/apache/accumulo/examples/wikisearch/reader/LongLineRecordReader.java
AU        examples/wikisearch/ingest/src/main/java/org/apache/accumulo/examples/wikisearch/reader/LfLineReader.java
A         examples/wikisearch/ingest/src/main/java/org/apache/accumulo/examples/wikisearch/ingest
AU        examples/wikisearch/ingest/src/main/java/org/apache/accumulo/examples/wikisearch/ingest/ArticleExtractor.java
AU        examples/wikisearch/ingest/src/main/java/org/apache/accumulo/examples/wikisearch/ingest/WikipediaInputFormat.java
A         examples/wikisearch/ingest/src/main/java/org/apache/accumulo/examples/wikisearch/ingest/LRUOutputCombiner.java
AU        examples/wikisearch/ingest/src/main/java/org/apache/accumulo/examples/wikisearch/ingest/WikipediaIngester.java
AU        examples/wikisearch/ingest/src/main/java/org/apache/accumulo/examples/wikisearch/ingest/WikipediaPartitioner.java
AU        examples/wikisearch/ingest/src/main/java/org/apache/accumulo/examples/wikisearch/ingest/WikipediaPartitionedIngester.java
AU        examples/wikisearch/ingest/src/main/java/org/apache/accumulo/examples/wikisearch/ingest/WikipediaMapper.java
AU        examples/wikisearch/ingest/src/main/java/org/apache/accumulo/examples/wikisearch/ingest/WikipediaConfiguration.java
AU        examples/wikisearch/ingest/src/main/java/org/apache/accumulo/examples/wikisearch/ingest/WikipediaPartitionedMapper.java
A         examples/wikisearch/ingest/src/main/java/org/apache/accumulo/examples/wikisearch/iterator
AU        examples/wikisearch/ingest/src/main/java/org/apache/accumulo/examples/wikisearch/iterator/GlobalIndexUidCombiner.java
AU        examples/wikisearch/ingest/src/main/java/org/apache/accumulo/examples/wikisearch/iterator/TextIndexCombiner.java
A         examples/wikisearch/ingest/src/main/java/org/apache/accumulo/examples/wikisearch/util
AU        examples/wikisearch/ingest/src/main/java/org/apache/accumulo/examples/wikisearch/util/TextUtil.java
A         examples/wikisearch/ingest/bin
AU        examples/wikisearch/ingest/bin/ingest.sh
AU        examples/wikisearch/ingest/bin/ingest_parallel.sh
AU        examples/wikisearch/ingest/pom.xml
AU        examples/wikisearch/pom.xml
A         examples/wikisearch/query-war
A         examples/wikisearch/query-war/src
A         examples/wikisearch/query-war/src/test
A         examples/wikisearch/query-war/src/test/resources
AU        examples/wikisearch/query-war/src/test/resources/test.xml
A         examples/wikisearch/query-war/src/main
A         examples/wikisearch/query-war/src/main/webapp
AU        examples/wikisearch/query-war/src/main/webapp/style.xsl
A         examples/wikisearch/query-war/src/main/webapp/WEB-INF
AU        examples/wikisearch/query-war/src/main/webapp/WEB-INF/jboss-web.xml
AU        examples/wikisearch/query-war/src/main/webapp/WEB-INF/web.xml
AU        examples/wikisearch/query-war/src/main/webapp/ui.jsp
AU        examples/wikisearch/query-war/pom.xml
AU        examples/wikisearch/README
AU        examples/pom.xml
At revision 1300320
Parsing POMs
ERROR: Failed to parse POMs
hudson.util.IOException2: remote file operation failed: <https://builds.apache.org/job/Accumulo-Trunk/ws/accumulo-trunk> at hudson.remoting.Channel@1c45275d:ubuntu5
	at hudson.FilePath.act(FilePath.java:784)
	at hudson.FilePath.act(FilePath.java:770)
	at hudson.maven.MavenModuleSetBuild$RunnerImpl.parsePoms(MavenModuleSetBuild.java:914)
	at hudson.maven.MavenModuleSetBuild$RunnerImpl.doRun(MavenModuleSetBuild.java:658)
	at hudson.model.AbstractBuild$AbstractRunner.run(AbstractBuild.java:473)
	at hudson.model.Run.run(Run.java:1408)
	at hudson.maven.MavenModuleSetBuild.run(MavenModuleSetBuild.java:481)
	at hudson.model.ResourceController.execute(ResourceController.java:88)
	at hudson.model.Executor.run(Executor.java:238)
Caused by: hudson.remoting.ProxyException: hudson.maven.MavenModuleSetBuild$MavenExecutionException: org.apache.maven.project.ProjectBuildingException: Some problems were encountered while processing the POMs:
[FATAL] Non-resolvable parent POM: Could not find artifact org.apache.accumulo:accumulo:pom:1.5.0-incubating-SNAPSHOT and 'parent.relativePath' points at wrong local POM @ line 21, column 11

	at hudson.maven.MavenModuleSetBuild$PomParser.invoke(MavenModuleSetBuild.java:1274)
	at hudson.maven.MavenModuleSetBuild$PomParser.invoke(MavenModuleSetBuild.java:1049)
	at hudson.FilePath$FileCallableWrapper.call(FilePath.java:2099)
	at hudson.remoting.UserRequest.perform(UserRequest.java:118)
	at hudson.remoting.UserRequest.perform(UserRequest.java:48)
	at hudson.remoting.Request$2.run(Request.java:287)
	at hudson.remoting.InterceptingExecutorService$1.call(InterceptingExecutorService.java:72)
	at java.util.concurrent.FutureTask$Sync.innerRun(FutureTask.java:334)
	at java.util.concurrent.FutureTask.run(FutureTask.java:166)
	at java.util.concurrent.ThreadPoolExecutor.runWorker(ThreadPoolExecutor.java:1110)
	at java.util.concurrent.ThreadPoolExecutor$Worker.run(ThreadPoolExecutor.java:603)
	at java.lang.Thread.run(Thread.java:636)
Caused by: hudson.remoting.ProxyException: org.apache.maven.project.ProjectBuildingException: Some problems were encountered while processing the POMs:
[FATAL] Non-resolvable parent POM: Could not find artifact org.apache.accumulo:accumulo:pom:1.5.0-incubating-SNAPSHOT and 'parent.relativePath' points at wrong local POM @ line 21, column 11

	at org.apache.maven.project.DefaultProjectBuilder.build(DefaultProjectBuilder.java:363)
	at hudson.maven.MavenEmbedder.buildProjects(MavenEmbedder.java:361)
	at hudson.maven.MavenEmbedder.readProjects(MavenEmbedder.java:331)
	at hudson.maven.MavenModuleSetBuild$PomParser.invoke(MavenModuleSetBuild.java:1224)
	... 11 more
Skipping Cobertura coverage report as build was not UNSTABLE or better ...


Jenkins build is back to normal : Accumulo-Trunk #266

Posted by Apache Jenkins Server <je...@builds.apache.org>.
See <https://builds.apache.org/job/Accumulo-Trunk/266/changes>



Build failed in Jenkins: Accumulo-Trunk #265

Posted by Apache Jenkins Server <je...@builds.apache.org>.
See <https://builds.apache.org/job/Accumulo-Trunk/265/changes>

Changes:

[bimargulies] ACCUMULO-464: also pick up assembly descriptor.

[bimargulies] ACCUMULO-464: sort out pathnames in assemble.

------------------------------------------
[...truncated 1721 lines...]

[INFO] Instrumentation was successful.
[INFO] NOT adding cobertura ser file to attached artifacts list.
[INFO] [debug] execute contextualize
[INFO] Using 'UTF-8' encoding to copy filtered resources.
[INFO] Copying 1 resource
[INFO] Copying 3 resources
[INFO] Copying 3 resources

[INFO] --- maven-resources-plugin:2.5:testResources (default-testResources) @ wikisearch-query ---
[INFO] [INFO] Nothing to compile - all classes are up to date

[INFO] --- maven-compiler-plugin:2.3.2:testCompile (default-testCompile) @ wikisearch-query ---
[INFO] [INFO] Surefire report directory: <https://builds.apache.org/job/Accumulo-Trunk/ws/accumulo-trunk/examples/wikisearch/query/target/surefire-reports>

-------------------------------------------------------
 T E S T S
-------------------------------------------------------

[INFO] --- maven-surefire-plugin:2.9:test (default-test) @ wikisearch-query ---
Running org.apache.accumulo.examples.wikisearch.logic.TestQueryLogic
Tests run: 1, Failures: 0, Errors: 0, Skipped: 0, Time elapsed: 0.883 sec
Flushing results...
Flushing results done
Cobertura: Loaded information on 60 classes.
Cobertura: Saved information on 60 classes.

Results :

Tests run: 1, Failures: 0, Errors: 0, Skipped: 0

[JENKINS] Recording test results
[JENKINS] Archiving <https://builds.apache.org/job/Accumulo-Trunk/ws/accumulo-trunk/examples/wikisearch/query/pom.xml> to /home/hudson/hudson/jobs/Accumulo-Trunk/modules/org.apache.accumulo$wikisearch-query/builds/2012-03-13_22-01-49/archive/org.apache.accumulo/wikisearch-query/1.5.0-incubating-SNAPSHOT/wikisearch-query-1.5.0-incubating-SNAPSHOT.pom
[JENKINS] cobertura-maven-plugin already configured with xml reports enabled
[INFO] 
[INFO] --- cobertura-maven-plugin:2.5.1:cobertura (default-cli) @ wikisearch-query ---
[INFO] Cobertura 1.9.4.1 - GNU GPL License (NO WARRANTY) - See COPYRIGHT file
Cobertura: Loaded information on 60 classes.
Report time: 2524ms

[INFO] Cobertura Report generation was successful.
[JENKINS] Recording coverage results
[JENKINS] Archiving <https://builds.apache.org/job/Accumulo-Trunk/ws/accumulo-trunk/examples/wikisearch/query/target/wikisearch-query-1.5.0-incubating-SNAPSHOT.jar> to /home/hudson/hudson/jobs/Accumulo-Trunk/modules/org.apache.accumulo$wikisearch-query/builds/2012-03-13_22-01-49/archive/org.apache.accumulo/wikisearch-query/1.5.0-incubating-SNAPSHOT/wikisearch-query-1.5.0-incubating-SNAPSHOT.jar
[INFO] Downloading: http://repo1.maven.org/maven2/org/eclipse/m2e/lifecycle-mapping/1.0.0/lifecycle-mapping-1.0.0.pom
                                                                        
[INFO] ------------------------------------------------------------------------
[INFO] Building wikisearch-query-war 1.5.0-incubating-SNAPSHOT
[INFO] ------------------------------------------------------------------------
[WARNING] The POM for org.eclipse.m2e:lifecycle-mapping:jar:1.0.0 is missing, no dependency information available
[WARNING] Failed to retrieve plugin descriptor for org.eclipse.m2e:lifecycle-mapping:1.0.0: Plugin org.eclipse.m2e:lifecycle-mapping:1.0.0 or one of its dependencies could not be resolved: Failed to read artifact descriptor for org.eclipse.m2e:lifecycle-mapping:jar:1.0.0
[INFO] 
[INFO] --- maven-clean-plugin:2.4.1:clean (default-clean) @ wikisearch-query-war ---
[INFO] 
[INFO] --- maven-enforcer-plugin:1.0.1:enforce (enforce-mvn) @ wikisearch-query-war ---
[INFO] 
[INFO] --- maven-remote-resources-plugin:1.2.1:process (default) @ wikisearch-query-war ---
[debug] execute contextualize
[INFO] [INFO] Using 'UTF-8' encoding to copy filtered resources.
[INFO] skip non existing resourceDirectory <https://builds.apache.org/job/Accumulo-Trunk/ws/accumulo-trunk/examples/wikisearch/query-war/src/main/resources>
[INFO] Copying 3 resources

[INFO] --- maven-resources-plugin:2.5:resources (default-resources) @ wikisearch-query-war ---
[INFO] [INFO] No sources to compile

[INFO] --- maven-compiler-plugin:2.3.2:compile (default-compile) @ wikisearch-query-war ---
[debug] execute contextualize
[INFO] [INFO] Using 'UTF-8' encoding to copy filtered resources.
[INFO] Copying 1 resource
[INFO] Copying 3 resources

[INFO] --- maven-resources-plugin:2.5:testResources (default-testResources) @ wikisearch-query-war ---
[INFO] [INFO] No sources to compile

[INFO] --- maven-compiler-plugin:2.3.2:testCompile (default-testCompile) @ wikisearch-query-war ---
[INFO] [INFO] Surefire report directory: <https://builds.apache.org/job/Accumulo-Trunk/ws/accumulo-trunk/examples/wikisearch/query-war/target/surefire-reports>

-------------------------------------------------------
 T E S T S
-------------------------------------------------------

[INFO] --- maven-surefire-plugin:2.9:test (default-test) @ wikisearch-query-war ---

Results :

Tests run: 0, Failures: 0, Errors: 0, Skipped: 0

[JENKINS] Recording test results
[INFO] 
[INFO] --- maven-war-plugin:2.1.1:war (default-war) @ wikisearch-query-war ---
[INFO] Packaging webapp
[INFO] Assembling webapp [wikisearch-query-war] in [<https://builds.apache.org/job/Accumulo-Trunk/ws/accumulo-trunk/examples/wikisearch/query-war/target/wikisearch-query-war-1.5.0-incubating-SNAPSHOT]>
[INFO] Processing war project
[INFO] Copying webapp resources [<https://builds.apache.org/job/Accumulo-Trunk/ws/accumulo-trunk/examples/wikisearch/query-war/src/main/webapp]>
[INFO] Webapp assembled in [44 msecs]
[INFO] Building war: <https://builds.apache.org/job/Accumulo-Trunk/ws/accumulo-trunk/examples/wikisearch/query-war/target/wikisearch-query-war-1.5.0-incubating-SNAPSHOT.war>
[INFO] WEB-INF/web.xml already added, skipping
[INFO] 
[INFO] --- maven-site-plugin:3.0:attach-descriptor (attach-descriptor) @ wikisearch-query-war ---
[JENKINS] Configuring cobertura-maven-plugin to enable xml reports
[INFO] 
[INFO] --- maven-enforcer-plugin:1.0.1:enforce (enforce-mvn) @ wikisearch-query-war ---
[INFO] 
[INFO] --- maven-remote-resources-plugin:1.2.1:process (default) @ wikisearch-query-war ---
[debug] execute contextualize
[INFO] [INFO] Using 'UTF-8' encoding to copy filtered resources.
[INFO] skip non existing resourceDirectory <https://builds.apache.org/job/Accumulo-Trunk/ws/accumulo-trunk/examples/wikisearch/query-war/src/main/resources>
[INFO] Copying 3 resources
[INFO] Copying 3 resources

[INFO] --- maven-resources-plugin:2.5:resources (default-resources) @ wikisearch-query-war ---
[INFO] [INFO] No sources to compile

[INFO] --- maven-compiler-plugin:2.3.2:compile (default-compile) @ wikisearch-query-war ---
[INFO] [WARNING] No files to instrument.
[INFO] NOT adding cobertura ser file to attached artifacts list.

[INFO] --- cobertura-maven-plugin:2.5.1:instrument (default-cli) @ wikisearch-query-war ---
[debug] execute contextualize
[INFO] [INFO] Using 'UTF-8' encoding to copy filtered resources.
[INFO] Copying 1 resource
[INFO] Copying 3 resources
[INFO] Copying 3 resources

[INFO] --- maven-resources-plugin:2.5:testResources (default-testResources) @ wikisearch-query-war ---
[INFO] [INFO] No sources to compile

[INFO] --- maven-compiler-plugin:2.3.2:testCompile (default-testCompile) @ wikisearch-query-war ---
[INFO] [INFO] Surefire report directory: <https://builds.apache.org/job/Accumulo-Trunk/ws/accumulo-trunk/examples/wikisearch/query-war/target/surefire-reports>

-------------------------------------------------------
 T E S T S
-------------------------------------------------------

[INFO] --- maven-surefire-plugin:2.9:test (default-test) @ wikisearch-query-war ---

Results :

Tests run: 0, Failures: 0, Errors: 0, Skipped: 0

[JENKINS] Recording test results
[JENKINS] Archiving <https://builds.apache.org/job/Accumulo-Trunk/ws/accumulo-trunk/examples/wikisearch/query-war/pom.xml> to /home/hudson/hudson/jobs/Accumulo-Trunk/modules/org.apache.accumulo$wikisearch-query-war/builds/2012-03-13_22-01-49/archive/org.apache.accumulo/wikisearch-query-war/1.5.0-incubating-SNAPSHOT/wikisearch-query-war-1.5.0-incubating-SNAPSHOT.pom
[JENKINS] cobertura-maven-plugin already configured with xml reports enabled
[INFO] 
[INFO] --- cobertura-maven-plugin:2.5.1:cobertura (default-cli) @ wikisearch-query-war ---
[JENKINS] Archiving <https://builds.apache.org/job/Accumulo-Trunk/ws/accumulo-trunk/examples/wikisearch/query-war/target/wikisearch-query-war-1.5.0-incubating-SNAPSHOT.war> to /home/hudson/hudson/jobs/Accumulo-Trunk/modules/org.apache.accumulo$wikisearch-query-war/builds/2012-03-13_22-01-49/archive/org.apache.accumulo/wikisearch-query-war/1.5.0-incubating-SNAPSHOT/wikisearch-query-war-1.5.0-incubating-SNAPSHOT.war
[INFO] Downloading: http://repo1.maven.org/maven2/org/eclipse/m2e/lifecycle-mapping/1.0.0/lifecycle-mapping-1.0.0.pom
                                                                        
[INFO] ------------------------------------------------------------------------
[INFO] Building accumulo-assemble 1.5.0-incubating-SNAPSHOT
[INFO] ------------------------------------------------------------------------
[WARNING] The POM for org.eclipse.m2e:lifecycle-mapping:jar:1.0.0 is missing, no dependency information available
[WARNING] Failed to retrieve plugin descriptor for org.eclipse.m2e:lifecycle-mapping:1.0.0: Plugin org.eclipse.m2e:lifecycle-mapping:1.0.0 or one of its dependencies could not be resolved: Failed to read artifact descriptor for org.eclipse.m2e:lifecycle-mapping:jar:1.0.0
[INFO] [INFO] Deleting <https://builds.apache.org/job/Accumulo-Trunk/ws/accumulo-trunk/assemble> (includes = [**/*.pyc], excludes = [])

[INFO] --- maven-clean-plugin:2.4.1:clean (default-clean) @ accumulo-assemble ---
[INFO] 
[INFO] --- maven-enforcer-plugin:1.0.1:enforce (enforce-mvn) @ accumulo-assemble ---
[INFO] 
[INFO] --- maven-remote-resources-plugin:1.2.1:process (default) @ accumulo-assemble ---
[INFO] 
[INFO] --- maven-dependency-plugin:2.3:copy-dependencies (copy-dependencies) @ accumulo-assemble ---
[INFO] Missing pdflatex command. Please install.

[INFO] --- exec-maven-plugin:1.2:exec (user-manual) @ accumulo-assemble ---
[INFO] 
[INFO] --- maven-site-plugin:3.0:attach-descriptor (attach-descriptor) @ accumulo-assemble ---
[INFO] 
[INFO] --- exec-maven-plugin:1.2:exec (config webpage) @ accumulo-assemble ---
Exception in thread "main" java.lang.NoClassDefFoundError: org/apache/log4j/Logger
	at org.apache.accumulo.core.conf.AccumuloConfiguration.<clinit>(AccumuloConfiguration.java:29)
Caused by: java.lang.ClassNotFoundException: org.apache.log4j.Logger
	at java.net.URLClassLoader$1.run(URLClassLoader.java:202)
	at java.security.AccessController.doPrivileged(Native Method)
	at java.net.URLClassLoader.findClass(URLClassLoader.java:190)
	at java.lang.ClassLoader.loadClass(ClassLoader.java:306)
	at sun.misc.Launcher$AppClassLoader.loadClass(Launcher.java:301)
	at java.lang.ClassLoader.loadClass(ClassLoader.java:247)
	... 1 more
Could not find the main class: org.apache.accumulo.core.conf.DefaultConfiguration.  Program will exit.
[JENKINS] Archiving <https://builds.apache.org/job/Accumulo-Trunk/ws/accumulo-trunk/assemble/pom.xml> to /home/hudson/hudson/jobs/Accumulo-Trunk/modules/org.apache.accumulo$accumulo-assemble/builds/2012-03-13_22-01-49/archive/org.apache.accumulo/accumulo-assemble/1.5.0-incubating-SNAPSHOT/accumulo-assemble-1.5.0-incubating-SNAPSHOT.pom
[INFO] ------------------------------------------------------------------------
[INFO] Reactor Summary:
[INFO] 
[INFO] accumulo .......................................... SUCCESS [49.859s]
[INFO] cloudtrace ........................................ SUCCESS [50.073s]
[INFO] accumulo-start .................................... SUCCESS [50.923s]
[INFO] accumulo-core ..................................... SUCCESS [18:13.550s]
[INFO] accumulo-server ................................... SUCCESS [3:52.529s]
[INFO] accumulo-examples ................................. SUCCESS [2.977s]
[INFO] examples-simple ................................... SUCCESS [26.437s]
[INFO] accumulo-wikisearch ............................... SUCCESS [2.570s]
[INFO] wikisearch-ingest ................................. SUCCESS [24.485s]
[INFO] wikisearch-query .................................. SUCCESS [49.880s]
[INFO] wikisearch-query-war .............................. SUCCESS [3.625s]
[INFO] accumulo-assemble ................................. FAILURE [1.175s]
[INFO] ------------------------------------------------------------------------
[INFO] BUILD FAILURE
[INFO] ------------------------------------------------------------------------
[INFO] Total time: 27:05.510s
[INFO] Finished at: Tue Mar 13 22:29:09 UTC 2012
[INFO] Final Memory: 71M/221M
[INFO] ------------------------------------------------------------------------
mavenExecutionResult exceptions not empty
message : Failed to execute goal org.codehaus.mojo:exec-maven-plugin:1.2:exec (config webpage) on project accumulo-assemble: Command execution failed.
cause : Command execution failed.
Stack trace : 
org.apache.maven.lifecycle.LifecycleExecutionException: Failed to execute goal org.codehaus.mojo:exec-maven-plugin:1.2:exec (config webpage) on project accumulo-assemble: Command execution failed.
	at org.apache.maven.lifecycle.internal.MojoExecutor.execute(MojoExecutor.java:217)
	at org.apache.maven.lifecycle.internal.MojoExecutor.execute(MojoExecutor.java:153)
	at org.apache.maven.lifecycle.internal.MojoExecutor.execute(MojoExecutor.java:145)
	at org.apache.maven.lifecycle.internal.LifecycleModuleBuilder.buildProject(LifecycleModuleBuilder.java:84)
	at org.apache.maven.lifecycle.internal.LifecycleModuleBuilder.buildProject(LifecycleModuleBuilder.java:59)
	at org.apache.maven.lifecycle.internal.LifecycleStarter.singleThreadedBuild(LifecycleStarter.java:183)
	at org.apache.maven.lifecycle.internal.LifecycleStarter.execute(LifecycleStarter.java:161)
	at org.apache.maven.DefaultMaven.doExecute(DefaultMaven.java:319)
	at org.apache.maven.DefaultMaven.execute(DefaultMaven.java:156)
	at org.jvnet.hudson.maven3.launcher.Maven3Launcher.main(Maven3Launcher.java:79)
	at sun.reflect.NativeMethodAccessorImpl.invoke0(Native Method)
	at sun.reflect.NativeMethodAccessorImpl.invoke(NativeMethodAccessorImpl.java:39)
	at sun.reflect.DelegatingMethodAccessorImpl.invoke(DelegatingMethodAccessorImpl.java:25)
	at java.lang.reflect.Method.invoke(Method.java:597)
	at org.codehaus.plexus.classworlds.launcher.Launcher.launchStandard(Launcher.java:329)
	at org.codehaus.plexus.classworlds.launcher.Launcher.launch(Launcher.java:239)
	at org.jvnet.hudson.maven3.agent.Maven3Main.launch(Maven3Main.java:158)
	at hudson.maven.Maven3Builder.call(Maven3Builder.java:104)
	at hudson.maven.Maven3Builder.call(Maven3Builder.java:70)
	at hudson.remoting.UserRequest.perform(UserRequest.java:118)
	at hudson.remoting.UserRequest.perform(UserRequest.java:48)
	at hudson.remoting.Request$2.run(Request.java:287)
	at hudson.remoting.InterceptingExecutorService$1.call(InterceptingExecutorService.java:72)
	at java.util.concurrent.FutureTask$Sync.innerRun(FutureTask.java:303)
	at java.util.concurrent.FutureTask.run(FutureTask.java:138)
	at java.util.concurrent.ThreadPoolExecutor$Worker.runTask(ThreadPoolExecutor.java:886)
	at java.util.concurrent.ThreadPoolExecutor$Worker.run(ThreadPoolExecutor.java:908)
	at java.lang.Thread.run(Thread.java:662)
Caused by: org.apache.maven.plugin.MojoExecutionException: Command execution failed.
	at org.codehaus.mojo.exec.ExecMojo.execute(ExecMojo.java:345)
	at org.apache.maven.plugin.DefaultBuildPluginManager.executeMojo(DefaultBuildPluginManager.java:101)
	at org.apache.maven.lifecycle.internal.MojoExecutor.execute(MojoExecutor.java:209)
	... 27 more
Caused by: org.apache.commons.exec.ExecuteException: Process exited with an error: 1(Exit value: 1)
	at org.apache.commons.exec.DefaultExecutor.executeInternal(DefaultExecutor.java:346)
	at org.apache.commons.exec.DefaultExecutor.execute(DefaultExecutor.java:149)
	at org.codehaus.mojo.exec.ExecMojo.executeCommandLine(ExecMojo.java:589)
	at org.codehaus.mojo.exec.ExecMojo.execute(ExecMojo.java:335)
	... 29 more
Sending e-mails to: accumulo-dev@incubator.apache.org
channel stopped
Skipping Cobertura coverage report as build was not UNSTABLE or better ...


Build failed in Jenkins: Accumulo-Trunk #264

Posted by Apache Jenkins Server <je...@builds.apache.org>.
See <https://builds.apache.org/job/Accumulo-Trunk/264/changes>

Changes:

[bimargulies] ACCUMULO-464: fix start pom, remove empty src dir.

------------------------------------------
[...truncated 3344 lines...]

[INFO] Instrumentation was successful.
[INFO] NOT adding cobertura ser file to attached artifacts list.
[debug] execute contextualize
[INFO] [INFO] Using 'UTF-8' encoding to copy filtered resources.
[INFO] Copying 1 resource
[INFO] Copying 3 resources
[INFO] Copying 3 resources

[INFO] --- maven-resources-plugin:2.5:testResources (default-testResources) @ wikisearch-query ---
[INFO] [INFO] Nothing to compile - all classes are up to date

[INFO] --- maven-compiler-plugin:2.3.2:testCompile (default-testCompile) @ wikisearch-query ---
[INFO] [INFO] Surefire report directory: <https://builds.apache.org/job/Accumulo-Trunk/ws/accumulo-trunk/examples/wikisearch/query/target/surefire-reports>

-------------------------------------------------------
 T E S T S
-------------------------------------------------------

[INFO] --- maven-surefire-plugin:2.9:test (default-test) @ wikisearch-query ---
Running org.apache.accumulo.examples.wikisearch.logic.TestQueryLogic
Tests run: 1, Failures: 0, Errors: 0, Skipped: 0, Time elapsed: 0.888 sec
Flushing results...
Flushing results done
Cobertura: Loaded information on 60 classes.
Cobertura: Saved information on 60 classes.

Results :

Tests run: 1, Failures: 0, Errors: 0, Skipped: 0

[JENKINS] Recording test results
[JENKINS] Archiving <https://builds.apache.org/job/Accumulo-Trunk/ws/accumulo-trunk/examples/wikisearch/query/pom.xml> to /home/hudson/hudson/jobs/Accumulo-Trunk/modules/org.apache.accumulo$wikisearch-query/builds/2012-03-13_21-05-25/archive/org.apache.accumulo/wikisearch-query/1.5.0-incubating-SNAPSHOT/wikisearch-query-1.5.0-incubating-SNAPSHOT.pom
[JENKINS] cobertura-maven-plugin already configured with xml reports enabled
[INFO] 
[INFO] --- cobertura-maven-plugin:2.5.1:cobertura (default-cli) @ wikisearch-query ---
[INFO] Cobertura 1.9.4.1 - GNU GPL License (NO WARRANTY) - See COPYRIGHT file
Cobertura: Loaded information on 60 classes.
Report time: 2543ms

[INFO] Cobertura Report generation was successful.
[JENKINS] Recording coverage results
[JENKINS] Archiving <https://builds.apache.org/job/Accumulo-Trunk/ws/accumulo-trunk/examples/wikisearch/query/target/wikisearch-query-1.5.0-incubating-SNAPSHOT.jar> to /home/hudson/hudson/jobs/Accumulo-Trunk/modules/org.apache.accumulo$wikisearch-query/builds/2012-03-13_21-05-25/archive/org.apache.accumulo/wikisearch-query/1.5.0-incubating-SNAPSHOT/wikisearch-query-1.5.0-incubating-SNAPSHOT.jar
[INFO]                                                                         
[INFO] ------------------------------------------------------------------------
[INFO] Building wikisearch-query-war 1.5.0-incubating-SNAPSHOT
[INFO] ------------------------------------------------------------------------
Downloading: http://repo1.maven.org/maven2/org/eclipse/m2e/lifecycle-mapping/1.0.0/lifecycle-mapping-1.0.0.pom
[WARNING] The POM for org.eclipse.m2e:lifecycle-mapping:jar:1.0.0 is missing, no dependency information available
[WARNING] Failed to retrieve plugin descriptor for org.eclipse.m2e:lifecycle-mapping:1.0.0: Plugin org.eclipse.m2e:lifecycle-mapping:1.0.0 or one of its dependencies could not be resolved: Failed to read artifact descriptor for org.eclipse.m2e:lifecycle-mapping:jar:1.0.0
[INFO] 
[INFO] --- maven-clean-plugin:2.4.1:clean (default-clean) @ wikisearch-query-war ---
[INFO] 
[INFO] --- maven-enforcer-plugin:1.0.1:enforce (enforce-mvn) @ wikisearch-query-war ---
[INFO] 
[INFO] --- maven-remote-resources-plugin:1.2.1:process (default) @ wikisearch-query-war ---
[debug] execute contextualize
[INFO] [INFO] Using 'UTF-8' encoding to copy filtered resources.
[INFO] skip non existing resourceDirectory <https://builds.apache.org/job/Accumulo-Trunk/ws/accumulo-trunk/examples/wikisearch/query-war/src/main/resources>
[INFO] Copying 3 resources

[INFO] --- maven-resources-plugin:2.5:resources (default-resources) @ wikisearch-query-war ---
[INFO] No sources to compile
[INFO] 
[INFO] --- maven-compiler-plugin:2.3.2:compile (default-compile) @ wikisearch-query-war ---
[debug] execute contextualize
[INFO] [INFO] Using 'UTF-8' encoding to copy filtered resources.
[INFO] Copying 1 resource
[INFO] Copying 3 resources

[INFO] --- maven-resources-plugin:2.5:testResources (default-testResources) @ wikisearch-query-war ---
[INFO] No sources to compile
[INFO] 
[INFO] --- maven-compiler-plugin:2.3.2:testCompile (default-testCompile) @ wikisearch-query-war ---
[INFO] [INFO] Surefire report directory: <https://builds.apache.org/job/Accumulo-Trunk/ws/accumulo-trunk/examples/wikisearch/query-war/target/surefire-reports>

-------------------------------------------------------
 T E S T S
-------------------------------------------------------

[INFO] --- maven-surefire-plugin:2.9:test (default-test) @ wikisearch-query-war ---

Results :

Tests run: 0, Failures: 0, Errors: 0, Skipped: 0

[JENKINS] Recording test results
[INFO] 
[INFO] --- maven-war-plugin:2.1.1:war (default-war) @ wikisearch-query-war ---
[INFO] Packaging webapp
[INFO] Assembling webapp [wikisearch-query-war] in [<https://builds.apache.org/job/Accumulo-Trunk/ws/accumulo-trunk/examples/wikisearch/query-war/target/wikisearch-query-war-1.5.0-incubating-SNAPSHOT]>
[INFO] Processing war project
[INFO] Copying webapp resources [<https://builds.apache.org/job/Accumulo-Trunk/ws/accumulo-trunk/examples/wikisearch/query-war/src/main/webapp]>
[INFO] Webapp assembled in [74 msecs]
[INFO] Building war: <https://builds.apache.org/job/Accumulo-Trunk/ws/accumulo-trunk/examples/wikisearch/query-war/target/wikisearch-query-war-1.5.0-incubating-SNAPSHOT.war>
[INFO] WEB-INF/web.xml already added, skipping
[INFO] 
[INFO] --- maven-site-plugin:3.0:attach-descriptor (attach-descriptor) @ wikisearch-query-war ---
[JENKINS] Configuring cobertura-maven-plugin to enable xml reports
[INFO] 
[INFO] --- maven-enforcer-plugin:1.0.1:enforce (enforce-mvn) @ wikisearch-query-war ---
[INFO] 
[INFO] --- maven-remote-resources-plugin:1.2.1:process (default) @ wikisearch-query-war ---
[INFO] [debug] execute contextualize
[INFO] Using 'UTF-8' encoding to copy filtered resources.
[INFO] skip non existing resourceDirectory <https://builds.apache.org/job/Accumulo-Trunk/ws/accumulo-trunk/examples/wikisearch/query-war/src/main/resources>
[INFO] Copying 3 resources
[INFO] Copying 3 resources

[INFO] --- maven-resources-plugin:2.5:resources (default-resources) @ wikisearch-query-war ---
[INFO] [INFO] No sources to compile

[INFO] --- maven-compiler-plugin:2.3.2:compile (default-compile) @ wikisearch-query-war ---
[INFO] [WARNING] No files to instrument.
[INFO] NOT adding cobertura ser file to attached artifacts list.

[INFO] --- cobertura-maven-plugin:2.5.1:instrument (default-cli) @ wikisearch-query-war ---
[debug] execute contextualize
[INFO] [INFO] Using 'UTF-8' encoding to copy filtered resources.
[INFO] Copying 1 resource
[INFO] Copying 3 resources
[INFO] Copying 3 resources

[INFO] --- maven-resources-plugin:2.5:testResources (default-testResources) @ wikisearch-query-war ---
[INFO] [INFO] No sources to compile

[INFO] --- maven-compiler-plugin:2.3.2:testCompile (default-testCompile) @ wikisearch-query-war ---
[INFO] [INFO] Surefire report directory: <https://builds.apache.org/job/Accumulo-Trunk/ws/accumulo-trunk/examples/wikisearch/query-war/target/surefire-reports>

-------------------------------------------------------
 T E S T S
-------------------------------------------------------

[INFO] --- maven-surefire-plugin:2.9:test (default-test) @ wikisearch-query-war ---

Results :

Tests run: 0, Failures: 0, Errors: 0, Skipped: 0

[JENKINS] Recording test results
[JENKINS] Archiving <https://builds.apache.org/job/Accumulo-Trunk/ws/accumulo-trunk/examples/wikisearch/query-war/pom.xml> to /home/hudson/hudson/jobs/Accumulo-Trunk/modules/org.apache.accumulo$wikisearch-query-war/builds/2012-03-13_21-05-25/archive/org.apache.accumulo/wikisearch-query-war/1.5.0-incubating-SNAPSHOT/wikisearch-query-war-1.5.0-incubating-SNAPSHOT.pom
[JENKINS] cobertura-maven-plugin already configured with xml reports enabled
[INFO] 
[INFO] --- cobertura-maven-plugin:2.5.1:cobertura (default-cli) @ wikisearch-query-war ---
[JENKINS] Archiving <https://builds.apache.org/job/Accumulo-Trunk/ws/accumulo-trunk/examples/wikisearch/query-war/target/wikisearch-query-war-1.5.0-incubating-SNAPSHOT.war> to /home/hudson/hudson/jobs/Accumulo-Trunk/modules/org.apache.accumulo$wikisearch-query-war/builds/2012-03-13_21-05-25/archive/org.apache.accumulo/wikisearch-query-war/1.5.0-incubating-SNAPSHOT/wikisearch-query-war-1.5.0-incubating-SNAPSHOT.war
[INFO] Downloading: http://repo1.maven.org/maven2/org/eclipse/m2e/lifecycle-mapping/1.0.0/lifecycle-mapping-1.0.0.pom
                                                                        
[INFO] ------------------------------------------------------------------------
[INFO] Building accumulo-assemble 1.5.0-incubating-SNAPSHOT
[INFO] ------------------------------------------------------------------------
[WARNING] The POM for org.eclipse.m2e:lifecycle-mapping:jar:1.0.0 is missing, no dependency information available
[WARNING] Failed to retrieve plugin descriptor for org.eclipse.m2e:lifecycle-mapping:1.0.0: Plugin org.eclipse.m2e:lifecycle-mapping:1.0.0 or one of its dependencies could not be resolved: Failed to read artifact descriptor for org.eclipse.m2e:lifecycle-mapping:jar:1.0.0
[INFO] [INFO] Deleting <https://builds.apache.org/job/Accumulo-Trunk/ws/accumulo-trunk/assemble> (includes = [**/*.pyc], excludes = [])

[INFO] --- maven-clean-plugin:2.4.1:clean (default-clean) @ accumulo-assemble ---
[INFO] 
[INFO] --- maven-enforcer-plugin:1.0.1:enforce (enforce-mvn) @ accumulo-assemble ---
[INFO] 
[INFO] --- maven-remote-resources-plugin:1.2.1:process (default) @ accumulo-assemble ---
[INFO] 
[INFO] --- maven-dependency-plugin:2.3:copy-dependencies (copy-dependencies) @ accumulo-assemble ---
[INFO] Missing pdflatex command. Please install.

[INFO] --- exec-maven-plugin:1.2:exec (user-manual) @ accumulo-assemble ---
[INFO] 
[INFO] --- maven-site-plugin:3.0:attach-descriptor (attach-descriptor) @ accumulo-assemble ---
[INFO] Exception in thread "main" java.lang.NoClassDefFoundError: org/apache/log4j/Logger
	at org.apache.accumulo.core.conf.AccumuloConfiguration.<clinit>(AccumuloConfiguration.java:29)
Caused by: java.lang.ClassNotFoundException: org.apache.log4j.Logger
	at java.net.URLClassLoader$1.run(URLClassLoader.java:202)
	at java.security.AccessController.doPrivileged(Native Method)
	at java.net.URLClassLoader.findClass(URLClassLoader.java:190)
	at java.lang.ClassLoader.loadClass(ClassLoader.java:306)
	at sun.misc.Launcher$AppClassLoader.loadClass(Launcher.java:301)
	at java.lang.ClassLoader.loadClass(ClassLoader.java:247)
	... 1 more
Could not find the main class: org.apache.accumulo.core.conf.DefaultConfiguration.  Program will exit.

[INFO] --- exec-maven-plugin:1.2:exec (config webpage) @ accumulo-assemble ---
[JENKINS] Archiving <https://builds.apache.org/job/Accumulo-Trunk/ws/accumulo-trunk/assemble/pom.xml> to /home/hudson/hudson/jobs/Accumulo-Trunk/modules/org.apache.accumulo$accumulo-assemble/builds/2012-03-13_21-05-25/archive/org.apache.accumulo/accumulo-assemble/1.5.0-incubating-SNAPSHOT/accumulo-assemble-1.5.0-incubating-SNAPSHOT.pom
[INFO] ------------------------------------------------------------------------
[INFO] Reactor Summary:
[INFO] 
[INFO] accumulo .......................................... SUCCESS [49.633s]
[INFO] cloudtrace ........................................ SUCCESS [37.078s]
[INFO] accumulo-start .................................... SUCCESS [47.000s]
[INFO] accumulo-core ..................................... SUCCESS [8:26.631s]
[INFO] accumulo-server ................................... SUCCESS [4:09.471s]
[INFO] accumulo-examples ................................. SUCCESS [3.154s]
[INFO] examples-simple ................................... SUCCESS [2:21.707s]
[INFO] accumulo-wikisearch ............................... SUCCESS [2.637s]
[INFO] wikisearch-ingest ................................. SUCCESS [29.738s]
[INFO] wikisearch-query .................................. SUCCESS [1:00.657s]
[INFO] wikisearch-query-war .............................. SUCCESS [5.926s]
[INFO] accumulo-assemble ................................. FAILURE [1.742s]
[INFO] ------------------------------------------------------------------------
[INFO] BUILD FAILURE
[INFO] ------------------------------------------------------------------------
[INFO] Total time: 20:14.309s
[INFO] Finished at: Tue Mar 13 21:25:55 UTC 2012
[INFO] Final Memory: 93M/197M
[INFO] ------------------------------------------------------------------------
mavenExecutionResult exceptions not empty
message : Failed to execute goal org.codehaus.mojo:exec-maven-plugin:1.2:exec (config webpage) on project accumulo-assemble: Command execution failed.
cause : Command execution failed.
Stack trace : 
org.apache.maven.lifecycle.LifecycleExecutionException: Failed to execute goal org.codehaus.mojo:exec-maven-plugin:1.2:exec (config webpage) on project accumulo-assemble: Command execution failed.
	at org.apache.maven.lifecycle.internal.MojoExecutor.execute(MojoExecutor.java:217)
	at org.apache.maven.lifecycle.internal.MojoExecutor.execute(MojoExecutor.java:153)
	at org.apache.maven.lifecycle.internal.MojoExecutor.execute(MojoExecutor.java:145)
	at org.apache.maven.lifecycle.internal.LifecycleModuleBuilder.buildProject(LifecycleModuleBuilder.java:84)
	at org.apache.maven.lifecycle.internal.LifecycleModuleBuilder.buildProject(LifecycleModuleBuilder.java:59)
	at org.apache.maven.lifecycle.internal.LifecycleStarter.singleThreadedBuild(LifecycleStarter.java:183)
	at org.apache.maven.lifecycle.internal.LifecycleStarter.execute(LifecycleStarter.java:161)
	at org.apache.maven.DefaultMaven.doExecute(DefaultMaven.java:319)
	at org.apache.maven.DefaultMaven.execute(DefaultMaven.java:156)
	at org.jvnet.hudson.maven3.launcher.Maven3Launcher.main(Maven3Launcher.java:79)
	at sun.reflect.NativeMethodAccessorImpl.invoke0(Native Method)
	at sun.reflect.NativeMethodAccessorImpl.invoke(NativeMethodAccessorImpl.java:39)
	at sun.reflect.DelegatingMethodAccessorImpl.invoke(DelegatingMethodAccessorImpl.java:25)
	at java.lang.reflect.Method.invoke(Method.java:597)
	at org.codehaus.plexus.classworlds.launcher.Launcher.launchStandard(Launcher.java:329)
	at org.codehaus.plexus.classworlds.launcher.Launcher.launch(Launcher.java:239)
	at org.jvnet.hudson.maven3.agent.Maven3Main.launch(Maven3Main.java:158)
	at hudson.maven.Maven3Builder.call(Maven3Builder.java:104)
	at hudson.maven.Maven3Builder.call(Maven3Builder.java:70)
	at hudson.remoting.UserRequest.perform(UserRequest.java:118)
	at hudson.remoting.UserRequest.perform(UserRequest.java:48)
	at hudson.remoting.Request$2.run(Request.java:287)
	at hudson.remoting.InterceptingExecutorService$1.call(InterceptingExecutorService.java:72)
	at java.util.concurrent.FutureTask$Sync.innerRun(FutureTask.java:303)
	at java.util.concurrent.FutureTask.run(FutureTask.java:138)
	at java.util.concurrent.ThreadPoolExecutor$Worker.runTask(ThreadPoolExecutor.java:886)
	at java.util.concurrent.ThreadPoolExecutor$Worker.run(ThreadPoolExecutor.java:908)
	at java.lang.Thread.run(Thread.java:662)
Caused by: org.apache.maven.plugin.MojoExecutionException: Command execution failed.
	at org.codehaus.mojo.exec.ExecMojo.execute(ExecMojo.java:345)
	at org.apache.maven.plugin.DefaultBuildPluginManager.executeMojo(DefaultBuildPluginManager.java:101)
	at org.apache.maven.lifecycle.internal.MojoExecutor.execute(MojoExecutor.java:209)
	... 27 more
Caused by: org.apache.commons.exec.ExecuteException: Process exited with an error: 1(Exit value: 1)
	at org.apache.commons.exec.DefaultExecutor.executeInternal(DefaultExecutor.java:346)
	at org.apache.commons.exec.DefaultExecutor.execute(DefaultExecutor.java:149)
	at org.codehaus.mojo.exec.ExecMojo.executeCommandLine(ExecMojo.java:589)
	at org.codehaus.mojo.exec.ExecMojo.execute(ExecMojo.java:335)
	... 29 more
Sending e-mails to: accumulo-dev@incubator.apache.org
channel stopped
Skipping Cobertura coverage report as build was not UNSTABLE or better ...