You are viewing a plain text version of this content. The canonical link for it is here.
Posted to builds@beam.apache.org by Apache Jenkins Server <je...@builds.apache.org> on 2018/12/15 00:21:29 UTC

Build failed in Jenkins: beam_PreCommit_Java_Cron #708

See <https://builds.apache.org/job/beam_PreCommit_Java_Cron/708/display/redirect?page=changes>

Changes:

[ankurgoenka] [BEAM-6179] Fixing bundle estimation when all xs are same

[scott] Remove Gradle from Jenkins job names

[kenn] [BEAM-6150] Superinterface for SerializableFunction allowing declared

[scott] [BEAM-6225] Setup Jenkins Job to Run VR with ExecutableStage (#7271)

------------------------------------------
[...truncated 60.01 MB...]
    INFO: Successfully wrote temporary file <https://builds.apache.org/job/beam_PreCommit_Java_Cron/ws/src/sdks/java/testing/nexmark/null/.temp-beam-2018-12-15_00-21-00-4/892f08d0-9fb5-444f-b661-7904284161b1>
    Dec 15, 2018 12:21:00 AM org.apache.beam.sdk.io.FileBasedSink$Writer close
    INFO: Successfully wrote temporary file <https://builds.apache.org/job/beam_PreCommit_Java_Cron/ws/src/sdks/java/testing/nexmark/null/.temp-beam-2018-12-15_00-21-00-4/02ba6095-2bef-4d90-88eb-446fd7cdef26>
    Dec 15, 2018 12:21:00 AM org.apache.beam.sdk.io.FileBasedSink$Writer close
    INFO: Successfully wrote temporary file <https://builds.apache.org/job/beam_PreCommit_Java_Cron/ws/src/sdks/java/testing/nexmark/null/.temp-beam-2018-12-15_00-21-00-4/7a1882af-2bb4-455f-9447-74c9f0e310ec>
    Dec 15, 2018 12:21:00 AM org.apache.beam.sdk.io.WriteFiles$FinalizeTempFileBundles$FinalizeFn process
    INFO: Finalizing 3 file results
    Dec 15, 2018 12:21:00 AM org.apache.beam.sdk.io.FileBasedSink$WriteOperation createMissingEmptyShards
    INFO: Finalizing for destination null num shards 3.
    Dec 15, 2018 12:21:00 AM org.apache.beam.sdk.io.FileBasedSink$WriteOperation moveToOutputFiles
    INFO: Will copy temporary file FileResult{tempFilename=<https://builds.apache.org/job/beam_PreCommit_Java_Cron/ws/src/sdks/java/testing/nexmark/null/.temp-beam-2018-12-15_00-21-00-4/892f08d0-9fb5-444f-b661-7904284161b1,> shard=2, window=org.apache.beam.sdk.transforms.windowing.GlobalWindow@60ba5a53, paneInfo=PaneInfo{isFirst=true, isLast=true, timing=ON_TIME, index=0, onTimeIndex=0}} to final location <https://builds.apache.org/job/beam_PreCommit_Java_Cron/ws/src/sdks/java/testing/nexmark/null/JoinToFiles--1200953154-00002-of-00003>
    Dec 15, 2018 12:21:00 AM org.apache.beam.sdk.io.FileBasedSink$WriteOperation moveToOutputFiles
    INFO: Will copy temporary file FileResult{tempFilename=<https://builds.apache.org/job/beam_PreCommit_Java_Cron/ws/src/sdks/java/testing/nexmark/null/.temp-beam-2018-12-15_00-21-00-4/02ba6095-2bef-4d90-88eb-446fd7cdef26,> shard=1, window=org.apache.beam.sdk.transforms.windowing.GlobalWindow@60ba5a53, paneInfo=PaneInfo{isFirst=true, isLast=true, timing=ON_TIME, index=0, onTimeIndex=0}} to final location <https://builds.apache.org/job/beam_PreCommit_Java_Cron/ws/src/sdks/java/testing/nexmark/null/JoinToFiles--1200953154-00001-of-00003>
    Dec 15, 2018 12:21:00 AM org.apache.beam.sdk.io.FileBasedSink$WriteOperation moveToOutputFiles
    INFO: Will copy temporary file FileResult{tempFilename=<https://builds.apache.org/job/beam_PreCommit_Java_Cron/ws/src/sdks/java/testing/nexmark/null/.temp-beam-2018-12-15_00-21-00-4/7a1882af-2bb4-455f-9447-74c9f0e310ec,> shard=0, window=org.apache.beam.sdk.transforms.windowing.GlobalWindow@60ba5a53, paneInfo=PaneInfo{isFirst=true, isLast=true, timing=ON_TIME, index=0, onTimeIndex=0}} to final location <https://builds.apache.org/job/beam_PreCommit_Java_Cron/ws/src/sdks/java/testing/nexmark/null/JoinToFiles--1200953154-00000-of-00003>
    Dec 15, 2018 12:21:00 AM org.apache.beam.sdk.io.FileBasedSink$WriteOperation removeTemporaryFiles
    INFO: Will remove known temporary file <https://builds.apache.org/job/beam_PreCommit_Java_Cron/ws/src/sdks/java/testing/nexmark/null/.temp-beam-2018-12-15_00-21-00-4/892f08d0-9fb5-444f-b661-7904284161b1>
    Dec 15, 2018 12:21:00 AM org.apache.beam.sdk.io.FileBasedSink$WriteOperation removeTemporaryFiles
    INFO: Will remove known temporary file <https://builds.apache.org/job/beam_PreCommit_Java_Cron/ws/src/sdks/java/testing/nexmark/null/.temp-beam-2018-12-15_00-21-00-4/02ba6095-2bef-4d90-88eb-446fd7cdef26>
    Dec 15, 2018 12:21:00 AM org.apache.beam.sdk.io.FileBasedSink$WriteOperation removeTemporaryFiles
    INFO: Will remove known temporary file <https://builds.apache.org/job/beam_PreCommit_Java_Cron/ws/src/sdks/java/testing/nexmark/null/.temp-beam-2018-12-15_00-21-00-4/7a1882af-2bb4-455f-9447-74c9f0e310ec>
    Dec 15, 2018 12:21:00 AM org.apache.beam.sdk.io.FileBasedSink$WriteOperation removeTemporaryFiles
    WARNING: Failed to match temporary files under: [<https://builds.apache.org/job/beam_PreCommit_Java_Cron/ws/src/sdks/java/testing/nexmark/null/.temp-beam-2018-12-15_00-21-00-4/].>
    Dec 15, 2018 12:21:00 AM org.apache.beam.sdk.extensions.sql.impl.BeamQueryPlanner convertToBeamRel
    INFO: SQL:
    WITH `bid_with_side` (`auction`, `bidder`, `price`, `dateTime`, `extra`, `side_id`) AS (SELECT `bid`.`auction`, `bid`.`bidder`, `bid`.`price`, `bid`.`dateTime`, `bid`.`extra`, CAST(MOD(`bid`.`bidder`, 10) AS BIGINT) AS `side_id`
    FROM `beam`.`bid` AS `bid`) (SELECT `bid_with_side`.`auction`, `bid_with_side`.`bidder`, `bid_with_side`.`price`, `bid_with_side`.`dateTime`, `side`.`extra`
    FROM `bid_with_side` AS `bid_with_side`,
    `beam`.`side` AS `side`
    WHERE `bid_with_side`.`side_id` = `side`.`id`)
    Dec 15, 2018 12:21:00 AM org.apache.beam.sdk.extensions.sql.impl.BeamQueryPlanner convertToBeamRel
    INFO: SQLPlan>
    LogicalProject(auction=[$0], bidder=[$1], price=[$2], dateTime=[$3], extra=[$7])
      LogicalFilter(condition=[=($5, $6)])
        LogicalJoin(condition=[true], joinType=[inner])
          LogicalProject(auction=[$0], bidder=[$1], price=[$2], dateTime=[$3], extra=[$4], side_id=[CAST(MOD($1, 10)):BIGINT NOT NULL])
            BeamIOSourceRel(table=[[beam, bid]])
          BeamIOSourceRel(table=[[beam, side]])

    Dec 15, 2018 12:21:00 AM org.apache.beam.sdk.extensions.sql.impl.BeamQueryPlanner convertToBeamRel
    INFO: BEAMPlan>
    BeamCalcRel(expr#0..7=[{inputs}], proj#0..3=[{exprs}], extra=[$t7])
      BeamJoinRel(condition=[=($5, $6)], joinType=[inner])
        BeamCalcRel(expr#0..4=[{inputs}], expr#5=[10], expr#6=[MOD($t1, $t5)], expr#7=[CAST($t6):BIGINT NOT NULL], proj#0..4=[{exprs}], side_id=[$t7])
          BeamIOSourceRel(table=[[beam, bid]])
        BeamIOSourceRel(table=[[beam, side]])

    Dec 15, 2018 12:21:00 AM org.apache.beam.sdk.io.FileBasedSource getEstimatedSizeBytes
    INFO: Filepattern <https://builds.apache.org/job/beam_PreCommit_Java_Cron/ws/src/sdks/java/testing/nexmark/null/JoinToFiles--1200953154*> matched 3 files with total size 40
    Dec 15, 2018 12:21:00 AM org.apache.beam.sdk.io.FileBasedSource split
    INFO: Splitting filepattern <https://builds.apache.org/job/beam_PreCommit_Java_Cron/ws/src/sdks/java/testing/nexmark/null/JoinToFiles--1200953154*> into bundles of size 2 took 1 ms and produced 3 files and 20 bundles

org.apache.beam.sdk.nexmark.queries.sql.SqlBoundedSideInputJoinTest > queryMatchesModelStreamingDirect STANDARD_ERROR
    Dec 15, 2018 12:21:10 AM org.apache.beam.sdk.extensions.sql.impl.BeamQueryPlanner convertToBeamRel
    INFO: SQL:
    WITH `bid_with_side` (`auction`, `bidder`, `price`, `dateTime`, `extra`, `side_id`) AS (SELECT `bid`.`auction`, `bid`.`bidder`, `bid`.`price`, `bid`.`dateTime`, `bid`.`extra`, CAST(MOD(`bid`.`bidder`, 10) AS BIGINT) AS `side_id`
    FROM `beam`.`bid` AS `bid`) (SELECT `bid_with_side`.`auction`, `bid_with_side`.`bidder`, `bid_with_side`.`price`, `bid_with_side`.`dateTime`, `side`.`extra`
    FROM `bid_with_side` AS `bid_with_side`,
    `beam`.`side` AS `side`
    WHERE `bid_with_side`.`side_id` = `side`.`id`)
    Dec 15, 2018 12:21:10 AM org.apache.beam.sdk.extensions.sql.impl.BeamQueryPlanner convertToBeamRel
    INFO: SQLPlan>
    LogicalProject(auction=[$0], bidder=[$1], price=[$2], dateTime=[$3], extra=[$7])
      LogicalFilter(condition=[=($5, $6)])
        LogicalJoin(condition=[true], joinType=[inner])
          LogicalProject(auction=[$0], bidder=[$1], price=[$2], dateTime=[$3], extra=[$4], side_id=[CAST(MOD($1, 10)):BIGINT NOT NULL])
            BeamIOSourceRel(table=[[beam, bid]])
          BeamIOSourceRel(table=[[beam, side]])

    Dec 15, 2018 12:21:10 AM org.apache.beam.sdk.extensions.sql.impl.BeamQueryPlanner convertToBeamRel
    INFO: BEAMPlan>
    BeamCalcRel(expr#0..7=[{inputs}], proj#0..3=[{exprs}], extra=[$t7])
      BeamJoinRel(condition=[=($5, $6)], joinType=[inner])
        BeamCalcRel(expr#0..4=[{inputs}], expr#5=[10], expr#6=[MOD($t1, $t5)], expr#7=[CAST($t6):BIGINT NOT NULL], proj#0..4=[{exprs}], side_id=[$t7])
          BeamIOSourceRel(table=[[beam, bid]])
        BeamIOSourceRel(table=[[beam, side]])


org.apache.beam.sdk.nexmark.queries.sql.SqlBoundedSideInputJoinTest > inputOutputSameEvents STANDARD_ERROR
    Dec 15, 2018 12:21:21 AM org.apache.beam.sdk.extensions.sql.impl.BeamQueryPlanner convertToBeamRel
    INFO: SQL:
    WITH `bid_with_side` (`auction`, `bidder`, `price`, `dateTime`, `extra`, `side_id`) AS (SELECT `bid`.`auction`, `bid`.`bidder`, `bid`.`price`, `bid`.`dateTime`, `bid`.`extra`, CAST(MOD(`bid`.`bidder`, 10) AS BIGINT) AS `side_id`
    FROM `beam`.`bid` AS `bid`) (SELECT `bid_with_side`.`auction`, `bid_with_side`.`bidder`, `bid_with_side`.`price`, `bid_with_side`.`dateTime`, `side`.`extra`
    FROM `bid_with_side` AS `bid_with_side`,
    `beam`.`side` AS `side`
    WHERE `bid_with_side`.`side_id` = `side`.`id`)
    Dec 15, 2018 12:21:21 AM org.apache.beam.sdk.extensions.sql.impl.BeamQueryPlanner convertToBeamRel
    INFO: SQLPlan>
    LogicalProject(auction=[$0], bidder=[$1], price=[$2], dateTime=[$3], extra=[$7])
      LogicalFilter(condition=[=($5, $6)])
        LogicalJoin(condition=[true], joinType=[inner])
          LogicalProject(auction=[$0], bidder=[$1], price=[$2], dateTime=[$3], extra=[$4], side_id=[CAST(MOD($1, 10)):BIGINT NOT NULL])
            BeamIOSourceRel(table=[[beam, bid]])
          BeamIOSourceRel(table=[[beam, side]])

    Dec 15, 2018 12:21:21 AM org.apache.beam.sdk.extensions.sql.impl.BeamQueryPlanner convertToBeamRel
    INFO: BEAMPlan>
    BeamCalcRel(expr#0..7=[{inputs}], proj#0..3=[{exprs}], extra=[$t7])
      BeamJoinRel(condition=[=($5, $6)], joinType=[inner])
        BeamCalcRel(expr#0..4=[{inputs}], expr#5=[10], expr#6=[MOD($t1, $t5)], expr#7=[CAST($t6):BIGINT NOT NULL], proj#0..4=[{exprs}], side_id=[$t7])
          BeamIOSourceRel(table=[[beam, bid]])
        BeamIOSourceRel(table=[[beam, side]])


org.apache.beam.sdk.nexmark.queries.sql.SqlQuery1Test > testConvertsPriceToEur STANDARD_ERROR
    Dec 15, 2018 12:21:23 AM org.apache.beam.sdk.extensions.sql.impl.BeamQueryPlanner convertToBeamRel
    INFO: SQL:
    SELECT `PCOLLECTION`.`auction`, `PCOLLECTION`.`bidder`, `DolToEur`(`PCOLLECTION`.`price`) AS `price`, `PCOLLECTION`.`dateTime`, `PCOLLECTION`.`extra`
    FROM `beam`.`PCOLLECTION` AS `PCOLLECTION`
    Dec 15, 2018 12:21:23 AM org.apache.beam.sdk.extensions.sql.impl.BeamQueryPlanner convertToBeamRel
    INFO: SQLPlan>
    LogicalProject(auction=[$0], bidder=[$1], price=[DolToEur($2)], dateTime=[$3], extra=[$4])
      BeamIOSourceRel(table=[[beam, PCOLLECTION]])

    Dec 15, 2018 12:21:23 AM org.apache.beam.sdk.extensions.sql.impl.BeamQueryPlanner convertToBeamRel
    INFO: BEAMPlan>
    BeamCalcRel(expr#0..4=[{inputs}], expr#5=[DolToEur($t2)], proj#0..1=[{exprs}], price=[$t5], dateTime=[$t3], extra=[$t4])
      BeamIOSourceRel(table=[[beam, PCOLLECTION]])


Gradle Test Executor 124 finished executing tests.

> Task :beam-sdks-java-nexmark:test
Finished generating test XML results (0.002 secs) into: <https://builds.apache.org/job/beam_PreCommit_Java_Cron/ws/src/sdks/java/testing/nexmark/build/test-results/test>
Generating HTML test report...
Finished generating test html results (0.003 secs) into: <https://builds.apache.org/job/beam_PreCommit_Java_Cron/ws/src/sdks/java/testing/nexmark/build/reports/tests/test>
Packing task ':beam-sdks-java-nexmark:test'
:beam-sdks-java-nexmark:test (Thread[Task worker for ':' Thread 11,5,main]) completed. Took 4 mins 21.767 secs.
:beam-sdks-java-nexmark:shadowJar (Thread[Task worker for ':' Thread 11,5,main]) started.

> Task :beam-sdks-java-nexmark:shadowJar
Build cache key for task ':beam-sdks-java-nexmark:shadowJar' is e47dd4993b43d7ec92ed628703f3970f
Caching disabled for task ':beam-sdks-java-nexmark:shadowJar': Caching has not been enabled for the task
Task ':beam-sdks-java-nexmark:shadowJar' is not up-to-date because:
  No history is available.
*******************
GRADLE SHADOW STATS

Total Jars: 2 (includes project)
Total Time: 2.097s [2097ms]
Average Time/Jar: 1.0485s [1048.5ms]
*******************
:beam-sdks-java-nexmark:shadowJar (Thread[Task worker for ':' Thread 11,5,main]) completed. Took 2.413 secs.
:beam-sdks-java-nexmark:validateShadedJarDoesntLeakNonProjectClasses (Thread[Task worker for ':' Thread 11,5,main]) started.

> Task :beam-sdks-java-nexmark:validateShadedJarDoesntLeakNonProjectClasses
Build cache key for task ':beam-sdks-java-nexmark:validateShadedJarDoesntLeakNonProjectClasses' is 14d4dfefe2d57ab61a5f226e850680cc
Caching disabled for task ':beam-sdks-java-nexmark:validateShadedJarDoesntLeakNonProjectClasses': Caching has not been enabled for the task
Task ':beam-sdks-java-nexmark:validateShadedJarDoesntLeakNonProjectClasses' is not up-to-date because:
  No history is available.
:beam-sdks-java-nexmark:validateShadedJarDoesntLeakNonProjectClasses (Thread[Task worker for ':' Thread 11,5,main]) completed. Took 0.066 secs.
:beam-sdks-java-nexmark:check (Thread[Task worker for ':' Thread 11,5,main]) started.

> Task :beam-sdks-java-nexmark:check
Skipping task ':beam-sdks-java-nexmark:check' as it has no actions.
:beam-sdks-java-nexmark:check (Thread[Task worker for ':' Thread 11,5,main]) completed. Took 0.0 secs.
:beam-sdks-java-nexmark:build (Thread[Task worker for ':' Thread 11,5,main]) started.

> Task :beam-sdks-java-nexmark:build
Skipping task ':beam-sdks-java-nexmark:build' as it has no actions.
:beam-sdks-java-nexmark:build (Thread[Task worker for ':' Thread 11,5,main]) completed. Took 0.0 secs.
:beam-sdks-java-nexmark:buildDependents (Thread[Task worker for ':' Thread 11,5,main]) started.

> Task :beam-sdks-java-nexmark:buildDependents
Caching disabled for task ':beam-sdks-java-nexmark:buildDependents': Caching has not been enabled for the task
Task ':beam-sdks-java-nexmark:buildDependents' is not up-to-date because:
  Task has not declared any outputs despite executing actions.
:beam-sdks-java-nexmark:buildDependents (Thread[Task worker for ':' Thread 11,5,main]) completed. Took 0.0 secs.
:beam-sdks-java-extensions-sql:buildDependents (Thread[Task worker for ':' Thread 11,5,main]) started.
:beam-sdks-java-io-google-cloud-platform:buildDependents (Thread[Task worker for ':' Thread 4,5,main]) started.
:beam-sdks-java-io-kafka:buildDependents (Thread[Daemon worker,5,main]) started.

> Task :beam-sdks-java-extensions-sql:buildDependents
Caching disabled for task ':beam-sdks-java-extensions-sql:buildDependents': Caching has not been enabled for the task
Task ':beam-sdks-java-extensions-sql:buildDependents' is not up-to-date because:
  Task has not declared any outputs despite executing actions.
:beam-sdks-java-extensions-sql:buildDependents (Thread[Task worker for ':' Thread 11,5,main]) completed. Took 0.0 secs.
:beam-sdks-java-test-utils:buildDependents (Thread[Task worker for ':' Thread 8,5,main]) started.
:beam-sdks-java-extensions-join-library:buildDependents (Thread[Task worker for ':' Thread 11,5,main]) started.

> Task :beam-sdks-java-io-kafka:buildDependents
Caching disabled for task ':beam-sdks-java-io-kafka:buildDependents': Caching has not been enabled for the task
Task ':beam-sdks-java-io-kafka:buildDependents' is not up-to-date because:
  Task has not declared any outputs despite executing actions.
:beam-sdks-java-io-kafka:buildDependents (Thread[Daemon worker,5,main]) completed. Took 0.0 secs.

> Task :beam-sdks-java-extensions-join-library:buildDependents
Caching disabled for task ':beam-sdks-java-extensions-join-library:buildDependents': Caching has not been enabled for the task
Task ':beam-sdks-java-extensions-join-library:buildDependents' is not up-to-date because:
  Task has not declared any outputs despite executing actions.

> Task :beam-sdks-java-io-google-cloud-platform:buildDependents
Caching disabled for task ':beam-sdks-java-io-google-cloud-platform:buildDependents': Caching has not been enabled for the task
Task ':beam-sdks-java-io-google-cloud-platform:buildDependents' is not up-to-date because:
  Task has not declared any outputs despite executing actions.
:beam-sdks-java-extensions-join-library:buildDependents (Thread[Task worker for ':' Thread 11,5,main]) completed. Took 0.0 secs.

> Task :beam-sdks-java-test-utils:buildDependents
Caching disabled for task ':beam-sdks-java-test-utils:buildDependents': Caching has not been enabled for the task
Task ':beam-sdks-java-test-utils:buildDependents' is not up-to-date because:
  Task has not declared any outputs despite executing actions.
:beam-sdks-java-io-google-cloud-platform:buildDependents (Thread[Task worker for ':' Thread 4,5,main]) completed. Took 0.0 secs.
:beam-sdks-java-test-utils:buildDependents (Thread[Task worker for ':' Thread 8,5,main]) completed. Took 0.0 secs.
:beam-sdks-java-extensions-protobuf:buildDependents (Thread[Task worker for ':' Thread 4,5,main]) started.

> Task :beam-sdks-java-extensions-protobuf:buildDependents
Caching disabled for task ':beam-sdks-java-extensions-protobuf:buildDependents': Caching has not been enabled for the task
Task ':beam-sdks-java-extensions-protobuf:buildDependents' is not up-to-date because:
  Task has not declared any outputs despite executing actions.
:beam-sdks-java-extensions-protobuf:buildDependents (Thread[Task worker for ':' Thread 4,5,main]) completed. Took 0.0 secs.
:beam-runners-direct-java:buildDependents (Thread[Task worker for ':' Thread 8,5,main]) started.

> Task :beam-runners-direct-java:buildDependents
Caching disabled for task ':beam-runners-direct-java:buildDependents': Caching has not been enabled for the task
Task ':beam-runners-direct-java:buildDependents' is not up-to-date because:
  Task has not declared any outputs despite executing actions.
:beam-runners-direct-java:buildDependents (Thread[Task worker for ':' Thread 8,5,main]) completed. Took 0.0 secs.
:beam-runners-local-java-core:buildDependents (Thread[Task worker for ':' Thread 8,5,main]) started.

> Task :beam-runners-local-java-core:buildDependents
Caching disabled for task ':beam-runners-local-java-core:buildDependents': Caching has not been enabled for the task
Task ':beam-runners-local-java-core:buildDependents' is not up-to-date because:
  Task has not declared any outputs despite executing actions.
:beam-runners-local-java-core:buildDependents (Thread[Task worker for ':' Thread 8,5,main]) completed. Took 0.0 secs.

FAILURE: Build failed with an exception.

* What went wrong:
Execution failed for task ':beam-runners-java-fn-execution:test'.
> There were failing tests. See the report at: file://<https://builds.apache.org/job/beam_PreCommit_Java_Cron/ws/src/runners/java-fn-execution/build/reports/tests/test/index.html>

* Try:
Run with --stacktrace option to get the stack trace. Run with --debug option to get more log output. Run with --scan to get full insights.

* Get more help at https://help.gradle.org

Deprecated Gradle features were used in this build, making it incompatible with Gradle 5.0.
Use '--warning-mode all' to show the individual deprecation warnings.
See https://docs.gradle.org/4.10.2/userguide/command_line_interface.html#sec:command_line_warnings

BUILD FAILED in 18m 9s
872 actionable tasks: 867 executed, 5 from cache

Publishing build scan...
https://gradle.com/s/kevr32cvq4wdc

Closing Git repo: <https://builds.apache.org/job/beam_PreCommit_Java_Cron/ws/src/.git>
Build step 'Invoke Gradle script' changed build result to FAILURE
Build step 'Invoke Gradle script' marked build as failure

---------------------------------------------------------------------
To unsubscribe, e-mail: builds-unsubscribe@beam.apache.org
For additional commands, e-mail: builds-help@beam.apache.org


Jenkins build is back to normal : beam_PreCommit_Java_Cron #709

Posted by Apache Jenkins Server <je...@builds.apache.org>.
See <https://builds.apache.org/job/beam_PreCommit_Java_Cron/709/display/redirect>


---------------------------------------------------------------------
To unsubscribe, e-mail: builds-unsubscribe@beam.apache.org
For additional commands, e-mail: builds-help@beam.apache.org