You are viewing a plain text version of this content. The canonical link for it is here.
Posted to builds@solr.apache.org by Apache Jenkins Server <je...@builds.apache.org> on 2025/11/03 08:01:03 UTC
[JENKINS] Solr » Solr-Test-10.x - Build # 176 - Still Failing!
Build: https://ci-builds.apache.org/job/Solr/job/Solr-Test-10.x/176/
No tests ran.
Build Log:
[...truncated 54 lines...]
BUILD FAILED in 21s
4 actionable tasks: 4 executed
Publishing build scan...
https://develocity.apache.org/s/hayxflgcuf2ls
Build step 'Invoke Gradle script' changed build result to FAILURE
Build step 'Invoke Gradle script' marked build as failure
Archiving artifacts
Recording test results
ERROR: Step ‘Publish JUnit test result report’ failed: No test report files were found. Configuration error?
Email was triggered for: Failure - Any
Sending email for trigger: Failure - Any
[JENKINS] Solr » Solr-Test-10.x - Build # 179 - Still Failing!
Posted by Apache Jenkins Server <je...@builds.apache.org>.
Build: https://ci-builds.apache.org/job/Solr/job/Solr-Test-10.x/179/
No tests ran.
Build Log:
[...truncated 54 lines...]
BUILD FAILED in 18s
4 actionable tasks: 4 executed
Publishing build scan...
https://develocity.apache.org/s/czu32egkk2bxg
Build step 'Invoke Gradle script' changed build result to FAILURE
Build step 'Invoke Gradle script' marked build as failure
Archiving artifacts
Recording test results
ERROR: Step ‘Publish JUnit test result report’ failed: No test report files were found. Configuration error?
Email was triggered for: Failure - Any
Sending email for trigger: Failure - Any
[JENKINS] Solr » Solr-Test-10.x - Build # 178 - Still Failing!
Posted by Apache Jenkins Server <je...@builds.apache.org>.
Build: https://ci-builds.apache.org/job/Solr/job/Solr-Test-10.x/178/
No tests ran.
Build Log:
[...truncated 55 lines...]
BUILD FAILED in 21s
4 actionable tasks: 4 executed
Publishing build scan...
https://develocity.apache.org/s/fxw34fjspkc6a
Build step 'Invoke Gradle script' changed build result to FAILURE
Build step 'Invoke Gradle script' marked build as failure
Archiving artifacts
Recording test results
ERROR: Step ‘Publish JUnit test result report’ failed: No test report files were found. Configuration error?
Email was triggered for: Failure - Any
Sending email for trigger: Failure - Any
[JENKINS] Solr » Solr-Test-10.x - Build # 177 - Still Failing!
Posted by Apache Jenkins Server <je...@builds.apache.org>.
Build: https://ci-builds.apache.org/job/Solr/job/Solr-Test-10.x/177/
No tests ran.
Build Log:
[...truncated 55 lines...]
BUILD FAILED in 21s
4 actionable tasks: 4 executed
Publishing build scan...
https://develocity.apache.org/s/fexwdfykhueqi
Build step 'Invoke Gradle script' changed build result to FAILURE
Build step 'Invoke Gradle script' marked build as failure
Archiving artifacts
Recording test results
ERROR: Step ‘Publish JUnit test result report’ failed: No test report files were found. Configuration error?
Email was triggered for: Failure - Any
Sending email for trigger: Failure - Any