You are viewing a plain text version of this content. The canonical link for it is here.
Posted to notifications@jclouds.apache.org by BuildHive <bu...@cloudbees.com> on 2014/05/19 09:53:42 UTC
Build failed in Jenkins: jclouds » jclouds-labs #1056
See <https://buildhive.cloudbees.com/job/jclouds/job/jclouds-labs/1056/changes>
Changes:
[Ignasi Barrera] Added unit tests for compute functions
[Ignasi Barrera] Addressed comments and be more explicit in assertions
------------------------------------------
GitHub pull request #62 to jclouds/jclouds-labs
Building remotely on s-e52bec33 in workspace <https://buildhive.cloudbees.com/job/jclouds/job/jclouds-labs/ws/>
Fetching changes from the remote Git repository
Fetching upstream changes from git://github.com/jclouds/jclouds-labs.git
Opening connection
Done: 0
Counting objects
Done: 121
Finding sources
Done: 121
Getting sizes
Done: 100
Compressing objects
Done: 0
Writing objects
Done: 121
remote: Resolving deltas
remote: Updating references
Merging refs/tags/changes/1056
Checking out Revision f61fa24a78f0faf692f33658e29804cc8dd64913 (master)
Cleaning workspace
Resetting working tree
Parsing POMs
Failed to transfer Could not find metadata org.apache.jclouds:jclouds-project:1.8.0-SNAPSHOT/maven-metadata.xml in sonatype-nexus-snapshots (https://oss.sonatype.org/content/repositories/snapshots)
Downloaded artifact https://repository.apache.org/content/repositories/snapshots//org/apache/jclouds/jclouds-project/1.8.0-SNAPSHOT/maven-metadata.xml
Downloaded artifact https://repository.apache.org/content/repositories/snapshots//org/apache/jclouds/jclouds-project/1.8.0-SNAPSHOT/jclouds-project-1.8.0-20140518.220804-173.pom
Downloaded artifact http://repository.apache.org/snapshots//org/apache/jclouds/jclouds-project/1.8.0-SNAPSHOT/maven-metadata.xml
Modules changed, recalculating dependency graph
[jclouds-labs] $ /usr/bin/tenant-isolate /opt/jdk/jdk1.7.latest/bin/java -XX:MaxPermSize=256m -cp /scratch/jenkins/maven3-agent.jar:/opt/maven/latest/boot/plexus-classworlds-2.5.1.jar org.jvnet.hudson.maven3.agent.Maven3Main /opt/maven/latest /scratch/jenkins/slave.jar /scratch/jenkins/maven3-interceptor.jar 43208
<===[JENKINS REMOTING CAPACITY]===> channel started
log4j:WARN No appenders could be found for logger (org.apache.commons.beanutils.converters.BooleanConverter).
log4j:WARN Please initialize the log4j system properly.
Executing Maven: -B -f <https://buildhive.cloudbees.com/job/jclouds/job/jclouds-labs/ws/pom.xml> clean verify -U -e -Dmaven.javadoc.skip=true
java.lang.reflect.InvocationTargetException
at sun.reflect.NativeMethodAccessorImpl.invoke0(Native Method)
at sun.reflect.NativeMethodAccessorImpl.invoke(NativeMethodAccessorImpl.java:57)
at sun.reflect.DelegatingMethodAccessorImpl.invoke(DelegatingMethodAccessorImpl.java:43)
at java.lang.reflect.Method.invoke(Method.java:606)
at org.codehaus.plexus.classworlds.launcher.Launcher.launchStandard(Launcher.java:330)
at org.codehaus.plexus.classworlds.launcher.Launcher.launch(Launcher.java:238)
at org.jvnet.hudson.maven3.agent.Maven3Main.launch(Maven3Main.java:158)
at hudson.maven.Maven3Builder.call(Maven3Builder.java:104)
at hudson.maven.Maven3Builder.call(Maven3Builder.java:70)
at hudson.remoting.UserRequest.perform(UserRequest.java:118)
at hudson.remoting.UserRequest.perform(UserRequest.java:48)
at hudson.remoting.Request$2.run(Request.java:328)
at hudson.remoting.InterceptingExecutorService$1.call(InterceptingExecutorService.java:72)
at java.util.concurrent.FutureTask.run(FutureTask.java:262)
at java.util.concurrent.ThreadPoolExecutor.runWorker(ThreadPoolExecutor.java:1145)
at java.util.concurrent.ThreadPoolExecutor$Worker.run(ThreadPoolExecutor.java:615)
at java.lang.Thread.run(Thread.java:744)
Caused by: java.lang.NoClassDefFoundError: org/apache/maven/cli/MavenLoggerManager
at org.jvnet.hudson.maven3.launcher.Maven3Launcher.main(Maven3Launcher.java:73)
... 17 more
Caused by: java.lang.ClassNotFoundException: org.apache.maven.cli.MavenLoggerManager
at org.codehaus.plexus.classworlds.strategy.SelfFirstStrategy.loadClass(SelfFirstStrategy.java:50)
at org.codehaus.plexus.classworlds.realm.ClassRealm.unsynchronizedLoadClass(ClassRealm.java:259)
at org.codehaus.plexus.classworlds.realm.ClassRealm.loadClass(ClassRealm.java:235)
at org.codehaus.plexus.classworlds.realm.ClassRealm.loadClass(ClassRealm.java:227)
... 18 more
channel stopped
ERROR: Failed to parse POMs
hudson.util.IOException2: java.lang.reflect.InvocationTargetException
at hudson.maven.Maven3Builder.call(Maven3Builder.java:158)
at hudson.maven.Maven3Builder.call(Maven3Builder.java:70)
at hudson.remoting.UserRequest.perform(UserRequest.java:118)
at hudson.remoting.UserRequest.perform(UserRequest.java:48)
at hudson.remoting.Request$2.run(Request.java:328)
at hudson.remoting.InterceptingExecutorService$1.call(InterceptingExecutorService.java:72)
at java.util.concurrent.FutureTask.run(FutureTask.java:262)
at java.util.concurrent.ThreadPoolExecutor.runWorker(ThreadPoolExecutor.java:1145)
at java.util.concurrent.ThreadPoolExecutor$Worker.run(ThreadPoolExecutor.java:615)
at java.lang.Thread.run(Thread.java:744)
Caused by: java.lang.Exception: java.lang.reflect.InvocationTargetException
at org.jvnet.hudson.maven3.agent.Maven3Main.launch(Maven3Main.java:161)
at hudson.maven.Maven3Builder.call(Maven3Builder.java:104)
... 9 more
Caused by: java.lang.reflect.InvocationTargetException
at sun.reflect.NativeMethodAccessorImpl.invoke0(Native Method)
at sun.reflect.NativeMethodAccessorImpl.invoke(NativeMethodAccessorImpl.java:57)
at sun.reflect.DelegatingMethodAccessorImpl.invoke(DelegatingMethodAccessorImpl.java:43)
at java.lang.reflect.Method.invoke(Method.java:606)
at org.codehaus.plexus.classworlds.launcher.Launcher.launchStandard(Launcher.java:330)
at org.codehaus.plexus.classworlds.launcher.Launcher.launch(Launcher.java:238)
at org.jvnet.hudson.maven3.agent.Maven3Main.launch(Maven3Main.java:158)
... 10 more
Caused by: java.lang.NoClassDefFoundError: org/apache/maven/cli/MavenLoggerManager
at org.jvnet.hudson.maven3.launcher.Maven3Launcher.main(Maven3Launcher.java:73)
... 17 more
Caused by: java.lang.ClassNotFoundException: org.apache.maven.cli.MavenLoggerManager
at org.codehaus.plexus.classworlds.strategy.SelfFirstStrategy.loadClass(SelfFirstStrategy.java:50)
at org.codehaus.plexus.classworlds.realm.ClassRealm.unsynchronizedLoadClass(ClassRealm.java:259)
at org.codehaus.plexus.classworlds.realm.ClassRealm.loadClass(ClassRealm.java:235)
at org.codehaus.plexus.classworlds.realm.ClassRealm.loadClass(ClassRealm.java:227)
... 18 more
Jenkins build is back to normal : jclouds » jclouds-labs #1060
Posted by BuildHive <bu...@cloudbees.com>.
See <https://buildhive.cloudbees.com/job/jclouds/job/jclouds-labs/1060/changes>
Build failed in Jenkins: jclouds » jclouds-labs #1059
Posted by BuildHive <bu...@cloudbees.com>.
See <https://buildhive.cloudbees.com/job/jclouds/job/jclouds-labs/1059/changes>
Changes:
[Ignasi Barrera] JCLOUDS-543/JCLOUDS-572: Use slugs as IDs and assume a node can have a null image if it used an imageId that has been removed
------------------------------------------
GitHub pull request #63 to jclouds/jclouds-labs
Building remotely on s-e52bec33 in workspace <https://buildhive.cloudbees.com/job/jclouds/job/jclouds-labs/ws/>
Fetching changes from the remote Git repository
Fetching upstream changes from git://github.com/jclouds/jclouds-labs.git
Opening connection
Done: 0
Counting objects
Done: 44
Finding sources
Done: 44
Getting sizes
Done: 35
Compressing objects
Done: 0
Writing objects
Done: 44
remote: Resolving deltas
remote: Updating references
Merging refs/tags/changes/1059
Checking out Revision b0bc5aeb813bef11473dc0ded96a2191c2a5bd6d (master)
Cleaning workspace
Resetting working tree
Parsing POMs
Modules changed, recalculating dependency graph
[jclouds-labs] $ /usr/bin/tenant-isolate /opt/jdk/jdk1.7.latest/bin/java -XX:MaxPermSize=256m -cp /scratch/jenkins/maven3-agent.jar:/opt/maven/latest/boot/plexus-classworlds-2.5.1.jar org.jvnet.hudson.maven3.agent.Maven3Main /opt/maven/latest /scratch/jenkins/slave.jar /scratch/jenkins/maven3-interceptor.jar 41954
<===[JENKINS REMOTING CAPACITY]===> channel started
log4j:WARN No appenders could be found for logger (org.apache.commons.beanutils.converters.BooleanConverter).
log4j:WARN Please initialize the log4j system properly.
Executing Maven: -B -f <https://buildhive.cloudbees.com/job/jclouds/job/jclouds-labs/ws/pom.xml> clean verify -U -e -Dmaven.javadoc.skip=true
java.lang.reflect.InvocationTargetException
at sun.reflect.NativeMethodAccessorImpl.invoke0(Native Method)
at sun.reflect.NativeMethodAccessorImpl.invoke(NativeMethodAccessorImpl.java:57)
at sun.reflect.DelegatingMethodAccessorImpl.invoke(DelegatingMethodAccessorImpl.java:43)
at java.lang.reflect.Method.invoke(Method.java:606)
at org.codehaus.plexus.classworlds.launcher.Launcher.launchStandard(Launcher.java:330)
at org.codehaus.plexus.classworlds.launcher.Launcher.launch(Launcher.java:238)
at org.jvnet.hudson.maven3.agent.Maven3Main.launch(Maven3Main.java:158)
at hudson.maven.Maven3Builder.call(Maven3Builder.java:104)
at hudson.maven.Maven3Builder.call(Maven3Builder.java:70)
at hudson.remoting.UserRequest.perform(UserRequest.java:118)
at hudson.remoting.UserRequest.perform(UserRequest.java:48)
at hudson.remoting.Request$2.run(Request.java:328)
at hudson.remoting.InterceptingExecutorService$1.call(InterceptingExecutorService.java:72)
at java.util.concurrent.FutureTask.run(FutureTask.java:262)
at java.util.concurrent.ThreadPoolExecutor.runWorker(ThreadPoolExecutor.java:1145)
at java.util.concurrent.ThreadPoolExecutor$Worker.run(ThreadPoolExecutor.java:615)
at java.lang.Thread.run(Thread.java:744)
Caused by: java.lang.NoClassDefFoundError: org/apache/maven/cli/MavenLoggerManager
at org.jvnet.hudson.maven3.launcher.Maven3Launcher.main(Maven3Launcher.java:73)
... 17 more
Caused by: java.lang.ClassNotFoundException: org.apache.maven.cli.MavenLoggerManager
at org.codehaus.plexus.classworlds.strategy.SelfFirstStrategy.loadClass(SelfFirstStrategy.java:50)
at org.codehaus.plexus.classworlds.realm.ClassRealm.unsynchronizedLoadClass(ClassRealm.java:259)
at org.codehaus.plexus.classworlds.realm.ClassRealm.loadClass(ClassRealm.java:235)
at org.codehaus.plexus.classworlds.realm.ClassRealm.loadClass(ClassRealm.java:227)
... 18 more
channel stopped
ERROR: Failed to parse POMs
hudson.util.IOException2: java.lang.reflect.InvocationTargetException
at hudson.maven.Maven3Builder.call(Maven3Builder.java:158)
at hudson.maven.Maven3Builder.call(Maven3Builder.java:70)
at hudson.remoting.UserRequest.perform(UserRequest.java:118)
at hudson.remoting.UserRequest.perform(UserRequest.java:48)
at hudson.remoting.Request$2.run(Request.java:328)
at hudson.remoting.InterceptingExecutorService$1.call(InterceptingExecutorService.java:72)
at java.util.concurrent.FutureTask.run(FutureTask.java:262)
at java.util.concurrent.ThreadPoolExecutor.runWorker(ThreadPoolExecutor.java:1145)
at java.util.concurrent.ThreadPoolExecutor$Worker.run(ThreadPoolExecutor.java:615)
at java.lang.Thread.run(Thread.java:744)
Caused by: java.lang.Exception: java.lang.reflect.InvocationTargetException
at org.jvnet.hudson.maven3.agent.Maven3Main.launch(Maven3Main.java:161)
at hudson.maven.Maven3Builder.call(Maven3Builder.java:104)
... 9 more
Caused by: java.lang.reflect.InvocationTargetException
at sun.reflect.NativeMethodAccessorImpl.invoke0(Native Method)
at sun.reflect.NativeMethodAccessorImpl.invoke(NativeMethodAccessorImpl.java:57)
at sun.reflect.DelegatingMethodAccessorImpl.invoke(DelegatingMethodAccessorImpl.java:43)
at java.lang.reflect.Method.invoke(Method.java:606)
at org.codehaus.plexus.classworlds.launcher.Launcher.launchStandard(Launcher.java:330)
at org.codehaus.plexus.classworlds.launcher.Launcher.launch(Launcher.java:238)
at org.jvnet.hudson.maven3.agent.Maven3Main.launch(Maven3Main.java:158)
... 10 more
Caused by: java.lang.NoClassDefFoundError: org/apache/maven/cli/MavenLoggerManager
at org.jvnet.hudson.maven3.launcher.Maven3Launcher.main(Maven3Launcher.java:73)
... 17 more
Caused by: java.lang.ClassNotFoundException: org.apache.maven.cli.MavenLoggerManager
at org.codehaus.plexus.classworlds.strategy.SelfFirstStrategy.loadClass(SelfFirstStrategy.java:50)
at org.codehaus.plexus.classworlds.realm.ClassRealm.unsynchronizedLoadClass(ClassRealm.java:259)
at org.codehaus.plexus.classworlds.realm.ClassRealm.loadClass(ClassRealm.java:235)
at org.codehaus.plexus.classworlds.realm.ClassRealm.loadClass(ClassRealm.java:227)
... 18 more
Build failed in Jenkins: jclouds » jclouds-labs #1058
Posted by BuildHive <bu...@cloudbees.com>.
See <https://buildhive.cloudbees.com/job/jclouds/job/jclouds-labs/1058/changes>
Changes:
[Ignasi Barrera] Added unit tests for compute functions
------------------------------------------
Started by GitHub push by jclouds-mirror
Started by GitHub push by jclouds-mirror
Building remotely on s-e52bec33 in workspace <https://buildhive.cloudbees.com/job/jclouds/job/jclouds-labs/ws/>
Fetching changes from the remote Git repository
Fetching upstream changes from git://github.com/jclouds/jclouds-labs.git
Checking out Revision c6ec944901d449ff7ca626d721902577f5756fb1 (origin/master)
Cleaning workspace
Resetting working tree
Parsing POMs
Modules changed, recalculating dependency graph
[jclouds-labs] $ /usr/bin/tenant-isolate /opt/jdk/jdk1.7.latest/bin/java -XX:MaxPermSize=256m -cp /scratch/jenkins/maven3-agent.jar:/opt/maven/latest/boot/plexus-classworlds-2.5.1.jar org.jvnet.hudson.maven3.agent.Maven3Main /opt/maven/latest /scratch/jenkins/slave.jar /scratch/jenkins/maven3-interceptor.jar 54818
<===[JENKINS REMOTING CAPACITY]===> channel started
log4j:WARN No appenders could be found for logger (org.apache.commons.beanutils.converters.BooleanConverter).
log4j:WARN Please initialize the log4j system properly.
Executing Maven: -B -f <https://buildhive.cloudbees.com/job/jclouds/job/jclouds-labs/ws/pom.xml> clean verify -U -e -Dmaven.javadoc.skip=true
java.lang.reflect.InvocationTargetException
at sun.reflect.NativeMethodAccessorImpl.invoke0(Native Method)
at sun.reflect.NativeMethodAccessorImpl.invoke(NativeMethodAccessorImpl.java:57)
at sun.reflect.DelegatingMethodAccessorImpl.invoke(DelegatingMethodAccessorImpl.java:43)
at java.lang.reflect.Method.invoke(Method.java:606)
at org.codehaus.plexus.classworlds.launcher.Launcher.launchStandard(Launcher.java:330)
at org.codehaus.plexus.classworlds.launcher.Launcher.launch(Launcher.java:238)
at org.jvnet.hudson.maven3.agent.Maven3Main.launch(Maven3Main.java:158)
at hudson.maven.Maven3Builder.call(Maven3Builder.java:104)
at hudson.maven.Maven3Builder.call(Maven3Builder.java:70)
at hudson.remoting.UserRequest.perform(UserRequest.java:118)
at hudson.remoting.UserRequest.perform(UserRequest.java:48)
at hudson.remoting.Request$2.run(Request.java:328)
at hudson.remoting.InterceptingExecutorService$1.call(InterceptingExecutorService.java:72)
at java.util.concurrent.FutureTask.run(FutureTask.java:262)
at java.util.concurrent.ThreadPoolExecutor.runWorker(ThreadPoolExecutor.java:1145)
at java.util.concurrent.ThreadPoolExecutor$Worker.run(ThreadPoolExecutor.java:615)
at java.lang.Thread.run(Thread.java:744)
Caused by: java.lang.NoClassDefFoundError: org/apache/maven/cli/MavenLoggerManager
at org.jvnet.hudson.maven3.launcher.Maven3Launcher.main(Maven3Launcher.java:73)
... 17 more
Caused by: java.lang.ClassNotFoundException: org.apache.maven.cli.MavenLoggerManager
at org.codehaus.plexus.classworlds.strategy.SelfFirstStrategy.loadClass(SelfFirstStrategy.java:50)
at org.codehaus.plexus.classworlds.realm.ClassRealm.unsynchronizedLoadClass(ClassRealm.java:259)
at org.codehaus.plexus.classworlds.realm.ClassRealm.loadClass(ClassRealm.java:235)
at org.codehaus.plexus.classworlds.realm.ClassRealm.loadClass(ClassRealm.java:227)
... 18 more
channel stopped
ERROR: Failed to parse POMs
hudson.util.IOException2: java.lang.reflect.InvocationTargetException
at hudson.maven.Maven3Builder.call(Maven3Builder.java:158)
at hudson.maven.Maven3Builder.call(Maven3Builder.java:70)
at hudson.remoting.UserRequest.perform(UserRequest.java:118)
at hudson.remoting.UserRequest.perform(UserRequest.java:48)
at hudson.remoting.Request$2.run(Request.java:328)
at hudson.remoting.InterceptingExecutorService$1.call(InterceptingExecutorService.java:72)
at java.util.concurrent.FutureTask.run(FutureTask.java:262)
at java.util.concurrent.ThreadPoolExecutor.runWorker(ThreadPoolExecutor.java:1145)
at java.util.concurrent.ThreadPoolExecutor$Worker.run(ThreadPoolExecutor.java:615)
at java.lang.Thread.run(Thread.java:744)
Caused by: java.lang.Exception: java.lang.reflect.InvocationTargetException
at org.jvnet.hudson.maven3.agent.Maven3Main.launch(Maven3Main.java:161)
at hudson.maven.Maven3Builder.call(Maven3Builder.java:104)
... 9 more
Caused by: java.lang.reflect.InvocationTargetException
at sun.reflect.NativeMethodAccessorImpl.invoke0(Native Method)
at sun.reflect.NativeMethodAccessorImpl.invoke(NativeMethodAccessorImpl.java:57)
at sun.reflect.DelegatingMethodAccessorImpl.invoke(DelegatingMethodAccessorImpl.java:43)
at java.lang.reflect.Method.invoke(Method.java:606)
at org.codehaus.plexus.classworlds.launcher.Launcher.launchStandard(Launcher.java:330)
at org.codehaus.plexus.classworlds.launcher.Launcher.launch(Launcher.java:238)
at org.jvnet.hudson.maven3.agent.Maven3Main.launch(Maven3Main.java:158)
... 10 more
Caused by: java.lang.NoClassDefFoundError: org/apache/maven/cli/MavenLoggerManager
at org.jvnet.hudson.maven3.launcher.Maven3Launcher.main(Maven3Launcher.java:73)
... 17 more
Caused by: java.lang.ClassNotFoundException: org.apache.maven.cli.MavenLoggerManager
at org.codehaus.plexus.classworlds.strategy.SelfFirstStrategy.loadClass(SelfFirstStrategy.java:50)
at org.codehaus.plexus.classworlds.realm.ClassRealm.unsynchronizedLoadClass(ClassRealm.java:259)
at org.codehaus.plexus.classworlds.realm.ClassRealm.loadClass(ClassRealm.java:235)
at org.codehaus.plexus.classworlds.realm.ClassRealm.loadClass(ClassRealm.java:227)
... 18 more
Build failed in Jenkins: jclouds » jclouds-labs #1057
Posted by BuildHive <bu...@cloudbees.com>.
See <https://buildhive.cloudbees.com/job/jclouds/job/jclouds-labs/1057/changes>
Changes:
[Ignasi Barrera] Added unit tests for compute functions
[Ignasi Barrera] Addressed comments and be more explicit in assertions
[Ignasi Barrera] Removed redundant assertions
------------------------------------------
GitHub pull request #62 to jclouds/jclouds-labs
Building remotely on s-e52bec33 in workspace <https://buildhive.cloudbees.com/job/jclouds/job/jclouds-labs/ws/>
Fetching changes from the remote Git repository
Fetching upstream changes from git://github.com/jclouds/jclouds-labs.git
Opening connection
Done: 0
Counting objects
Done: 12
Finding sources
Done: 12
Getting sizes
Done: 11
Compressing objects
Done: 0
Writing objects
Done: 12
remote: Updating references
Merging refs/tags/changes/1057
Checking out Revision ef773cacb3d3c98cc0f66027ff6b54a332535137 (master)
Cleaning workspace
Resetting working tree
Parsing POMs
Modules changed, recalculating dependency graph
[jclouds-labs] $ /usr/bin/tenant-isolate /opt/jdk/jdk1.7.latest/bin/java -XX:MaxPermSize=256m -cp /scratch/jenkins/maven3-agent.jar:/opt/maven/latest/boot/plexus-classworlds-2.5.1.jar org.jvnet.hudson.maven3.agent.Maven3Main /opt/maven/latest /scratch/jenkins/slave.jar /scratch/jenkins/maven3-interceptor.jar 50722
<===[JENKINS REMOTING CAPACITY]===> channel started
log4j:WARN No appenders could be found for logger (org.apache.commons.beanutils.converters.BooleanConverter).
log4j:WARN Please initialize the log4j system properly.
Executing Maven: -B -f <https://buildhive.cloudbees.com/job/jclouds/job/jclouds-labs/ws/pom.xml> clean verify -U -e -Dmaven.javadoc.skip=true
java.lang.reflect.InvocationTargetException
at sun.reflect.NativeMethodAccessorImpl.invoke0(Native Method)
at sun.reflect.NativeMethodAccessorImpl.invoke(NativeMethodAccessorImpl.java:57)
at sun.reflect.DelegatingMethodAccessorImpl.invoke(DelegatingMethodAccessorImpl.java:43)
at java.lang.reflect.Method.invoke(Method.java:606)
at org.codehaus.plexus.classworlds.launcher.Launcher.launchStandard(Launcher.java:330)
at org.codehaus.plexus.classworlds.launcher.Launcher.launch(Launcher.java:238)
at org.jvnet.hudson.maven3.agent.Maven3Main.launch(Maven3Main.java:158)
at hudson.maven.Maven3Builder.call(Maven3Builder.java:104)
at hudson.maven.Maven3Builder.call(Maven3Builder.java:70)
at hudson.remoting.UserRequest.perform(UserRequest.java:118)
at hudson.remoting.UserRequest.perform(UserRequest.java:48)
at hudson.remoting.Request$2.run(Request.java:328)
at hudson.remoting.InterceptingExecutorService$1.call(InterceptingExecutorService.java:72)
at java.util.concurrent.FutureTask.run(FutureTask.java:262)
at java.util.concurrent.ThreadPoolExecutor.runWorker(ThreadPoolExecutor.java:1145)
at java.util.concurrent.ThreadPoolExecutor$Worker.run(ThreadPoolExecutor.java:615)
at java.lang.Thread.run(Thread.java:744)
Caused by: java.lang.NoClassDefFoundError: org/apache/maven/cli/MavenLoggerManager
at org.jvnet.hudson.maven3.launcher.Maven3Launcher.main(Maven3Launcher.java:73)
... 17 more
Caused by: java.lang.ClassNotFoundException: org.apache.maven.cli.MavenLoggerManager
at org.codehaus.plexus.classworlds.strategy.SelfFirstStrategy.loadClass(SelfFirstStrategy.java:50)
at org.codehaus.plexus.classworlds.realm.ClassRealm.unsynchronizedLoadClass(ClassRealm.java:259)
at org.codehaus.plexus.classworlds.realm.ClassRealm.loadClass(ClassRealm.java:235)
at org.codehaus.plexus.classworlds.realm.ClassRealm.loadClass(ClassRealm.java:227)
... 18 more
channel stopped
ERROR: Failed to parse POMs
hudson.util.IOException2: java.lang.reflect.InvocationTargetException
at hudson.maven.Maven3Builder.call(Maven3Builder.java:158)
at hudson.maven.Maven3Builder.call(Maven3Builder.java:70)
at hudson.remoting.UserRequest.perform(UserRequest.java:118)
at hudson.remoting.UserRequest.perform(UserRequest.java:48)
at hudson.remoting.Request$2.run(Request.java:328)
at hudson.remoting.InterceptingExecutorService$1.call(InterceptingExecutorService.java:72)
at java.util.concurrent.FutureTask.run(FutureTask.java:262)
at java.util.concurrent.ThreadPoolExecutor.runWorker(ThreadPoolExecutor.java:1145)
at java.util.concurrent.ThreadPoolExecutor$Worker.run(ThreadPoolExecutor.java:615)
at java.lang.Thread.run(Thread.java:744)
Caused by: java.lang.Exception: java.lang.reflect.InvocationTargetException
at org.jvnet.hudson.maven3.agent.Maven3Main.launch(Maven3Main.java:161)
at hudson.maven.Maven3Builder.call(Maven3Builder.java:104)
... 9 more
Caused by: java.lang.reflect.InvocationTargetException
at sun.reflect.NativeMethodAccessorImpl.invoke0(Native Method)
at sun.reflect.NativeMethodAccessorImpl.invoke(NativeMethodAccessorImpl.java:57)
at sun.reflect.DelegatingMethodAccessorImpl.invoke(DelegatingMethodAccessorImpl.java:43)
at java.lang.reflect.Method.invoke(Method.java:606)
at org.codehaus.plexus.classworlds.launcher.Launcher.launchStandard(Launcher.java:330)
at org.codehaus.plexus.classworlds.launcher.Launcher.launch(Launcher.java:238)
at org.jvnet.hudson.maven3.agent.Maven3Main.launch(Maven3Main.java:158)
... 10 more
Caused by: java.lang.NoClassDefFoundError: org/apache/maven/cli/MavenLoggerManager
at org.jvnet.hudson.maven3.launcher.Maven3Launcher.main(Maven3Launcher.java:73)
... 17 more
Caused by: java.lang.ClassNotFoundException: org.apache.maven.cli.MavenLoggerManager
at org.codehaus.plexus.classworlds.strategy.SelfFirstStrategy.loadClass(SelfFirstStrategy.java:50)
at org.codehaus.plexus.classworlds.realm.ClassRealm.unsynchronizedLoadClass(ClassRealm.java:259)
at org.codehaus.plexus.classworlds.realm.ClassRealm.loadClass(ClassRealm.java:235)
at org.codehaus.plexus.classworlds.realm.ClassRealm.loadClass(ClassRealm.java:227)
... 18 more