You are viewing a plain text version of this content. The canonical link for it is here.
Posted to dev@any23.apache.org by Apache Jenkins Server <je...@builds.apache.org> on 2012/07/07 09:01:01 UTC
Build failed in Jenkins: Any23-trunk #253
See <https://builds.apache.org/job/Any23-trunk/253/>
------------------------------------------
Started by timer
Building remotely on ubuntu2 in workspace <https://builds.apache.org/job/Any23-trunk/ws/>
Cleaning local Directory .
Checking out https://svn.apache.org/repos/asf/incubator/any23/trunk
ERROR: Failed to check out https://svn.apache.org/repos/asf/incubator/any23/trunk
org.tmatesoft.svn.core.SVNException: svn: E175002: OPTIONS /repos/asf/incubator/any23/trunk failed
at org.tmatesoft.svn.core.internal.io.dav.http.HTTPConnection.request(HTTPConnection.java:304)
at org.tmatesoft.svn.core.internal.io.dav.http.HTTPConnection.request(HTTPConnection.java:289)
at org.tmatesoft.svn.core.internal.io.dav.http.HTTPConnection.request(HTTPConnection.java:277)
at org.tmatesoft.svn.core.internal.io.dav.DAVConnection.performHttpRequest(DAVConnection.java:696)
at org.tmatesoft.svn.core.internal.io.dav.DAVConnection.exchangeCapabilities(DAVConnection.java:619)
at org.tmatesoft.svn.core.internal.io.dav.DAVConnection.open(DAVConnection.java:103)
at org.tmatesoft.svn.core.internal.io.dav.DAVRepository.openConnection(DAVRepository.java:1018)
at org.tmatesoft.svn.core.internal.io.dav.DAVRepository.getLatestRevision(DAVRepository.java:180)
at org.tmatesoft.svn.core.internal.wc16.SVNBasicDelegate.getRevisionNumber(SVNBasicDelegate.java:480)
at org.tmatesoft.svn.core.internal.wc16.SVNBasicDelegate.getLocations(SVNBasicDelegate.java:833)
at org.tmatesoft.svn.core.internal.wc16.SVNBasicDelegate.createRepository(SVNBasicDelegate.java:527)
at org.tmatesoft.svn.core.internal.wc16.SVNUpdateClient16.doCheckout(SVNUpdateClient16.java:925)
at org.tmatesoft.svn.core.internal.wc2.old.SvnOldCheckout.run(SvnOldCheckout.java:19)
at org.tmatesoft.svn.core.internal.wc2.old.SvnOldCheckout.run(SvnOldCheckout.java:8)
at org.tmatesoft.svn.core.internal.wc2.SvnOperationRunner.run(SvnOperationRunner.java:20)
at org.tmatesoft.svn.core.wc2.SvnOperationFactory.run(SvnOperationFactory.java:1221)
at org.tmatesoft.svn.core.wc2.SvnOperation.run(SvnOperation.java:292)
at org.tmatesoft.svn.core.wc.SVNUpdateClient.doCheckout(SVNUpdateClient.java:781)
at hudson.scm.subversion.CheckoutUpdater$1.perform(CheckoutUpdater.java:85)
at hudson.scm.subversion.WorkspaceUpdater$UpdateTask.delegateTo(WorkspaceUpdater.java:144)
at hudson.scm.SubversionSCM$CheckOutTask.perform(SubversionSCM.java:789)
at hudson.scm.SubversionSCM$CheckOutTask.invoke(SubversionSCM.java:770)
at hudson.scm.SubversionSCM$CheckOutTask.invoke(SubversionSCM.java:753)
at hudson.FilePath$FileCallableWrapper.call(FilePath.java:2196)
at hudson.remoting.UserRequest.perform(UserRequest.java:118)
at hudson.remoting.UserRequest.perform(UserRequest.java:48)
at hudson.remoting.Request$2.run(Request.java:326)
at hudson.remoting.InterceptingExecutorService$1.call(InterceptingExecutorService.java:72)
at java.util.concurrent.FutureTask$Sync.innerRun(FutureTask.java:334)
at java.util.concurrent.FutureTask.run(FutureTask.java:166)
at java.util.concurrent.ThreadPoolExecutor.runWorker(ThreadPoolExecutor.java:1110)
at java.util.concurrent.ThreadPoolExecutor$Worker.run(ThreadPoolExecutor.java:603)
at java.lang.Thread.run(Thread.java:636)
Caused by: svn: E175002: OPTIONS /repos/asf/incubator/any23/trunk failed
at org.tmatesoft.svn.core.SVNErrorMessage.create(SVNErrorMessage.java:208)
at org.tmatesoft.svn.core.SVNErrorMessage.create(SVNErrorMessage.java:154)
at org.tmatesoft.svn.core.SVNErrorMessage.create(SVNErrorMessage.java:97)
... 33 more
Caused by: org.tmatesoft.svn.core.SVNException: svn: E175002: OPTIONS request failed on '/repos/asf/incubator/any23/trunk'
svn: E175002: connection refused by the server
at org.tmatesoft.svn.core.internal.wc.SVNErrorManager.error(SVNErrorManager.java:64)
at org.tmatesoft.svn.core.internal.wc.SVNErrorManager.error(SVNErrorManager.java:51)
at org.tmatesoft.svn.core.internal.io.dav.http.HTTPConnection._request(HTTPConnection.java:681)
at org.tmatesoft.svn.core.internal.io.dav.http.HTTPConnection.request(HTTPConnection.java:298)
... 32 more
Caused by: svn: E175002: OPTIONS request failed on '/repos/asf/incubator/any23/trunk'
at org.tmatesoft.svn.core.SVNErrorMessage.create(SVNErrorMessage.java:208)
at org.tmatesoft.svn.core.internal.io.dav.http.HTTPConnection._request(HTTPConnection.java:679)
... 33 more
Caused by: svn: E175002: connection refused by the server
at org.tmatesoft.svn.core.SVNErrorMessage.create(SVNErrorMessage.java:208)
at org.tmatesoft.svn.core.internal.io.dav.http.HTTPConnection._request(HTTPConnection.java:424)
... 33 more
Caused by: java.net.ConnectException: Connection timed out
at java.net.PlainSocketImpl.socketConnect(Native Method)
at java.net.AbstractPlainSocketImpl.doConnect(AbstractPlainSocketImpl.java:327)
at java.net.AbstractPlainSocketImpl.connectToAddress(AbstractPlainSocketImpl.java:193)
at java.net.AbstractPlainSocketImpl.connect(AbstractPlainSocketImpl.java:180)
at java.net.SocksSocketImpl.connect(SocksSocketImpl.java:384)
at java.net.Socket.connect(Socket.java:546)
at sun.security.ssl.SSLSocketImpl.connect(SSLSocketImpl.java:584)
at org.tmatesoft.svn.core.internal.util.SVNSocketConnection.run(SVNSocketConnection.java:57)
at java.util.concurrent.Executors$RunnableAdapter.call(Executors.java:471)
... 5 more
FATAL: null
java.lang.NullPointerException
at java.util.ArrayList.addAll(ArrayList.java:530)
at hudson.scm.SubversionSCM.checkout(SubversionSCM.java:743)
at hudson.scm.SubversionSCM.checkout(SubversionSCM.java:685)
at hudson.model.AbstractProject.checkout(AbstractProject.java:1245)
at hudson.model.AbstractBuild$AbstractBuildExecution.defaultCheckout(AbstractBuild.java:589)
at jenkins.scm.SCMCheckoutStrategy.checkout(SCMCheckoutStrategy.java:88)
at hudson.model.AbstractBuild$AbstractBuildExecution.run(AbstractBuild.java:494)
at hudson.model.Run.execute(Run.java:1488)
at hudson.maven.MavenModuleSetBuild.run(MavenModuleSetBuild.java:477)
at hudson.model.ResourceController.execute(ResourceController.java:88)
at hudson.model.Executor.run(Executor.java:236)
Build failed in Jenkins: Any23-trunk #256
Posted by Apache Jenkins Server <je...@builds.apache.org>.
See <https://builds.apache.org/job/Any23-trunk/256/>
------------------------------------------
Started by timer
Building remotely on ubuntu2 in workspace <https://builds.apache.org/job/Any23-trunk/ws/>
Cleaning local Directory .
Checking out https://svn.apache.org/repos/asf/incubator/any23/trunk
ERROR: Failed to check out https://svn.apache.org/repos/asf/incubator/any23/trunk
org.tmatesoft.svn.core.SVNException: svn: E175002: OPTIONS /repos/asf/incubator/any23/trunk failed
at org.tmatesoft.svn.core.internal.io.dav.http.HTTPConnection.request(HTTPConnection.java:304)
at org.tmatesoft.svn.core.internal.io.dav.http.HTTPConnection.request(HTTPConnection.java:289)
at org.tmatesoft.svn.core.internal.io.dav.http.HTTPConnection.request(HTTPConnection.java:277)
at org.tmatesoft.svn.core.internal.io.dav.DAVConnection.performHttpRequest(DAVConnection.java:696)
at org.tmatesoft.svn.core.internal.io.dav.DAVConnection.exchangeCapabilities(DAVConnection.java:619)
at org.tmatesoft.svn.core.internal.io.dav.DAVConnection.open(DAVConnection.java:103)
at org.tmatesoft.svn.core.internal.io.dav.DAVRepository.openConnection(DAVRepository.java:1018)
at org.tmatesoft.svn.core.internal.io.dav.DAVRepository.getLatestRevision(DAVRepository.java:180)
at org.tmatesoft.svn.core.internal.wc16.SVNBasicDelegate.getRevisionNumber(SVNBasicDelegate.java:480)
at org.tmatesoft.svn.core.internal.wc16.SVNBasicDelegate.getLocations(SVNBasicDelegate.java:833)
at org.tmatesoft.svn.core.internal.wc16.SVNBasicDelegate.createRepository(SVNBasicDelegate.java:527)
at org.tmatesoft.svn.core.internal.wc16.SVNUpdateClient16.doCheckout(SVNUpdateClient16.java:925)
at org.tmatesoft.svn.core.internal.wc2.old.SvnOldCheckout.run(SvnOldCheckout.java:19)
at org.tmatesoft.svn.core.internal.wc2.old.SvnOldCheckout.run(SvnOldCheckout.java:8)
at org.tmatesoft.svn.core.internal.wc2.SvnOperationRunner.run(SvnOperationRunner.java:20)
at org.tmatesoft.svn.core.wc2.SvnOperationFactory.run(SvnOperationFactory.java:1221)
at org.tmatesoft.svn.core.wc2.SvnOperation.run(SvnOperation.java:292)
at org.tmatesoft.svn.core.wc.SVNUpdateClient.doCheckout(SVNUpdateClient.java:781)
at hudson.scm.subversion.CheckoutUpdater$1.perform(CheckoutUpdater.java:85)
at hudson.scm.subversion.WorkspaceUpdater$UpdateTask.delegateTo(WorkspaceUpdater.java:144)
at hudson.scm.SubversionSCM$CheckOutTask.perform(SubversionSCM.java:789)
at hudson.scm.SubversionSCM$CheckOutTask.invoke(SubversionSCM.java:770)
at hudson.scm.SubversionSCM$CheckOutTask.invoke(SubversionSCM.java:753)
at hudson.FilePath$FileCallableWrapper.call(FilePath.java:2196)
at hudson.remoting.UserRequest.perform(UserRequest.java:118)
at hudson.remoting.UserRequest.perform(UserRequest.java:48)
at hudson.remoting.Request$2.run(Request.java:326)
at hudson.remoting.InterceptingExecutorService$1.call(InterceptingExecutorService.java:72)
at java.util.concurrent.FutureTask$Sync.innerRun(FutureTask.java:334)
at java.util.concurrent.FutureTask.run(FutureTask.java:166)
at java.util.concurrent.ThreadPoolExecutor.runWorker(ThreadPoolExecutor.java:1110)
at java.util.concurrent.ThreadPoolExecutor$Worker.run(ThreadPoolExecutor.java:603)
at java.lang.Thread.run(Thread.java:636)
Caused by: svn: E175002: OPTIONS /repos/asf/incubator/any23/trunk failed
at org.tmatesoft.svn.core.SVNErrorMessage.create(SVNErrorMessage.java:208)
at org.tmatesoft.svn.core.SVNErrorMessage.create(SVNErrorMessage.java:154)
at org.tmatesoft.svn.core.SVNErrorMessage.create(SVNErrorMessage.java:97)
... 33 more
Caused by: org.tmatesoft.svn.core.SVNException: svn: E175002: OPTIONS request failed on '/repos/asf/incubator/any23/trunk'
svn: E175002: connection refused by the server
at org.tmatesoft.svn.core.internal.wc.SVNErrorManager.error(SVNErrorManager.java:64)
at org.tmatesoft.svn.core.internal.wc.SVNErrorManager.error(SVNErrorManager.java:51)
at org.tmatesoft.svn.core.internal.io.dav.http.HTTPConnection._request(HTTPConnection.java:681)
at org.tmatesoft.svn.core.internal.io.dav.http.HTTPConnection.request(HTTPConnection.java:298)
... 32 more
Caused by: svn: E175002: OPTIONS request failed on '/repos/asf/incubator/any23/trunk'
at org.tmatesoft.svn.core.SVNErrorMessage.create(SVNErrorMessage.java:208)
at org.tmatesoft.svn.core.internal.io.dav.http.HTTPConnection._request(HTTPConnection.java:679)
... 33 more
Caused by: svn: E175002: connection refused by the server
at org.tmatesoft.svn.core.SVNErrorMessage.create(SVNErrorMessage.java:208)
at org.tmatesoft.svn.core.internal.io.dav.http.HTTPConnection._request(HTTPConnection.java:424)
... 33 more
Caused by: java.net.ConnectException: Connection timed out
at java.net.PlainSocketImpl.socketConnect(Native Method)
at java.net.AbstractPlainSocketImpl.doConnect(AbstractPlainSocketImpl.java:327)
at java.net.AbstractPlainSocketImpl.connectToAddress(AbstractPlainSocketImpl.java:193)
at java.net.AbstractPlainSocketImpl.connect(AbstractPlainSocketImpl.java:180)
at java.net.SocksSocketImpl.connect(SocksSocketImpl.java:384)
at java.net.Socket.connect(Socket.java:546)
at sun.security.ssl.SSLSocketImpl.connect(SSLSocketImpl.java:584)
at org.tmatesoft.svn.core.internal.util.SVNSocketConnection.run(SVNSocketConnection.java:57)
at java.util.concurrent.Executors$RunnableAdapter.call(Executors.java:471)
... 5 more
FATAL: null
java.lang.NullPointerException
Build failed in Jenkins: Any23-trunk #255
Posted by Apache Jenkins Server <je...@builds.apache.org>.
See <https://builds.apache.org/job/Any23-trunk/255/>
------------------------------------------
[...truncated 4389 lines...]
Apache Any23 SUCCESS
Total time: 0s
Finished at: Mon Jul 09 07:21:23 GMT+00:00 2012
Final Memory: 101M/313M
------------------------------------------------------------------------
------------------------------------------------------------------------
Apache Any23 :: extractor
------------------------------------------------------------------------
@prefix foaf: <http://xmlns.com/foaf/0.1/> .
@prefix rdf: <http://www.w3.org/1999/02/22-rdf-syntax-ns#> .
@prefix doac: <http://ramonantonio.net/doac/0.1/#> .
_:node922ef5f5d639fa8aec344c6cd5cca25 a <http://schema.org/LocalBusiness> .
_:node3b633c60b92fdb91f57866e311155df5 a <http://schema.org/PostalAddress> ;
<http://schema.org/PostalAddress/streetAddress> "\n 6725 Southwest Bradbury Court\n " ;
<http://schema.org/PostalAddress/addressLocality> "Lake Oswego" ;
<http://schema.org/PostalAddress/postalCode> "97035" ;
<http://schema.org/PostalAddress/addressRegion> "OR" .
_:node922ef5f5d639fa8aec344c6cd5cca25 <http://schema.org/LocalBusiness/address> _:node3b633c60b92fdb91f57866e311155df5 ;
<http://schema.org/LocalBusiness/name> "\n Golden Key Mini Storage\n " ;
<http://schema.org/LocalBusiness/telephone> "\n (503) 639-1733\n " ;
<http://schema.org/LocalBusiness/url> "\n http://www.goldenkeyministorage.com/\n " .
<http://example.com/> <http://www.w3.org/1999/xhtml/microdata#item> _:node922ef5f5d639fa8aec344c6cd5cca25 .
------------------------------------------------------------------------
Apache Any23 SUCCESS
Total time: 0s
Finished at: Mon Jul 09 07:21:23 GMT+00:00 2012
Final Memory: 106M/313M
------------------------------------------------------------------------
Tests run: 4, Failures: 0, Errors: 0, Skipped: 0, Time elapsed: 0.14 sec
Running org.apache.any23.cli.ToolRunnerTest
Apache Any23 0.7.1-incubating-SNAPSHOT (trunk@r1358079; 2012-07-09 07:14:27+0000)
Java version: 1.6.0_22, vendor: Sun Microsystems Inc.
Java home: /zonestorage/hudson_solaris/home/hudson/tools/java/jdk1.6.0_22/jre
Default locale: en_null, platform encoding: ISO646-US
OS name: "SunOS", version: "5.10", arch: "x86", family: "unix"
Usage: null [options] [command] [command options]
Options:
-h, --help Display help information.
Default: false
--plugins-dir The Any23 plugins directory.
Default: /export/home/hudson/.any23/plugins
-X, --verbose Produce execution verbose output.
Default: false
-v, --version Display version information.
Default: false
Commands:
extractor Utility for obtaining documentation about metadata extractors.
Usage: extractor [options] Extractor name
Options:
-a, --all shows a report about all available extractors
Default: false
-i, --input shows example input for the given extractor
Default: false
-l, --list shows the names of all available extractors
Default: false
-o, --outut shows example output for the given extractor
Default: false
microdata Commandline Tool for extracting Microdata from file/HTTP source.
Usage: microdata [options] Input document URL, {http://path/to/resource.html|file:/path/to/local.file}
mimes MIME Type Detector Tool.
Usage: mimes [options] Input document URL, {http://path/to/resource.html|file:///path/to/local.file|inline:// some inline content}
verify Utility for plugin management verification.
Usage: verify [options] plugins-dir
rover Any23 Command Line Tool.
Usage: rover [options] input URIs {<url>|<file>}+
Options:
-d, --defaultns Override the default namespace used to produce
statements.
-e, --extractors a comma-separated list of extractors, e.g.
rdf-xml,rdf-turtle
Default: []
-f, --format the output format
Default: turtle
-l, --log Produce log within a file.
-n, --nesting Disable production of nesting triples.
Default: false
-t, --notrivial Filter trivial statements (e.g. CSS related ones).
Default: false
-o, --output Specify Output file (defaults to standard output)
Default: org.apache.maven.surefire.report.ConsoleOutputCapture$ForwardingPrintStream@1092e60
-p, --pedantic Validate and fixes HTML content detecting commons
issues.
Default: false
-s, --stats Print out extraction statistics.
Default: false
vocab Prints out the RDF Schema of the vocabularies used by Any23.
Usage: vocab [options]
Options:
-f, --format Vocabulary output format
Default: NQuads
Tests run: 3, Failures: 0, Errors: 0, Skipped: 0, Time elapsed: 0.001 sec
Running org.apache.any23.cli.MimeDetectorTest
------------------------------------------------------------------------
Apache Any23 :: mimes
------------------------------------------------------------------------
text/html
------------------------------------------------------------------------
Apache Any23 SUCCESS
Total time: 0s
Finished at: Mon Jul 09 07:21:24 GMT+00:00 2012
Final Memory: 112M/313M
------------------------------------------------------------------------
------------------------------------------------------------------------
Apache Any23 :: mimes
------------------------------------------------------------------------
application/trix
------------------------------------------------------------------------
Apache Any23 SUCCESS
Total time: 0s
Finished at: Mon Jul 09 07:21:24 GMT+00:00 2012
Final Memory: 112M/313M
------------------------------------------------------------------------
------------------------------------------------------------------------
Apache Any23 :: mimes
------------------------------------------------------------------------
text/n3
------------------------------------------------------------------------
Apache Any23 SUCCESS
Total time: 0s
Finished at: Mon Jul 09 07:21:24 GMT+00:00 2012
Final Memory: 112M/313M
------------------------------------------------------------------------
Tests run: 3, Failures: 0, Errors: 0, Skipped: 0, Time elapsed: 0.675 sec
Running org.apache.any23.configuration.DefaultConfigurationTest
Tests run: 14, Failures: 0, Errors: 0, Skipped: 0, Time elapsed: 0.001 sec
Running org.apache.any23.encoding.TikaEncodingDetectorTest
Tests run: 6, Failures: 0, Errors: 0, Skipped: 0, Time elapsed: 0.012 sec
Running org.apache.any23.mime.purifier.WhiteSpacesPurifierTest
Tests run: 1, Failures: 0, Errors: 0, Skipped: 0, Time elapsed: 0.038 sec
Running org.apache.any23.mime.TikaMIMETypeDetectorTest
Tests run: 42, Failures: 0, Errors: 0, Skipped: 0, Time elapsed: 0.294 sec
Running org.apache.any23.rdf.RDFUtilsTest
Tests run: 6, Failures: 0, Errors: 0, Skipped: 0, Time elapsed: 0.012 sec
Running org.apache.any23.rdf.PrefixesTest
Tests run: 36, Failures: 0, Errors: 0, Skipped: 0, Time elapsed: 0.006 sec
Results :
Tests run: 465, Failures: 0, Errors: 0, Skipped: 1
[JENKINS] Recording test results
[INFO] [jar:jar {execution: default-jar}]
[INFO] Building jar: <https://builds.apache.org/job/Any23-trunk/ws/core/target/apache-any23-core-0.7.1-incubating-SNAPSHOT.jar>
[INFO] [appassembler:assemble {execution: default}]
[INFO] Installing /export/home/hudson/hudson-slave/maven-repositories/0/commons-lang/commons-lang/2.4/commons-lang-2.4.jar to <https://builds.apache.org/job/Any23-trunk/ws/core/target/appassembler/lib/commons-lang-2.4.jar>
[INFO] Installing /export/home/hudson/hudson-slave/maven-repositories/0/commons-httpclient/commons-httpclient/3.1/commons-httpclient-3.1.jar to <https://builds.apache.org/job/Any23-trunk/ws/core/target/appassembler/lib/commons-httpclient-3.1.jar>
[INFO] Installing /export/home/hudson/hudson-slave/maven-repositories/0/commons-logging/commons-logging/1.0.4/commons-logging-1.0.4.jar to <https://builds.apache.org/job/Any23-trunk/ws/core/target/appassembler/lib/commons-logging-1.0.4.jar>
[INFO] Installing /export/home/hudson/hudson-slave/maven-repositories/0/commons-codec/commons-codec/1.3/commons-codec-1.3.jar to <https://builds.apache.org/job/Any23-trunk/ws/core/target/appassembler/lib/commons-codec-1.3.jar>
[INFO] Installing /export/home/hudson/hudson-slave/maven-repositories/0/net/sourceforge/nekohtml/nekohtml/1.9.14/nekohtml-1.9.14.jar to <https://builds.apache.org/job/Any23-trunk/ws/core/target/appassembler/lib/nekohtml-1.9.14.jar>
[INFO] Installing /export/home/hudson/hudson-slave/maven-repositories/0/xerces/xercesImpl/2.9.1/xercesImpl-2.9.1.jar to <https://builds.apache.org/job/Any23-trunk/ws/core/target/appassembler/lib/xercesImpl-2.9.1.jar>
[INFO] Installing /export/home/hudson/hudson-slave/maven-repositories/0/xml-apis/xml-apis/1.3.04/xml-apis-1.3.04.jar to <https://builds.apache.org/job/Any23-trunk/ws/core/target/appassembler/lib/xml-apis-1.3.04.jar>
[INFO] Installing /export/home/hudson/hudson-slave/maven-repositories/0/com/beust/jcommander/1.23/jcommander-1.23.jar to <https://builds.apache.org/job/Any23-trunk/ws/core/target/appassembler/lib/jcommander-1.23.jar>
[INFO] Installing /export/home/hudson/hudson-slave/maven-repositories/0/org/apache/tika/tika-core/0.6/tika-core-0.6.jar to <https://builds.apache.org/job/Any23-trunk/ws/core/target/appassembler/lib/tika-core-0.6.jar>
[INFO] Installing /export/home/hudson/hudson-slave/maven-repositories/0/org/apache/tika/tika-parsers/0.6/tika-parsers-0.6.jar to <https://builds.apache.org/job/Any23-trunk/ws/core/target/appassembler/lib/tika-parsers-0.6.jar>
[INFO] Installing /export/home/hudson/hudson-slave/maven-repositories/0/org/apache/commons/commons-compress/1.0/commons-compress-1.0.jar to <https://builds.apache.org/job/Any23-trunk/ws/core/target/appassembler/lib/commons-compress-1.0.jar>
[INFO] Installing /export/home/hudson/hudson-slave/maven-repositories/0/org/apache/pdfbox/pdfbox/0.8.0-incubating/pdfbox-0.8.0-incubating.jar to <https://builds.apache.org/job/Any23-trunk/ws/core/target/appassembler/lib/pdfbox-0.8.0-incubating.jar>
[INFO] Installing /export/home/hudson/hudson-slave/maven-repositories/0/org/apache/pdfbox/fontbox/0.8.0-incubator/fontbox-0.8.0-incubator.jar to <https://builds.apache.org/job/Any23-trunk/ws/core/target/appassembler/lib/fontbox-0.8.0-incubator.jar>
[INFO] Installing /export/home/hudson/hudson-slave/maven-repositories/0/org/apache/pdfbox/jempbox/0.8.0-incubator/jempbox-0.8.0-incubator.jar to <https://builds.apache.org/job/Any23-trunk/ws/core/target/appassembler/lib/jempbox-0.8.0-incubator.jar>
[INFO] Installing /export/home/hudson/hudson-slave/maven-repositories/0/org/apache/poi/poi/3.6/poi-3.6.jar to <https://builds.apache.org/job/Any23-trunk/ws/core/target/appassembler/lib/poi-3.6.jar>
[INFO] Installing /export/home/hudson/hudson-slave/maven-repositories/0/log4j/log4j/1.2.14/log4j-1.2.14.jar to <https://builds.apache.org/job/Any23-trunk/ws/core/target/appassembler/lib/log4j-1.2.14.jar>
[INFO] Installing /export/home/hudson/hudson-slave/maven-repositories/0/org/apache/poi/poi-scratchpad/3.6/poi-scratchpad-3.6.jar to <https://builds.apache.org/job/Any23-trunk/ws/core/target/appassembler/lib/poi-scratchpad-3.6.jar>
[INFO] Installing /export/home/hudson/hudson-slave/maven-repositories/0/org/apache/poi/poi-ooxml/3.6/poi-ooxml-3.6.jar to <https://builds.apache.org/job/Any23-trunk/ws/core/target/appassembler/lib/poi-ooxml-3.6.jar>
[INFO] Installing /export/home/hudson/hudson-slave/maven-repositories/0/org/apache/poi/poi-ooxml-schemas/3.6/poi-ooxml-schemas-3.6.jar to <https://builds.apache.org/job/Any23-trunk/ws/core/target/appassembler/lib/poi-ooxml-schemas-3.6.jar>
[INFO] Installing /export/home/hudson/hudson-slave/maven-repositories/0/org/apache/xmlbeans/xmlbeans/2.3.0/xmlbeans-2.3.0.jar to <https://builds.apache.org/job/Any23-trunk/ws/core/target/appassembler/lib/xmlbeans-2.3.0.jar>
[INFO] Installing /export/home/hudson/hudson-slave/maven-repositories/0/org/apache/geronimo/specs/geronimo-stax-api_1.0_spec/1.0.1/geronimo-stax-api_1.0_spec-1.0.1.jar to <https://builds.apache.org/job/Any23-trunk/ws/core/target/appassembler/lib/geronimo-stax-api_1.0_spec-1.0.1.jar>
[INFO] Installing /export/home/hudson/hudson-slave/maven-repositories/0/dom4j/dom4j/1.6.1/dom4j-1.6.1.jar to <https://builds.apache.org/job/Any23-trunk/ws/core/target/appassembler/lib/dom4j-1.6.1.jar>
[INFO] Installing /export/home/hudson/hudson-slave/maven-repositories/0/org/ccil/cowan/tagsoup/tagsoup/1.2/tagsoup-1.2.jar to <https://builds.apache.org/job/Any23-trunk/ws/core/target/appassembler/lib/tagsoup-1.2.jar>
[INFO] Installing /export/home/hudson/hudson-slave/maven-repositories/0/asm/asm/3.1/asm-3.1.jar to <https://builds.apache.org/job/Any23-trunk/ws/core/target/appassembler/lib/asm-3.1.jar>
[INFO] Installing /export/home/hudson/hudson-slave/maven-repositories/0/com/drewnoakes/metadata-extractor/2.4.0-beta-1/metadata-extractor-2.4.0-beta-1.jar to <https://builds.apache.org/job/Any23-trunk/ws/core/target/appassembler/lib/metadata-extractor-2.4.0-beta-1.jar>
[INFO] Installing /export/home/hudson/hudson-slave/maven-repositories/0/org/openrdf/sesame/sesame-model/2.6.1/sesame-model-2.6.1.jar to <https://builds.apache.org/job/Any23-trunk/ws/core/target/appassembler/lib/sesame-model-2.6.1.jar>
[INFO] Installing /export/home/hudson/hudson-slave/maven-repositories/0/org/openrdf/sesame/sesame-util/2.6.1/sesame-util-2.6.1.jar to <https://builds.apache.org/job/Any23-trunk/ws/core/target/appassembler/lib/sesame-util-2.6.1.jar>
[INFO] Installing /export/home/hudson/hudson-slave/maven-repositories/0/org/slf4j/slf4j-api/1.5.6/slf4j-api-1.5.6.jar to <https://builds.apache.org/job/Any23-trunk/ws/core/target/appassembler/lib/slf4j-api-1.5.6.jar>
[INFO] Installing /export/home/hudson/hudson-slave/maven-repositories/0/org/openrdf/sesame/sesame-rio-api/2.6.1/sesame-rio-api-2.6.1.jar to <https://builds.apache.org/job/Any23-trunk/ws/core/target/appassembler/lib/sesame-rio-api-2.6.1.jar>
[INFO] Installing /export/home/hudson/hudson-slave/maven-repositories/0/org/openrdf/sesame/sesame-rio-turtle/2.6.1/sesame-rio-turtle-2.6.1.jar to <https://builds.apache.org/job/Any23-trunk/ws/core/target/appassembler/lib/sesame-rio-turtle-2.6.1.jar>
[INFO] Installing /export/home/hudson/hudson-slave/maven-repositories/0/org/openrdf/sesame/sesame-rio-rdfxml/2.6.1/sesame-rio-rdfxml-2.6.1.jar to <https://builds.apache.org/job/Any23-trunk/ws/core/target/appassembler/lib/sesame-rio-rdfxml-2.6.1.jar>
[INFO] Installing /export/home/hudson/hudson-slave/maven-repositories/0/org/openrdf/sesame/sesame-rio-ntriples/2.6.1/sesame-rio-ntriples-2.6.1.jar to <https://builds.apache.org/job/Any23-trunk/ws/core/target/appassembler/lib/sesame-rio-ntriples-2.6.1.jar>
[INFO] Installing /export/home/hudson/hudson-slave/maven-repositories/0/org/openrdf/sesame/sesame-rio-trix/2.6.1/sesame-rio-trix-2.6.1.jar to <https://builds.apache.org/job/Any23-trunk/ws/core/target/appassembler/lib/sesame-rio-trix-2.6.1.jar>
[INFO] Installing /export/home/hudson/hudson-slave/maven-repositories/0/org/openrdf/sesame/sesame-repository-sail/2.6.1/sesame-repository-sail-2.6.1.jar to <https://builds.apache.org/job/Any23-trunk/ws/core/target/appassembler/lib/sesame-repository-sail-2.6.1.jar>
[INFO] Installing /export/home/hudson/hudson-slave/maven-repositories/0/org/openrdf/sesame/sesame-repository-api/2.6.1/sesame-repository-api-2.6.1.jar to <https://builds.apache.org/job/Any23-trunk/ws/core/target/appassembler/lib/sesame-repository-api-2.6.1.jar>
[INFO] Installing /export/home/hudson/hudson-slave/maven-repositories/0/org/openrdf/sesame/sesame-query/2.6.1/sesame-query-2.6.1.jar to <https://builds.apache.org/job/Any23-trunk/ws/core/target/appassembler/lib/sesame-query-2.6.1.jar>
[INFO] Installing /export/home/hudson/hudson-slave/maven-repositories/0/org/openrdf/sesame/sesame-sail-api/2.6.1/sesame-sail-api-2.6.1.jar to <https://builds.apache.org/job/Any23-trunk/ws/core/target/appassembler/lib/sesame-sail-api-2.6.1.jar>
[INFO] Installing /export/home/hudson/hudson-slave/maven-repositories/0/org/openrdf/sesame/sesame-queryalgebra-model/2.6.1/sesame-queryalgebra-model-2.6.1.jar to <https://builds.apache.org/job/Any23-trunk/ws/core/target/appassembler/lib/sesame-queryalgebra-model-2.6.1.jar>
[INFO] Installing /export/home/hudson/hudson-slave/maven-repositories/0/org/openrdf/sesame/sesame-queryparser-api/2.6.1/sesame-queryparser-api-2.6.1.jar to <https://builds.apache.org/job/Any23-trunk/ws/core/target/appassembler/lib/sesame-queryparser-api-2.6.1.jar>
[INFO] Installing /export/home/hudson/hudson-slave/maven-repositories/0/org/openrdf/sesame/sesame-sail-memory/2.6.1/sesame-sail-memory-2.6.1.jar to <https://builds.apache.org/job/Any23-trunk/ws/core/target/appassembler/lib/sesame-sail-memory-2.6.1.jar>
[INFO] Installing /export/home/hudson/hudson-slave/maven-repositories/0/org/openrdf/sesame/sesame-sail-inferencer/2.6.1/sesame-sail-inferencer-2.6.1.jar to <https://builds.apache.org/job/Any23-trunk/ws/core/target/appassembler/lib/sesame-sail-inferencer-2.6.1.jar>
[INFO] Installing /export/home/hudson/hudson-slave/maven-repositories/0/org/openrdf/sesame/sesame-queryparser-serql/2.6.1/sesame-queryparser-serql-2.6.1.jar to <https://builds.apache.org/job/Any23-trunk/ws/core/target/appassembler/lib/sesame-queryparser-serql-2.6.1.jar>
[INFO] Installing /export/home/hudson/hudson-slave/maven-repositories/0/org/openrdf/sesame/sesame-queryalgebra-evaluation/2.6.1/sesame-queryalgebra-evaluation-2.6.1.jar to <https://builds.apache.org/job/Any23-trunk/ws/core/target/appassembler/lib/sesame-queryalgebra-evaluation-2.6.1.jar>
[INFO] Installing /export/home/hudson/hudson-slave/maven-repositories/0/org/openrdf/sesame/sesame-repository-sparql/2.6.1/sesame-repository-sparql-2.6.1.jar to <https://builds.apache.org/job/Any23-trunk/ws/core/target/appassembler/lib/sesame-repository-sparql-2.6.1.jar>
[INFO] Installing /export/home/hudson/hudson-slave/maven-repositories/0/org/openrdf/sesame/sesame-http-client/2.6.1/sesame-http-client-2.6.1.jar to <https://builds.apache.org/job/Any23-trunk/ws/core/target/appassembler/lib/sesame-http-client-2.6.1.jar>
[INFO] Installing /export/home/hudson/hudson-slave/maven-repositories/0/org/openrdf/sesame/sesame-http-protocol/2.6.1/sesame-http-protocol-2.6.1.jar to <https://builds.apache.org/job/Any23-trunk/ws/core/target/appassembler/lib/sesame-http-protocol-2.6.1.jar>
[INFO] Installing /export/home/hudson/hudson-slave/maven-repositories/0/org/openrdf/sesame/sesame-queryresultio-api/2.6.1/sesame-queryresultio-api-2.6.1.jar to <https://builds.apache.org/job/Any23-trunk/ws/core/target/appassembler/lib/sesame-queryresultio-api-2.6.1.jar>
[INFO] Installing /export/home/hudson/hudson-slave/maven-repositories/0/org/openrdf/sesame/sesame-queryresultio-sparqlxml/2.6.1/sesame-queryresultio-sparqlxml-2.6.1.jar to <https://builds.apache.org/job/Any23-trunk/ws/core/target/appassembler/lib/sesame-queryresultio-sparqlxml-2.6.1.jar>
[INFO] Installing /export/home/hudson/hudson-slave/maven-repositories/0/info/aduna/commons/aduna-commons-xml/2.7.0/aduna-commons-xml-2.7.0.jar to <https://builds.apache.org/job/Any23-trunk/ws/core/target/appassembler/lib/aduna-commons-xml-2.7.0.jar>
[INFO] Installing /export/home/hudson/hudson-slave/maven-repositories/0/info/aduna/commons/aduna-commons-text/2.7.0/aduna-commons-text-2.7.0.jar to <https://builds.apache.org/job/Any23-trunk/ws/core/target/appassembler/lib/aduna-commons-text-2.7.0.jar>
[INFO] Installing /export/home/hudson/hudson-slave/maven-repositories/0/info/aduna/commons/aduna-commons-net/2.7.0/aduna-commons-net-2.7.0.jar to <https://builds.apache.org/job/Any23-trunk/ws/core/target/appassembler/lib/aduna-commons-net-2.7.0.jar>
[INFO] Installing /export/home/hudson/hudson-slave/maven-repositories/0/info/aduna/commons/aduna-commons-lang/2.9.0/aduna-commons-lang-2.9.0.jar to <https://builds.apache.org/job/Any23-trunk/ws/core/target/appassembler/lib/aduna-commons-lang-2.9.0.jar>
[INFO] Installing /export/home/hudson/hudson-slave/maven-repositories/0/info/aduna/commons/aduna-commons-iteration/2.10.0/aduna-commons-iteration-2.10.0.jar to <https://builds.apache.org/job/Any23-trunk/ws/core/target/appassembler/lib/aduna-commons-iteration-2.10.0.jar>
[INFO] Installing /export/home/hudson/hudson-slave/maven-repositories/0/info/aduna/commons/aduna-commons-concurrent/2.7.0/aduna-commons-concurrent-2.7.0.jar to <https://builds.apache.org/job/Any23-trunk/ws/core/target/appassembler/lib/aduna-commons-concurrent-2.7.0.jar>
[INFO] Installing /export/home/hudson/hudson-slave/maven-repositories/0/info/aduna/commons/aduna-commons-io/2.10.0/aduna-commons-io-2.10.0.jar to <https://builds.apache.org/job/Any23-trunk/ws/core/target/appassembler/lib/aduna-commons-io-2.10.0.jar>
[INFO] Installing /export/home/hudson/hudson-slave/maven-repositories/0/org/apache/commons/commons-csv/1.0-SNAPSHOT-rev1148315/commons-csv-1.0-SNAPSHOT-rev1148315.jar to <https://builds.apache.org/job/Any23-trunk/ws/core/target/appassembler/lib/commons-csv-1.0-SNAPSHOT-rev1148315.jar>
[INFO] Installing /export/home/hudson/hudson-slave/maven-repositories/0/org/slf4j/slf4j-jdk14/1.5.6/slf4j-jdk14-1.5.6.jar to <https://builds.apache.org/job/Any23-trunk/ws/core/target/appassembler/lib/slf4j-jdk14-1.5.6.jar>
[INFO] Installing /export/home/hudson/hudson-slave/maven-repositories/0/org/slf4j/jcl-over-slf4j/1.5.6/jcl-over-slf4j-1.5.6.jar to <https://builds.apache.org/job/Any23-trunk/ws/core/target/appassembler/lib/jcl-over-slf4j-1.5.6.jar>
[INFO] Installing <https://builds.apache.org/job/Any23-trunk/ws/core/target/apache-any23-core-0.7.1-incubating-SNAPSHOT.jar> to <https://builds.apache.org/job/Any23-trunk/ws/core/target/appassembler/lib/apache-any23-core-0.7.1-incubating-SNAPSHOT.jar>
[INFO] [assembly:single {execution: assembly}]
[INFO] Reading assembly descriptor: <https://builds.apache.org/job/Any23-trunk/ws/core/src/main/assembly/bin.xml>
[INFO] Building tar: <https://builds.apache.org/job/Any23-trunk/ws/core/target/apache-any23-core-0.7.1-incubating-SNAPSHOT.tar.gz>
[INFO] Building zip: <https://builds.apache.org/job/Any23-trunk/ws/core/target/apache-any23-core-0.7.1-incubating-SNAPSHOT.zip>
[INFO] [install:install {execution: default-install}]
[INFO] Installing <https://builds.apache.org/job/Any23-trunk/ws/core/target/apache-any23-core-0.7.1-incubating-SNAPSHOT.jar> to /export/home/hudson/hudson-slave/maven-repositories/0/org/apache/any23/apache-any23-core/0.7.1-incubating-SNAPSHOT/apache-any23-core-0.7.1-incubating-SNAPSHOT.jar
[INFO] Installing <https://builds.apache.org/job/Any23-trunk/ws/core/target/apache-any23-core-0.7.1-incubating-SNAPSHOT.tar.gz> to /export/home/hudson/hudson-slave/maven-repositories/0/org/apache/any23/apache-any23-core/0.7.1-incubating-SNAPSHOT/apache-any23-core-0.7.1-incubating-SNAPSHOT.tar.gz
[INFO] Installing <https://builds.apache.org/job/Any23-trunk/ws/core/target/apache-any23-core-0.7.1-incubating-SNAPSHOT.zip> to /export/home/hudson/hudson-slave/maven-repositories/0/org/apache/any23/apache-any23-core/0.7.1-incubating-SNAPSHOT/apache-any23-core-0.7.1-incubating-SNAPSHOT.zip
[JENKINS] Archiving <https://builds.apache.org/job/Any23-trunk/ws/core/pom.xml> to /home/hudson/hudson/jobs/Any23-trunk/modules/org.apache.any23$apache-any23-core/builds/2012-07-09_07-11-21/archive/org.apache.any23/apache-any23-core/0.7.1-incubating-SNAPSHOT/apache-any23-core-0.7.1-incubating-SNAPSHOT.pom
[JENKINS] Archiving <https://builds.apache.org/job/Any23-trunk/ws/core/target/apache-any23-core-0.7.1-incubating-SNAPSHOT.jar> to /home/hudson/hudson/jobs/Any23-trunk/modules/org.apache.any23$apache-any23-core/builds/2012-07-09_07-11-21/archive/org.apache.any23/apache-any23-core/0.7.1-incubating-SNAPSHOT/apache-any23-core-0.7.1-incubating-SNAPSHOT.jar
[JENKINS] Archiving <https://builds.apache.org/job/Any23-trunk/ws/core/target/apache-any23-core-0.7.1-incubating-SNAPSHOT.tar.gz> to /home/hudson/hudson/jobs/Any23-trunk/modules/org.apache.any23$apache-any23-core/builds/2012-07-09_07-11-21/archive/org.apache.any23/apache-any23-core/0.7.1-incubating-SNAPSHOT/apache-any23-core-0.7.1-incubating-SNAPSHOT.tar.gz
[JENKINS] Archiving <https://builds.apache.org/job/Any23-trunk/ws/core/target/apache-any23-core-0.7.1-incubating-SNAPSHOT.zip> to /home/hudson/hudson/jobs/Any23-trunk/modules/org.apache.any23$apache-any23-core/builds/2012-07-09_07-11-21/archive/org.apache.any23/apache-any23-core/0.7.1-incubating-SNAPSHOT/apache-any23-core-0.7.1-incubating-SNAPSHOT.zip
[INFO] ------------------------------------------------------------------------
[ERROR] BUILD ERROR
[INFO] ------------------------------------------------------------------------
[INFO] Internal error in the plugin manager executing goal 'org.apache.maven.plugins:maven-deploy-plugin:2.5:deploy': Unable to find the mojo 'deploy' (or one of its required components) in the plugin 'org.apache.maven.plugins:maven-deploy-plugin'
Component descriptor cannot be found in the component repository: org.apache.maven.artifact.repository.layout.ArtifactRepositoryLayoutflat.
[INFO] ------------------------------------------------------------------------
[INFO] For more information, run Maven with the -e switch
[INFO] ------------------------------------------------------------------------
[INFO] Total time: 29 minutes 54 seconds
[INFO] Finished at: Mon Jul 09 07:44:22 GMT+00:00 2012
[INFO] Final Memory: 59M/413M
[INFO] ------------------------------------------------------------------------
channel stopped
Build failed in Jenkins: Any23-trunk #254
Posted by Apache Jenkins Server <je...@builds.apache.org>.
See <https://builds.apache.org/job/Any23-trunk/254/>
------------------------------------------
[...truncated 3478 lines...]
text/html
------------------------------------------------------------------------
Apache Any23 SUCCESS
Total time: 0s
Finished at: Sun Jul 08 07:11:24 GMT+00:00 2012
Final Memory: 43M/113M
------------------------------------------------------------------------
------------------------------------------------------------------------
Apache Any23 :: mimes
------------------------------------------------------------------------
application/trix
------------------------------------------------------------------------
Apache Any23 SUCCESS
Total time: 0s
Finished at: Sun Jul 08 07:11:24 GMT+00:00 2012
Final Memory: 44M/113M
------------------------------------------------------------------------
------------------------------------------------------------------------
Apache Any23 :: mimes
------------------------------------------------------------------------
text/n3
------------------------------------------------------------------------
Apache Any23 SUCCESS
Total time: 0s
Finished at: Sun Jul 08 07:11:24 GMT+00:00 2012
Final Memory: 46M/113M
------------------------------------------------------------------------
Tests run: 3, Failures: 0, Errors: 0, Skipped: 0, Time elapsed: 0.333 sec
Running org.apache.any23.encoding.TikaEncodingDetectorTest
Tests run: 6, Failures: 0, Errors: 0, Skipped: 0, Time elapsed: 0.013 sec
Running org.apache.any23.rdf.PrefixesTest
Tests run: 36, Failures: 0, Errors: 0, Skipped: 0, Time elapsed: 0.008 sec
Running org.apache.any23.rdf.RDFUtilsTest
Tests run: 6, Failures: 0, Errors: 0, Skipped: 0, Time elapsed: 0.004 sec
Running org.apache.any23.SesameTest
Tests run: 3, Failures: 0, Errors: 0, Skipped: 0, Time elapsed: 0 sec
Running org.apache.any23.validator.DefaultValidatorTest
Tests run: 4, Failures: 0, Errors: 0, Skipped: 0, Time elapsed: 0.021 sec
Running org.apache.any23.validator.XMLValidationReportSerializerTest
Tests run: 2, Failures: 0, Errors: 0, Skipped: 0, Time elapsed: 0.005 sec
Running org.apache.any23.extractor.xpath.TemplateXPathExtractorRuleImplTest
Tests run: 6, Failures: 0, Errors: 0, Skipped: 0, Time elapsed: 0.161 sec
Running org.apache.any23.extractor.rdf.TurtleExtractorTest
Tests run: 1, Failures: 0, Errors: 0, Skipped: 0, Time elapsed: 0.003 sec
Running org.apache.any23.extractor.microdata.MicrodataParserTest
Tests run: 9, Failures: 0, Errors: 0, Skipped: 0, Time elapsed: 0.034 sec
Running org.apache.any23.extractor.microdata.MicrodataExtractorTest
Tests run: 6, Failures: 0, Errors: 0, Skipped: 0, Time elapsed: 0.311 sec
Running org.apache.any23.extractor.rdfa.RDFa11ExtractorTest
<http://bob.example.com/> <http://purl.org/dc/terms/title> "The trouble with Bob"@en <http://bob.example.com/> .
<http://bob.example.com/> <http://purl.org/dc/terms/creator> "Alice"@en <http://bob.example.com/> .
<http://bob.example.com/> <http://fake.org/prop> "Mary"@en <http://bob.example.com/> .
Tests run: 14, Failures: 0, Errors: 0, Skipped: 0, Time elapsed: 0.326 sec
Running org.apache.any23.extractor.rdfa.RDFaExtractorTest
<http://bob.example.com/> <http://purl.org/dc/terms/title> "The trouble with Bob"@en <http://bob.example.com/> .
<http://bob.example.com/> <http://purl.org/dc/terms/creator> "Alice"@en <http://bob.example.com/> .
<http://bob.example.com/> <http://fake.org/prop> "Mary"@en <http://bob.example.com/> .
Tests run: 7, Failures: 0, Errors: 0, Skipped: 0, Time elapsed: 0.869 sec
Running org.apache.any23.extractor.rdfa.RDFa11ParserTest
Tests run: 12, Failures: 0, Errors: 0, Skipped: 0, Time elapsed: 0.447 sec
Running org.apache.any23.extractor.rdfa.XSLTStylesheetTest
Tests run: 2, Failures: 0, Errors: 0, Skipped: 0, Time elapsed: 0.029 sec
Running org.apache.any23.extractor.rdfa.ExtractionExceptionTest
Tests run: 1, Failures: 0, Errors: 0, Skipped: 0, Time elapsed: 0.024 sec
Running org.apache.any23.extractor.ExtractionParametersTest
Tests run: 2, Failures: 0, Errors: 0, Skipped: 0, Time elapsed: 0 sec
Running org.apache.any23.extractor.ExtractionAPITest
Tests run: 1, Failures: 0, Errors: 0, Skipped: 0, Time elapsed: 0 sec
Running org.apache.any23.extractor.csv.CSVExtractorTest
Tests run: 4, Failures: 0, Errors: 0, Skipped: 0, Time elapsed: 0.027 sec
Running org.apache.any23.extractor.csv.CSVReaderBuilderTest
Tests run: 2, Failures: 0, Errors: 0, Skipped: 0, Time elapsed: 0.007 sec
Running org.apache.any23.extractor.SingleDocumentExtractionTest
Tests run: 5, Failures: 0, Errors: 0, Skipped: 0, Time elapsed: 0.225 sec
Running org.apache.any23.extractor.ExtractionResultImplTest
Tests run: 1, Failures: 0, Errors: 0, Skipped: 0, Time elapsed: 0.004 sec
Running org.apache.any23.extractor.html.HCalendarExtractorTest
Tests run: 27, Failures: 0, Errors: 0, Skipped: 0, Time elapsed: 0.386 sec
Running org.apache.any23.extractor.html.HReviewExtractorTest
Tests run: 6, Failures: 0, Errors: 0, Skipped: 0, Time elapsed: 0.042 sec
Running org.apache.any23.extractor.html.SpanCloserInputStreamTest
Tests run: 7, Failures: 0, Errors: 0, Skipped: 0, Time elapsed: 0.006 sec
Running org.apache.any23.extractor.html.TagSoupParserTest
Tests run: 4, Failures: 0, Errors: 0, Skipped: 0, Time elapsed: 0.105 sec
Running org.apache.any23.extractor.html.HeadLinkExtractorTest
Tests run: 1, Failures: 0, Errors: 0, Skipped: 0, Time elapsed: 0.01 sec
Running org.apache.any23.extractor.html.HTMLDocumentTest
Tests run: 1, Failures: 0, Errors: 0, Skipped: 0, Time elapsed: 0.001 sec
Running org.apache.any23.extractor.html.SpeciesExtractorTest
Tests run: 1, Failures: 0, Errors: 0, Skipped: 0, Time elapsed: 0.015 sec
Running org.apache.any23.extractor.html.AdrExtractorTest
Tests run: 1, Failures: 0, Errors: 0, Skipped: 0, Time elapsed: 0.085 sec
Running org.apache.any23.extractor.html.TitleExtractorTest
Tests run: 5, Failures: 0, Errors: 0, Skipped: 0, Time elapsed: 0.025 sec
Running org.apache.any23.extractor.html.XFNExtractorTest
Tests run: 15, Failures: 0, Errors: 0, Skipped: 0, Time elapsed: 0.066 sec
Running org.apache.any23.extractor.html.HCardExtractorTest
Tests run: 46, Failures: 0, Errors: 0, Skipped: 1, Time elapsed: 0.794 sec
Running org.apache.any23.extractor.html.HRecipeExtractorTest
Tests run: 2, Failures: 0, Errors: 0, Skipped: 0, Time elapsed: 0.017 sec
Running org.apache.any23.extractor.html.DomUtilsTest
Tests run: 7, Failures: 0, Errors: 0, Skipped: 0, Time elapsed: 0.086 sec
Running org.apache.any23.extractor.html.TurtleHTMLExtractorTest
Tests run: 1, Failures: 0, Errors: 0, Skipped: 0, Time elapsed: 0.011 sec
Running org.apache.any23.extractor.html.HListingExtractorTest
Tests run: 26, Failures: 0, Errors: 0, Skipped: 0, Time elapsed: 0.402 sec
Running org.apache.any23.extractor.html.HTMLMetaExtractorTest
Tests run: 2, Failures: 0, Errors: 0, Skipped: 0, Time elapsed: 0.05 sec
Running org.apache.any23.extractor.html.HResumeExtractorTest
Tests run: 4, Failures: 0, Errors: 0, Skipped: 0, Time elapsed: 0.265 sec
Running org.apache.any23.extractor.html.RDFMergerTest
Tests run: 10, Failures: 0, Errors: 0, Skipped: 0, Time elapsed: 0.647 sec
Running org.apache.any23.extractor.html.LicenseExtractorTest
Tests run: 6, Failures: 0, Errors: 0, Skipped: 0, Time elapsed: 0.063 sec
Running org.apache.any23.extractor.html.EncodingTest
Tests run: 5, Failures: 0, Errors: 0, Skipped: 0, Time elapsed: 0.036 sec
Running org.apache.any23.http.AcceptHeaderBuilderTest
Tests run: 12, Failures: 0, Errors: 0, Skipped: 0, Time elapsed: 0.003 sec
Running org.apache.any23.io.nquads.NQuadsWriterTest
Tests run: 2, Failures: 0, Errors: 0, Skipped: 0, Time elapsed: 0.031 sec
Running org.apache.any23.io.nquads.NQuadsParserTest
Tests run: 24, Failures: 0, Errors: 0, Skipped: 0, Time elapsed: 0.034 sec
Running org.apache.any23.writer.WriterRegistryTest
Tests run: 7, Failures: 0, Errors: 0, Skipped: 0, Time elapsed: 0.005 sec
Running org.apache.any23.writer.JSONWriterTest
Tests run: 1, Failures: 0, Errors: 0, Skipped: 0, Time elapsed: 0.001 sec
Running org.apache.any23.mime.purifier.WhiteSpacesPurifierTest
Tests run: 1, Failures: 0, Errors: 0, Skipped: 0, Time elapsed: 0.014 sec
Running org.apache.any23.mime.TikaMIMETypeDetectorTest
Tests run: 42, Failures: 0, Errors: 0, Skipped: 0, Time elapsed: 0.12 sec
Running org.apache.any23.vocab.RDFSchemaUtilsTest
Tests run: 2, Failures: 0, Errors: 0, Skipped: 0, Time elapsed: 0.144 sec
Running org.apache.any23.vocab.VocabularyTest
Tests run: 3, Failures: 0, Errors: 0, Skipped: 0, Time elapsed: 0.002 sec
Running org.apache.any23.Any23Test
Tests run: 23, Failures: 0, Errors: 0, Skipped: 0, Time elapsed: 7.533 sec
Running org.apache.any23.util.DiscoveryUtilsTest
Tests run: 2, Failures: 0, Errors: 0, Skipped: 0, Time elapsed: 0.014 sec
Running org.apache.any23.util.StringUtilsTest
Tests run: 3, Failures: 0, Errors: 0, Skipped: 0, Time elapsed: 0.001 sec
Running org.apache.any23.filter.IgnoreAccidentalRDFaTest
Tests run: 2, Failures: 0, Errors: 0, Skipped: 0, Time elapsed: 0.011 sec
Running org.apache.any23.filter.ExtractionContextBlockerTest
Tests run: 1, Failures: 0, Errors: 0, Skipped: 0, Time elapsed: 0.001 sec
Running org.apache.any23.plugin.Any23PluginManagerTest
Tests run: 2, Failures: 0, Errors: 0, Skipped: 0, Time elapsed: 0.007 sec
Results :
Tests run: 465, Failures: 0, Errors: 0, Skipped: 1
[JENKINS] Recording test results
[INFO] [jar:jar {execution: default-jar}]
[INFO] Building jar: <https://builds.apache.org/job/Any23-trunk/ws/core/target/apache-any23-core-0.7.1-incubating-SNAPSHOT.jar>
[INFO] [appassembler:assemble {execution: default}]
[INFO] Installing /export/home/hudson/hudson-slave/maven-repositories/0/commons-lang/commons-lang/2.4/commons-lang-2.4.jar to <https://builds.apache.org/job/Any23-trunk/ws/core/target/appassembler/lib/commons-lang-2.4.jar>
[INFO] Installing /export/home/hudson/hudson-slave/maven-repositories/0/commons-httpclient/commons-httpclient/3.1/commons-httpclient-3.1.jar to <https://builds.apache.org/job/Any23-trunk/ws/core/target/appassembler/lib/commons-httpclient-3.1.jar>
[INFO] Installing /export/home/hudson/hudson-slave/maven-repositories/0/commons-logging/commons-logging/1.0.4/commons-logging-1.0.4.jar to <https://builds.apache.org/job/Any23-trunk/ws/core/target/appassembler/lib/commons-logging-1.0.4.jar>
[INFO] Installing /export/home/hudson/hudson-slave/maven-repositories/0/commons-codec/commons-codec/1.3/commons-codec-1.3.jar to <https://builds.apache.org/job/Any23-trunk/ws/core/target/appassembler/lib/commons-codec-1.3.jar>
[INFO] Installing /export/home/hudson/hudson-slave/maven-repositories/0/net/sourceforge/nekohtml/nekohtml/1.9.14/nekohtml-1.9.14.jar to <https://builds.apache.org/job/Any23-trunk/ws/core/target/appassembler/lib/nekohtml-1.9.14.jar>
[INFO] Installing /export/home/hudson/hudson-slave/maven-repositories/0/xerces/xercesImpl/2.9.1/xercesImpl-2.9.1.jar to <https://builds.apache.org/job/Any23-trunk/ws/core/target/appassembler/lib/xercesImpl-2.9.1.jar>
[INFO] Installing /export/home/hudson/hudson-slave/maven-repositories/0/xml-apis/xml-apis/1.3.04/xml-apis-1.3.04.jar to <https://builds.apache.org/job/Any23-trunk/ws/core/target/appassembler/lib/xml-apis-1.3.04.jar>
[INFO] Installing /export/home/hudson/hudson-slave/maven-repositories/0/com/beust/jcommander/1.23/jcommander-1.23.jar to <https://builds.apache.org/job/Any23-trunk/ws/core/target/appassembler/lib/jcommander-1.23.jar>
[INFO] Installing /export/home/hudson/hudson-slave/maven-repositories/0/org/apache/tika/tika-core/0.6/tika-core-0.6.jar to <https://builds.apache.org/job/Any23-trunk/ws/core/target/appassembler/lib/tika-core-0.6.jar>
[INFO] Installing /export/home/hudson/hudson-slave/maven-repositories/0/org/apache/tika/tika-parsers/0.6/tika-parsers-0.6.jar to <https://builds.apache.org/job/Any23-trunk/ws/core/target/appassembler/lib/tika-parsers-0.6.jar>
[INFO] Installing /export/home/hudson/hudson-slave/maven-repositories/0/org/apache/commons/commons-compress/1.0/commons-compress-1.0.jar to <https://builds.apache.org/job/Any23-trunk/ws/core/target/appassembler/lib/commons-compress-1.0.jar>
[INFO] Installing /export/home/hudson/hudson-slave/maven-repositories/0/org/apache/pdfbox/pdfbox/0.8.0-incubating/pdfbox-0.8.0-incubating.jar to <https://builds.apache.org/job/Any23-trunk/ws/core/target/appassembler/lib/pdfbox-0.8.0-incubating.jar>
[INFO] Installing /export/home/hudson/hudson-slave/maven-repositories/0/org/apache/pdfbox/fontbox/0.8.0-incubator/fontbox-0.8.0-incubator.jar to <https://builds.apache.org/job/Any23-trunk/ws/core/target/appassembler/lib/fontbox-0.8.0-incubator.jar>
[INFO] Installing /export/home/hudson/hudson-slave/maven-repositories/0/org/apache/pdfbox/jempbox/0.8.0-incubator/jempbox-0.8.0-incubator.jar to <https://builds.apache.org/job/Any23-trunk/ws/core/target/appassembler/lib/jempbox-0.8.0-incubator.jar>
[INFO] Installing /export/home/hudson/hudson-slave/maven-repositories/0/org/apache/poi/poi/3.6/poi-3.6.jar to <https://builds.apache.org/job/Any23-trunk/ws/core/target/appassembler/lib/poi-3.6.jar>
[INFO] Installing /export/home/hudson/hudson-slave/maven-repositories/0/log4j/log4j/1.2.14/log4j-1.2.14.jar to <https://builds.apache.org/job/Any23-trunk/ws/core/target/appassembler/lib/log4j-1.2.14.jar>
[INFO] Installing /export/home/hudson/hudson-slave/maven-repositories/0/org/apache/poi/poi-scratchpad/3.6/poi-scratchpad-3.6.jar to <https://builds.apache.org/job/Any23-trunk/ws/core/target/appassembler/lib/poi-scratchpad-3.6.jar>
[INFO] Installing /export/home/hudson/hudson-slave/maven-repositories/0/org/apache/poi/poi-ooxml/3.6/poi-ooxml-3.6.jar to <https://builds.apache.org/job/Any23-trunk/ws/core/target/appassembler/lib/poi-ooxml-3.6.jar>
[INFO] Installing /export/home/hudson/hudson-slave/maven-repositories/0/org/apache/poi/poi-ooxml-schemas/3.6/poi-ooxml-schemas-3.6.jar to <https://builds.apache.org/job/Any23-trunk/ws/core/target/appassembler/lib/poi-ooxml-schemas-3.6.jar>
[INFO] Installing /export/home/hudson/hudson-slave/maven-repositories/0/org/apache/xmlbeans/xmlbeans/2.3.0/xmlbeans-2.3.0.jar to <https://builds.apache.org/job/Any23-trunk/ws/core/target/appassembler/lib/xmlbeans-2.3.0.jar>
[INFO] Installing /export/home/hudson/hudson-slave/maven-repositories/0/org/apache/geronimo/specs/geronimo-stax-api_1.0_spec/1.0.1/geronimo-stax-api_1.0_spec-1.0.1.jar to <https://builds.apache.org/job/Any23-trunk/ws/core/target/appassembler/lib/geronimo-stax-api_1.0_spec-1.0.1.jar>
[INFO] Installing /export/home/hudson/hudson-slave/maven-repositories/0/dom4j/dom4j/1.6.1/dom4j-1.6.1.jar to <https://builds.apache.org/job/Any23-trunk/ws/core/target/appassembler/lib/dom4j-1.6.1.jar>
[INFO] Installing /export/home/hudson/hudson-slave/maven-repositories/0/org/ccil/cowan/tagsoup/tagsoup/1.2/tagsoup-1.2.jar to <https://builds.apache.org/job/Any23-trunk/ws/core/target/appassembler/lib/tagsoup-1.2.jar>
[INFO] Installing /export/home/hudson/hudson-slave/maven-repositories/0/asm/asm/3.1/asm-3.1.jar to <https://builds.apache.org/job/Any23-trunk/ws/core/target/appassembler/lib/asm-3.1.jar>
[INFO] Installing /export/home/hudson/hudson-slave/maven-repositories/0/com/drewnoakes/metadata-extractor/2.4.0-beta-1/metadata-extractor-2.4.0-beta-1.jar to <https://builds.apache.org/job/Any23-trunk/ws/core/target/appassembler/lib/metadata-extractor-2.4.0-beta-1.jar>
[INFO] Installing /export/home/hudson/hudson-slave/maven-repositories/0/org/openrdf/sesame/sesame-model/2.6.1/sesame-model-2.6.1.jar to <https://builds.apache.org/job/Any23-trunk/ws/core/target/appassembler/lib/sesame-model-2.6.1.jar>
[INFO] Installing /export/home/hudson/hudson-slave/maven-repositories/0/org/openrdf/sesame/sesame-util/2.6.1/sesame-util-2.6.1.jar to <https://builds.apache.org/job/Any23-trunk/ws/core/target/appassembler/lib/sesame-util-2.6.1.jar>
[INFO] Installing /export/home/hudson/hudson-slave/maven-repositories/0/org/slf4j/slf4j-api/1.5.6/slf4j-api-1.5.6.jar to <https://builds.apache.org/job/Any23-trunk/ws/core/target/appassembler/lib/slf4j-api-1.5.6.jar>
[INFO] Installing /export/home/hudson/hudson-slave/maven-repositories/0/org/openrdf/sesame/sesame-rio-api/2.6.1/sesame-rio-api-2.6.1.jar to <https://builds.apache.org/job/Any23-trunk/ws/core/target/appassembler/lib/sesame-rio-api-2.6.1.jar>
[INFO] Installing /export/home/hudson/hudson-slave/maven-repositories/0/org/openrdf/sesame/sesame-rio-turtle/2.6.1/sesame-rio-turtle-2.6.1.jar to <https://builds.apache.org/job/Any23-trunk/ws/core/target/appassembler/lib/sesame-rio-turtle-2.6.1.jar>
[INFO] Installing /export/home/hudson/hudson-slave/maven-repositories/0/org/openrdf/sesame/sesame-rio-rdfxml/2.6.1/sesame-rio-rdfxml-2.6.1.jar to <https://builds.apache.org/job/Any23-trunk/ws/core/target/appassembler/lib/sesame-rio-rdfxml-2.6.1.jar>
[INFO] Installing /export/home/hudson/hudson-slave/maven-repositories/0/org/openrdf/sesame/sesame-rio-ntriples/2.6.1/sesame-rio-ntriples-2.6.1.jar to <https://builds.apache.org/job/Any23-trunk/ws/core/target/appassembler/lib/sesame-rio-ntriples-2.6.1.jar>
[INFO] Installing /export/home/hudson/hudson-slave/maven-repositories/0/org/openrdf/sesame/sesame-rio-trix/2.6.1/sesame-rio-trix-2.6.1.jar to <https://builds.apache.org/job/Any23-trunk/ws/core/target/appassembler/lib/sesame-rio-trix-2.6.1.jar>
[INFO] Installing /export/home/hudson/hudson-slave/maven-repositories/0/org/openrdf/sesame/sesame-repository-sail/2.6.1/sesame-repository-sail-2.6.1.jar to <https://builds.apache.org/job/Any23-trunk/ws/core/target/appassembler/lib/sesame-repository-sail-2.6.1.jar>
[INFO] Installing /export/home/hudson/hudson-slave/maven-repositories/0/org/openrdf/sesame/sesame-repository-api/2.6.1/sesame-repository-api-2.6.1.jar to <https://builds.apache.org/job/Any23-trunk/ws/core/target/appassembler/lib/sesame-repository-api-2.6.1.jar>
[INFO] Installing /export/home/hudson/hudson-slave/maven-repositories/0/org/openrdf/sesame/sesame-query/2.6.1/sesame-query-2.6.1.jar to <https://builds.apache.org/job/Any23-trunk/ws/core/target/appassembler/lib/sesame-query-2.6.1.jar>
[INFO] Installing /export/home/hudson/hudson-slave/maven-repositories/0/org/openrdf/sesame/sesame-sail-api/2.6.1/sesame-sail-api-2.6.1.jar to <https://builds.apache.org/job/Any23-trunk/ws/core/target/appassembler/lib/sesame-sail-api-2.6.1.jar>
[INFO] Installing /export/home/hudson/hudson-slave/maven-repositories/0/org/openrdf/sesame/sesame-queryalgebra-model/2.6.1/sesame-queryalgebra-model-2.6.1.jar to <https://builds.apache.org/job/Any23-trunk/ws/core/target/appassembler/lib/sesame-queryalgebra-model-2.6.1.jar>
[INFO] Installing /export/home/hudson/hudson-slave/maven-repositories/0/org/openrdf/sesame/sesame-queryparser-api/2.6.1/sesame-queryparser-api-2.6.1.jar to <https://builds.apache.org/job/Any23-trunk/ws/core/target/appassembler/lib/sesame-queryparser-api-2.6.1.jar>
[INFO] Installing /export/home/hudson/hudson-slave/maven-repositories/0/org/openrdf/sesame/sesame-sail-memory/2.6.1/sesame-sail-memory-2.6.1.jar to <https://builds.apache.org/job/Any23-trunk/ws/core/target/appassembler/lib/sesame-sail-memory-2.6.1.jar>
[INFO] Installing /export/home/hudson/hudson-slave/maven-repositories/0/org/openrdf/sesame/sesame-sail-inferencer/2.6.1/sesame-sail-inferencer-2.6.1.jar to <https://builds.apache.org/job/Any23-trunk/ws/core/target/appassembler/lib/sesame-sail-inferencer-2.6.1.jar>
[INFO] Installing /export/home/hudson/hudson-slave/maven-repositories/0/org/openrdf/sesame/sesame-queryparser-serql/2.6.1/sesame-queryparser-serql-2.6.1.jar to <https://builds.apache.org/job/Any23-trunk/ws/core/target/appassembler/lib/sesame-queryparser-serql-2.6.1.jar>
[INFO] Installing /export/home/hudson/hudson-slave/maven-repositories/0/org/openrdf/sesame/sesame-queryalgebra-evaluation/2.6.1/sesame-queryalgebra-evaluation-2.6.1.jar to <https://builds.apache.org/job/Any23-trunk/ws/core/target/appassembler/lib/sesame-queryalgebra-evaluation-2.6.1.jar>
[INFO] Installing /export/home/hudson/hudson-slave/maven-repositories/0/org/openrdf/sesame/sesame-repository-sparql/2.6.1/sesame-repository-sparql-2.6.1.jar to <https://builds.apache.org/job/Any23-trunk/ws/core/target/appassembler/lib/sesame-repository-sparql-2.6.1.jar>
[INFO] Installing /export/home/hudson/hudson-slave/maven-repositories/0/org/openrdf/sesame/sesame-http-client/2.6.1/sesame-http-client-2.6.1.jar to <https://builds.apache.org/job/Any23-trunk/ws/core/target/appassembler/lib/sesame-http-client-2.6.1.jar>
[INFO] Installing /export/home/hudson/hudson-slave/maven-repositories/0/org/openrdf/sesame/sesame-http-protocol/2.6.1/sesame-http-protocol-2.6.1.jar to <https://builds.apache.org/job/Any23-trunk/ws/core/target/appassembler/lib/sesame-http-protocol-2.6.1.jar>
[INFO] Installing /export/home/hudson/hudson-slave/maven-repositories/0/org/openrdf/sesame/sesame-queryresultio-api/2.6.1/sesame-queryresultio-api-2.6.1.jar to <https://builds.apache.org/job/Any23-trunk/ws/core/target/appassembler/lib/sesame-queryresultio-api-2.6.1.jar>
[INFO] Installing /export/home/hudson/hudson-slave/maven-repositories/0/org/openrdf/sesame/sesame-queryresultio-sparqlxml/2.6.1/sesame-queryresultio-sparqlxml-2.6.1.jar to <https://builds.apache.org/job/Any23-trunk/ws/core/target/appassembler/lib/sesame-queryresultio-sparqlxml-2.6.1.jar>
[INFO] Installing /export/home/hudson/hudson-slave/maven-repositories/0/info/aduna/commons/aduna-commons-xml/2.7.0/aduna-commons-xml-2.7.0.jar to <https://builds.apache.org/job/Any23-trunk/ws/core/target/appassembler/lib/aduna-commons-xml-2.7.0.jar>
[INFO] Installing /export/home/hudson/hudson-slave/maven-repositories/0/info/aduna/commons/aduna-commons-text/2.7.0/aduna-commons-text-2.7.0.jar to <https://builds.apache.org/job/Any23-trunk/ws/core/target/appassembler/lib/aduna-commons-text-2.7.0.jar>
[INFO] Installing /export/home/hudson/hudson-slave/maven-repositories/0/info/aduna/commons/aduna-commons-net/2.7.0/aduna-commons-net-2.7.0.jar to <https://builds.apache.org/job/Any23-trunk/ws/core/target/appassembler/lib/aduna-commons-net-2.7.0.jar>
[INFO] Installing /export/home/hudson/hudson-slave/maven-repositories/0/info/aduna/commons/aduna-commons-lang/2.9.0/aduna-commons-lang-2.9.0.jar to <https://builds.apache.org/job/Any23-trunk/ws/core/target/appassembler/lib/aduna-commons-lang-2.9.0.jar>
[INFO] Installing /export/home/hudson/hudson-slave/maven-repositories/0/info/aduna/commons/aduna-commons-iteration/2.10.0/aduna-commons-iteration-2.10.0.jar to <https://builds.apache.org/job/Any23-trunk/ws/core/target/appassembler/lib/aduna-commons-iteration-2.10.0.jar>
[INFO] Installing /export/home/hudson/hudson-slave/maven-repositories/0/info/aduna/commons/aduna-commons-concurrent/2.7.0/aduna-commons-concurrent-2.7.0.jar to <https://builds.apache.org/job/Any23-trunk/ws/core/target/appassembler/lib/aduna-commons-concurrent-2.7.0.jar>
[INFO] Installing /export/home/hudson/hudson-slave/maven-repositories/0/info/aduna/commons/aduna-commons-io/2.10.0/aduna-commons-io-2.10.0.jar to <https://builds.apache.org/job/Any23-trunk/ws/core/target/appassembler/lib/aduna-commons-io-2.10.0.jar>
[INFO] Installing /export/home/hudson/hudson-slave/maven-repositories/0/org/apache/commons/commons-csv/1.0-SNAPSHOT-rev1148315/commons-csv-1.0-SNAPSHOT-rev1148315.jar to <https://builds.apache.org/job/Any23-trunk/ws/core/target/appassembler/lib/commons-csv-1.0-SNAPSHOT-rev1148315.jar>
[INFO] Installing /export/home/hudson/hudson-slave/maven-repositories/0/org/slf4j/slf4j-jdk14/1.5.6/slf4j-jdk14-1.5.6.jar to <https://builds.apache.org/job/Any23-trunk/ws/core/target/appassembler/lib/slf4j-jdk14-1.5.6.jar>
[INFO] Installing /export/home/hudson/hudson-slave/maven-repositories/0/org/slf4j/jcl-over-slf4j/1.5.6/jcl-over-slf4j-1.5.6.jar to <https://builds.apache.org/job/Any23-trunk/ws/core/target/appassembler/lib/jcl-over-slf4j-1.5.6.jar>
[INFO] Installing <https://builds.apache.org/job/Any23-trunk/ws/core/target/apache-any23-core-0.7.1-incubating-SNAPSHOT.jar> to <https://builds.apache.org/job/Any23-trunk/ws/core/target/appassembler/lib/apache-any23-core-0.7.1-incubating-SNAPSHOT.jar>
[INFO] [assembly:single {execution: assembly}]
[INFO] Reading assembly descriptor: <https://builds.apache.org/job/Any23-trunk/ws/core/src/main/assembly/bin.xml>
[INFO] Building tar: <https://builds.apache.org/job/Any23-trunk/ws/core/target/apache-any23-core-0.7.1-incubating-SNAPSHOT.tar.gz>
[INFO] Building zip: <https://builds.apache.org/job/Any23-trunk/ws/core/target/apache-any23-core-0.7.1-incubating-SNAPSHOT.zip>
[INFO] [install:install {execution: default-install}]
[INFO] Installing <https://builds.apache.org/job/Any23-trunk/ws/core/target/apache-any23-core-0.7.1-incubating-SNAPSHOT.jar> to /export/home/hudson/hudson-slave/maven-repositories/0/org/apache/any23/apache-any23-core/0.7.1-incubating-SNAPSHOT/apache-any23-core-0.7.1-incubating-SNAPSHOT.jar
[INFO] Installing <https://builds.apache.org/job/Any23-trunk/ws/core/target/apache-any23-core-0.7.1-incubating-SNAPSHOT.tar.gz> to /export/home/hudson/hudson-slave/maven-repositories/0/org/apache/any23/apache-any23-core/0.7.1-incubating-SNAPSHOT/apache-any23-core-0.7.1-incubating-SNAPSHOT.tar.gz
[INFO] Installing <https://builds.apache.org/job/Any23-trunk/ws/core/target/apache-any23-core-0.7.1-incubating-SNAPSHOT.zip> to /export/home/hudson/hudson-slave/maven-repositories/0/org/apache/any23/apache-any23-core/0.7.1-incubating-SNAPSHOT/apache-any23-core-0.7.1-incubating-SNAPSHOT.zip
[JENKINS] Archiving <https://builds.apache.org/job/Any23-trunk/ws/core/pom.xml> to /home/hudson/hudson/jobs/Any23-trunk/modules/org.apache.any23$apache-any23-core/builds/2012-07-08_07-02-18/archive/org.apache.any23/apache-any23-core/0.7.1-incubating-SNAPSHOT/apache-any23-core-0.7.1-incubating-SNAPSHOT.pom
[JENKINS] Archiving <https://builds.apache.org/job/Any23-trunk/ws/core/target/apache-any23-core-0.7.1-incubating-SNAPSHOT.jar> to /home/hudson/hudson/jobs/Any23-trunk/modules/org.apache.any23$apache-any23-core/builds/2012-07-08_07-02-18/archive/org.apache.any23/apache-any23-core/0.7.1-incubating-SNAPSHOT/apache-any23-core-0.7.1-incubating-SNAPSHOT.jar
[JENKINS] Archiving <https://builds.apache.org/job/Any23-trunk/ws/core/target/apache-any23-core-0.7.1-incubating-SNAPSHOT.tar.gz> to /home/hudson/hudson/jobs/Any23-trunk/modules/org.apache.any23$apache-any23-core/builds/2012-07-08_07-02-18/archive/org.apache.any23/apache-any23-core/0.7.1-incubating-SNAPSHOT/apache-any23-core-0.7.1-incubating-SNAPSHOT.tar.gz
[JENKINS] Archiving <https://builds.apache.org/job/Any23-trunk/ws/core/target/apache-any23-core-0.7.1-incubating-SNAPSHOT.zip> to /home/hudson/hudson/jobs/Any23-trunk/modules/org.apache.any23$apache-any23-core/builds/2012-07-08_07-02-18/archive/org.apache.any23/apache-any23-core/0.7.1-incubating-SNAPSHOT/apache-any23-core-0.7.1-incubating-SNAPSHOT.zip
[INFO] ------------------------------------------------------------------------
[ERROR] BUILD ERROR
[INFO] ------------------------------------------------------------------------
[INFO] Internal error in the plugin manager executing goal 'org.apache.maven.plugins:maven-deploy-plugin:2.5:deploy': Unable to find the mojo 'deploy' (or one of its required components) in the plugin 'org.apache.maven.plugins:maven-deploy-plugin'
Component descriptor cannot be found in the component repository: org.apache.maven.artifact.repository.layout.ArtifactRepositoryLayoutflat.
[INFO] ------------------------------------------------------------------------
[INFO] For more information, run Maven with the -e switch
[INFO] ------------------------------------------------------------------------
[INFO] Total time: 28 minutes 27 seconds
[INFO] Finished at: Sun Jul 08 07:33:31 GMT+00:00 2012
[INFO] Final Memory: 59M/413M
[INFO] ------------------------------------------------------------------------
channel stopped