You are viewing a plain text version of this content. The canonical link for it is here.
Posted to builds@cassandra.apache.org by Apache Jenkins Server <je...@builds.apache.org> on 2021/09/22 21:06:02 UTC
Build complete: Cassandra-3.11 #251 [UNSTABLE]
ec1195bed76b17a150371810c78413e6cb9c7049
-------------------------------------------------------------------------------
Build Cassandra-3.11 #251 Still Unstable
URL: https://ci-cassandra.apache.org/job/Cassandra-3.11/251/
-------------------------------------------------------------------------------
Changes:
[Brandon Williams] Standalone scrub validates keys
-------------------------------------------------------------------------------
Failed Tests:
35 tests failed.
FAILED: dtest-novnode.scrub_test.TestScrubIndexes.test_scrub_collections_table
FAILED: dtest-offheap.scrub_test.TestScrubIndexes.test_scrub_collections_table
FAILED: dtest-upgrade.upgrade_tests.upgrade_through_versions_test.TestUpgrade_current_2_1_x_To_indev_3_11_x.test_parallel_upgrade
FAILED: dtest.scrub_test.TestScrubIndexes.test_scrub_collections_table
FAILED: dtest.thrift_test.TestMutations.test_update_expiring
FAILED: org.apache.cassandra.db.compaction.LongLeveledCompactionStrategyCQLTest.stressTestCompactionStrategyManager
FAILED: org.apache.cassandra.db.compaction.LongLeveledCompactionStrategyCQLTest.stressTestCompactionStrategyManager
FAILED: org.apache.cassandra.utils.memory.LongBufferPoolTest.testAllocate
FAILED: org.apache.cassandra.concurrent.LongSharedExecutorPoolTest.testPromptnessOfExecution
FAILED: org.apache.cassandra.concurrent.LongSharedExecutorPoolTest.testPromptnessOfExecution
FAILED: org.apache.cassandra.concurrent.LongSharedExecutorPoolTest.testPromptnessOfExecution
FAILED: org.apache.cassandra.concurrent.LongSharedExecutorPoolTest.testPromptnessOfExecution
FAILED: org.apache.cassandra.concurrent.LongSharedExecutorPoolTest.testPromptnessOfExecution
FAILED: org.apache.cassandra.distributed.upgrade.CompactStorage2to3UpgradeTest.testDropCompactWithClusteringAndValueColumnWithDeletesAndWrites
FAILED: org.apache.cassandra.distributed.upgrade.CompactStorage2to3UpgradeTest.testDropCompactWithClusteringAndValueColumnWithDeletesAndWrites
FAILED: dtest.offline_tools_test.TestOfflineTools.test_sstableverify
FAILED: dtest-novnode.offline_tools_test.TestOfflineTools.test_sstableverify
FAILED: dtest-offheap.offline_tools_test.TestOfflineTools.test_sstableverify
FAILED: dtest-offheap.counter_test.TestCounters.test_13691
FAILED: dtest-offheap.counter_test.TestCounters.test_13691
FAILED: dtest-upgrade.upgrade_internal_auth_test.TestAuthUpgrade.test_upgrade_legacy_table
FAILED: cqlshlib.python2.jdk8.no_cython.test.test_cqlsh_output.TestCqlshOutput.test_boolean_output
FAILED: cqlshlib.python2.jdk8.no_cython.test.test_cqlsh_output.TestCqlshOutput.test_columnless_key_output
FAILED: cqlshlib.python2.jdk8.no_cython.test.test_cqlsh_output.TestCqlshOutput.test_count_output
FAILED: cqlshlib.python2.jdk8.no_cython.test.test_cqlsh_output.TestCqlshOutput.test_null_output
FAILED: cqlshlib.python2.jdk8.no_cython.test.test_cqlsh_output.TestCqlshOutput.test_numeric_output
FAILED: cqlshlib.python2.jdk8.no_cython.test.test_cqlsh_output.TestCqlshOutput.test_static_cf_output
FAILED: cqlshlib.python2.jdk8.no_cython.test.test_cqlsh_output.TestCqlshOutput.test_string_output_ascii
FAILED: cqlshlib.python2.jdk8.no_cython.test.test_cqlsh_output.TestCqlshOutput.test_boolean_output
FAILED: cqlshlib.python2.jdk8.no_cython.test.test_cqlsh_output.TestCqlshOutput.test_columnless_key_output
FAILED: cqlshlib.python2.jdk8.no_cython.test.test_cqlsh_output.TestCqlshOutput.test_count_output
FAILED: cqlshlib.python2.jdk8.no_cython.test.test_cqlsh_output.TestCqlshOutput.test_null_output
FAILED: cqlshlib.python2.jdk8.no_cython.test.test_cqlsh_output.TestCqlshOutput.test_numeric_output
FAILED: cqlshlib.python2.jdk8.no_cython.test.test_cqlsh_output.TestCqlshOutput.test_static_cf_output
FAILED: cqlshlib.python2.jdk8.no_cython.test.test_cqlsh_output.TestCqlshOutput.test_string_output_ascii
-------------------------------------------------------------------------------
For complete test report and logs see https://nightlies.apache.org/cassandra/Cassandra-3.11/251/