You are viewing a plain text version of this content. The canonical link for it is here.
Posted to dev@lucene.apache.org by Apache Jenkins Server <je...@builds.apache.org> on 2012/01/27 14:42:06 UTC
[JENKINS] Lucene-Solr-tests-only-trunk - Build # 12276 - Still
Failing
Build: https://builds.apache.org/job/Lucene-Solr-tests-only-trunk/12276/
6 tests failed.
FAILED: junit.framework.TestSuite.org.apache.solr.cloud.OverseerTest
Error Message:
ERROR: SolrIndexSearcher opens=0 closes=1
Stack Trace:
junit.framework.AssertionFailedError: ERROR: SolrIndexSearcher opens=0 closes=1
at org.apache.solr.SolrTestCaseJ4.endTrackingSearchers(SolrTestCaseJ4.java:151)
at org.apache.solr.SolrTestCaseJ4.afterClassSolrTestCase(SolrTestCaseJ4.java:76)
FAILED: junit.framework.TestSuite.org.apache.solr.cloud.RecoveryZkTest
Error Message:
ERROR: SolrIndexSearcher opens=13 closes=12
Stack Trace:
junit.framework.AssertionFailedError: ERROR: SolrIndexSearcher opens=13 closes=12
at org.apache.solr.SolrTestCaseJ4.endTrackingSearchers(SolrTestCaseJ4.java:151)
at org.apache.solr.SolrTestCaseJ4.afterClassSolrTestCase(SolrTestCaseJ4.java:76)
FAILED: junit.framework.TestSuite.org.apache.solr.search.TestFiltering
Error Message:
ERROR: SolrIndexSearcher opens=47 closes=48
Stack Trace:
junit.framework.AssertionFailedError: ERROR: SolrIndexSearcher opens=47 closes=48
at org.apache.solr.SolrTestCaseJ4.endTrackingSearchers(SolrTestCaseJ4.java:151)
at org.apache.solr.SolrTestCaseJ4.afterClassSolrTestCase(SolrTestCaseJ4.java:76)
FAILED: junit.framework.TestSuite.org.apache.solr.update.AutoCommitTest
Error Message:
ERROR: SolrIndexSearcher opens=10 closes=14
Stack Trace:
junit.framework.AssertionFailedError: ERROR: SolrIndexSearcher opens=10 closes=14
at org.apache.solr.SolrTestCaseJ4.endTrackingSearchers(SolrTestCaseJ4.java:151)
at org.apache.solr.util.AbstractSolrTestCase.afterClassAbstractSolrTestCase(AbstractSolrTestCase.java:104)
FAILED: junit.framework.TestSuite.org.apache.solr.cloud.ChaosMonkeySafeLeaderTest
Error Message:
ERROR: SolrIndexSearcher opens=126 closes=115
Stack Trace:
junit.framework.AssertionFailedError: ERROR: SolrIndexSearcher opens=126 closes=115
at org.apache.solr.SolrTestCaseJ4.endTrackingSearchers(SolrTestCaseJ4.java:151)
at org.apache.solr.SolrTestCaseJ4.afterClassSolrTestCase(SolrTestCaseJ4.java:76)
FAILED: junit.framework.TestSuite.org.apache.solr.cloud.FullSolrCloudDistribCmdsTest
Error Message:
ERROR: SolrIndexSearcher opens=66 closes=69
Stack Trace:
junit.framework.AssertionFailedError: ERROR: SolrIndexSearcher opens=66 closes=69
at org.apache.solr.SolrTestCaseJ4.endTrackingSearchers(SolrTestCaseJ4.java:151)
at org.apache.solr.SolrTestCaseJ4.afterClassSolrTestCase(SolrTestCaseJ4.java:76)
Build Log (for compile errors):
[...truncated 62949 lines...]
---------------------------------------------------------------------
To unsubscribe, e-mail: dev-unsubscribe@lucene.apache.org
For additional commands, e-mail: dev-help@lucene.apache.org
[JENKINS] Lucene-Solr-tests-only-trunk - Build # 12285 - Still
Failing
Posted by Apache Jenkins Server <je...@builds.apache.org>.
Build: https://builds.apache.org/job/Lucene-Solr-tests-only-trunk/12285/
4 tests failed.
FAILED: junit.framework.TestSuite.org.apache.solr.cloud.OverseerTest
Error Message:
ERROR: SolrIndexSearcher opens=0 closes=1
Stack Trace:
junit.framework.AssertionFailedError: ERROR: SolrIndexSearcher opens=0 closes=1
at org.apache.solr.SolrTestCaseJ4.endTrackingSearchers(SolrTestCaseJ4.java:152)
at org.apache.solr.SolrTestCaseJ4.afterClassSolrTestCase(SolrTestCaseJ4.java:76)
FAILED: junit.framework.TestSuite.org.apache.solr.handler.component.DistributedTermsComponentTest
Error Message:
ERROR: SolrIndexSearcher opens=18 closes=19
Stack Trace:
junit.framework.AssertionFailedError: ERROR: SolrIndexSearcher opens=18 closes=19
at org.apache.solr.SolrTestCaseJ4.endTrackingSearchers(SolrTestCaseJ4.java:152)
at org.apache.solr.SolrTestCaseJ4.afterClassSolrTestCase(SolrTestCaseJ4.java:76)
FAILED: junit.framework.TestSuite.org.apache.solr.cloud.RecoveryZkTest
Error Message:
ERROR: SolrIndexSearcher opens=13 closes=12
Stack Trace:
junit.framework.AssertionFailedError: ERROR: SolrIndexSearcher opens=13 closes=12
at org.apache.solr.SolrTestCaseJ4.endTrackingSearchers(SolrTestCaseJ4.java:152)
at org.apache.solr.SolrTestCaseJ4.afterClassSolrTestCase(SolrTestCaseJ4.java:76)
FAILED: junit.framework.TestSuite.org.apache.solr.cloud.FullSolrCloudDistribCmdsTest
Error Message:
ERROR: SolrIndexSearcher opens=66 closes=65
Stack Trace:
junit.framework.AssertionFailedError: ERROR: SolrIndexSearcher opens=66 closes=65
at org.apache.solr.SolrTestCaseJ4.endTrackingSearchers(SolrTestCaseJ4.java:152)
at org.apache.solr.SolrTestCaseJ4.afterClassSolrTestCase(SolrTestCaseJ4.java:76)
Build Log (for compile errors):
[...truncated 7950 lines...]
---------------------------------------------------------------------
To unsubscribe, e-mail: dev-unsubscribe@lucene.apache.org
For additional commands, e-mail: dev-help@lucene.apache.org
[JENKINS] Lucene-Solr-tests-only-trunk - Build # 12284 - Still
Failing
Posted by Apache Jenkins Server <je...@builds.apache.org>.
Build: https://builds.apache.org/job/Lucene-Solr-tests-only-trunk/12284/
4 tests failed.
REGRESSION: org.apache.solr.cloud.LeaderElectionTest.testStressElection
Error Message:
seq is -1 and we may have a zombie leader
Stack Trace:
junit.framework.AssertionFailedError: seq is -1 and we may have a zombie leader
at org.apache.lucene.util.LuceneTestCaseRunner.runChild(LuceneTestCaseRunner.java:165)
at org.apache.lucene.util.LuceneTestCaseRunner.runChild(LuceneTestCaseRunner.java:57)
at org.apache.solr.cloud.LeaderElectionTest.testStressElection(LeaderElectionTest.java:388)
at org.apache.lucene.util.LuceneTestCase$3$1.evaluate(LuceneTestCase.java:529)
FAILED: junit.framework.TestSuite.org.apache.solr.cloud.LeaderElectionTest
Error Message:
ERROR: SolrIndexSearcher opens=0 closes=1
Stack Trace:
junit.framework.AssertionFailedError: ERROR: SolrIndexSearcher opens=0 closes=1
at org.apache.solr.SolrTestCaseJ4.endTrackingSearchers(SolrTestCaseJ4.java:152)
at org.apache.solr.SolrTestCaseJ4.afterClassSolrTestCase(SolrTestCaseJ4.java:76)
FAILED: junit.framework.TestSuite.org.apache.solr.cloud.RecoveryZkTest
Error Message:
ERROR: SolrIndexSearcher opens=13 closes=12
Stack Trace:
junit.framework.AssertionFailedError: ERROR: SolrIndexSearcher opens=13 closes=12
at org.apache.solr.SolrTestCaseJ4.endTrackingSearchers(SolrTestCaseJ4.java:152)
at org.apache.solr.SolrTestCaseJ4.afterClassSolrTestCase(SolrTestCaseJ4.java:76)
FAILED: junit.framework.TestSuite.org.apache.solr.cloud.FullSolrCloudDistribCmdsTest
Error Message:
ERROR: SolrIndexSearcher opens=66 closes=65
Stack Trace:
junit.framework.AssertionFailedError: ERROR: SolrIndexSearcher opens=66 closes=65
at org.apache.solr.SolrTestCaseJ4.endTrackingSearchers(SolrTestCaseJ4.java:152)
at org.apache.solr.SolrTestCaseJ4.afterClassSolrTestCase(SolrTestCaseJ4.java:76)
Build Log (for compile errors):
[...truncated 8221 lines...]
---------------------------------------------------------------------
To unsubscribe, e-mail: dev-unsubscribe@lucene.apache.org
For additional commands, e-mail: dev-help@lucene.apache.org
[JENKINS] Lucene-Solr-tests-only-trunk - Build # 12283 - Still
Failing
Posted by Apache Jenkins Server <je...@builds.apache.org>.
Build: https://builds.apache.org/job/Lucene-Solr-tests-only-trunk/12283/
2 tests failed.
FAILED: junit.framework.TestSuite.org.apache.solr.handler.component.StatsComponentTest
Error Message:
ERROR: SolrIndexSearcher opens=43 closes=44
Stack Trace:
junit.framework.AssertionFailedError: ERROR: SolrIndexSearcher opens=43 closes=44
at org.apache.solr.SolrTestCaseJ4.endTrackingSearchers(SolrTestCaseJ4.java:152)
at org.apache.solr.util.AbstractSolrTestCase.afterClassAbstractSolrTestCase(AbstractSolrTestCase.java:104)
FAILED: junit.framework.TestSuite.org.apache.solr.cloud.FullSolrCloudDistribCmdsTest
Error Message:
ERROR: SolrIndexSearcher opens=66 closes=65
Stack Trace:
junit.framework.AssertionFailedError: ERROR: SolrIndexSearcher opens=66 closes=65
at org.apache.solr.SolrTestCaseJ4.endTrackingSearchers(SolrTestCaseJ4.java:152)
at org.apache.solr.SolrTestCaseJ4.afterClassSolrTestCase(SolrTestCaseJ4.java:76)
Build Log (for compile errors):
[...truncated 7849 lines...]
---------------------------------------------------------------------
To unsubscribe, e-mail: dev-unsubscribe@lucene.apache.org
For additional commands, e-mail: dev-help@lucene.apache.org
[JENKINS] Lucene-Solr-tests-only-trunk - Build # 12282 - Still
Failing
Posted by Apache Jenkins Server <je...@builds.apache.org>.
Build: https://builds.apache.org/job/Lucene-Solr-tests-only-trunk/12282/
2 tests failed.
FAILED: junit.framework.TestSuite.org.apache.solr.cloud.FullSolrCloudDistribCmdsTest
Error Message:
ERROR: SolrIndexSearcher opens=66 closes=65
Stack Trace:
junit.framework.AssertionFailedError: ERROR: SolrIndexSearcher opens=66 closes=65
at org.apache.solr.SolrTestCaseJ4.endTrackingSearchers(SolrTestCaseJ4.java:152)
at org.apache.solr.SolrTestCaseJ4.afterClassSolrTestCase(SolrTestCaseJ4.java:76)
FAILED: junit.framework.TestSuite.org.apache.solr.cloud.LeaderElectionTest
Error Message:
ERROR: SolrIndexSearcher opens=0 closes=1
Stack Trace:
junit.framework.AssertionFailedError: ERROR: SolrIndexSearcher opens=0 closes=1
at org.apache.solr.SolrTestCaseJ4.endTrackingSearchers(SolrTestCaseJ4.java:152)
at org.apache.solr.SolrTestCaseJ4.afterClassSolrTestCase(SolrTestCaseJ4.java:76)
Build Log (for compile errors):
[...truncated 7836 lines...]
---------------------------------------------------------------------
To unsubscribe, e-mail: dev-unsubscribe@lucene.apache.org
For additional commands, e-mail: dev-help@lucene.apache.org
Re: [JENKINS] Lucene-Solr-tests-only-trunk - Build # 12281 - Still Failing
Posted by Mark Miller <ma...@gmail.com>.
Just fixed this javadoc fail - ByteUtils had a @Returns instead of @Return.
On Jan 27, 2012, at 3:47 PM, Apache Jenkins Server wrote:
> Build: https://builds.apache.org/job/Lucene-Solr-tests-only-trunk/12281/
>
> All tests passed
>
> Build Log (for compile errors):
> [...truncated 14560 lines...]
>
>
>
> ---------------------------------------------------------------------
> To unsubscribe, e-mail: dev-unsubscribe@lucene.apache.org
> For additional commands, e-mail: dev-help@lucene.apache.org
>
- Mark Miller
lucidimagination.com
---------------------------------------------------------------------
To unsubscribe, e-mail: dev-unsubscribe@lucene.apache.org
For additional commands, e-mail: dev-help@lucene.apache.org
[JENKINS] Lucene-Solr-tests-only-trunk - Build # 12281 - Still
Failing
Posted by Apache Jenkins Server <je...@builds.apache.org>.
Build: https://builds.apache.org/job/Lucene-Solr-tests-only-trunk/12281/
All tests passed
Build Log (for compile errors):
[...truncated 14560 lines...]
---------------------------------------------------------------------
To unsubscribe, e-mail: dev-unsubscribe@lucene.apache.org
For additional commands, e-mail: dev-help@lucene.apache.org
[JENKINS] Lucene-Solr-tests-only-trunk - Build # 12280 - Still
Failing
Posted by Apache Jenkins Server <je...@builds.apache.org>.
Build: https://builds.apache.org/job/Lucene-Solr-tests-only-trunk/12280/
4 tests failed.
FAILED: junit.framework.TestSuite.org.apache.solr.cloud.RecoveryZkTest
Error Message:
ERROR: SolrIndexSearcher opens=13 closes=12
Stack Trace:
junit.framework.AssertionFailedError: ERROR: SolrIndexSearcher opens=13 closes=12
at org.apache.solr.SolrTestCaseJ4.endTrackingSearchers(SolrTestCaseJ4.java:157)
at org.apache.solr.SolrTestCaseJ4.afterClassSolrTestCase(SolrTestCaseJ4.java:76)
FAILED: junit.framework.TestSuite.org.apache.solr.search.TestFiltering
Error Message:
ERROR: SolrIndexSearcher opens=64 closes=65
Stack Trace:
junit.framework.AssertionFailedError: ERROR: SolrIndexSearcher opens=64 closes=65
at org.apache.solr.SolrTestCaseJ4.endTrackingSearchers(SolrTestCaseJ4.java:157)
at org.apache.solr.SolrTestCaseJ4.afterClassSolrTestCase(SolrTestCaseJ4.java:76)
FAILED: junit.framework.TestSuite.org.apache.solr.update.AutoCommitTest
Error Message:
ERROR: SolrIndexSearcher opens=10 closes=12
Stack Trace:
junit.framework.AssertionFailedError: ERROR: SolrIndexSearcher opens=10 closes=12
at org.apache.solr.SolrTestCaseJ4.endTrackingSearchers(SolrTestCaseJ4.java:157)
at org.apache.solr.util.AbstractSolrTestCase.afterClassAbstractSolrTestCase(AbstractSolrTestCase.java:104)
FAILED: junit.framework.TestSuite.org.apache.solr.cloud.ChaosMonkeySafeLeaderTest
Error Message:
ERROR: SolrIndexSearcher opens=137 closes=134
Stack Trace:
junit.framework.AssertionFailedError: ERROR: SolrIndexSearcher opens=137 closes=134
at org.apache.solr.SolrTestCaseJ4.endTrackingSearchers(SolrTestCaseJ4.java:157)
at org.apache.solr.SolrTestCaseJ4.afterClassSolrTestCase(SolrTestCaseJ4.java:76)
Build Log (for compile errors):
[...truncated 8078 lines...]
---------------------------------------------------------------------
To unsubscribe, e-mail: dev-unsubscribe@lucene.apache.org
For additional commands, e-mail: dev-help@lucene.apache.org
[JENKINS] Lucene-Solr-tests-only-trunk - Build # 12279 - Still
Failing
Posted by Apache Jenkins Server <je...@builds.apache.org>.
Build: https://builds.apache.org/job/Lucene-Solr-tests-only-trunk/12279/
2 tests failed.
FAILED: junit.framework.TestSuite.org.apache.solr.search.TestRealTimeGet
Error Message:
ERROR: SolrIndexSearcher opens=1310 closes=1312
Stack Trace:
junit.framework.AssertionFailedError: ERROR: SolrIndexSearcher opens=1310 closes=1312
at org.apache.solr.SolrTestCaseJ4.endTrackingSearchers(SolrTestCaseJ4.java:157)
at org.apache.solr.SolrTestCaseJ4.afterClassSolrTestCase(SolrTestCaseJ4.java:76)
FAILED: junit.framework.TestSuite.org.apache.solr.cloud.ChaosMonkeySafeLeaderTest
Error Message:
ERROR: SolrIndexSearcher opens=174 closes=164
Stack Trace:
junit.framework.AssertionFailedError: ERROR: SolrIndexSearcher opens=174 closes=164
at org.apache.solr.SolrTestCaseJ4.endTrackingSearchers(SolrTestCaseJ4.java:157)
at org.apache.solr.SolrTestCaseJ4.afterClassSolrTestCase(SolrTestCaseJ4.java:76)
Build Log (for compile errors):
[...truncated 51033 lines...]
---------------------------------------------------------------------
To unsubscribe, e-mail: dev-unsubscribe@lucene.apache.org
For additional commands, e-mail: dev-help@lucene.apache.org
[JENKINS] Lucene-Solr-tests-only-trunk - Build # 12278 - Still
Failing
Posted by Apache Jenkins Server <je...@builds.apache.org>.
Build: https://builds.apache.org/job/Lucene-Solr-tests-only-trunk/12278/
3 tests failed.
FAILED: junit.framework.TestSuite.org.apache.solr.cloud.LeaderElectionTest
Error Message:
ERROR: SolrIndexSearcher opens=0 closes=7
Stack Trace:
junit.framework.AssertionFailedError: ERROR: SolrIndexSearcher opens=0 closes=7
at org.apache.solr.SolrTestCaseJ4.endTrackingSearchers(SolrTestCaseJ4.java:151)
at org.apache.solr.SolrTestCaseJ4.afterClassSolrTestCase(SolrTestCaseJ4.java:76)
FAILED: junit.framework.TestSuite.org.apache.solr.cloud.ChaosMonkeySafeLeaderTest
Error Message:
ERROR: SolrIndexSearcher opens=130 closes=122
Stack Trace:
junit.framework.AssertionFailedError: ERROR: SolrIndexSearcher opens=130 closes=122
at org.apache.solr.SolrTestCaseJ4.endTrackingSearchers(SolrTestCaseJ4.java:151)
at org.apache.solr.SolrTestCaseJ4.afterClassSolrTestCase(SolrTestCaseJ4.java:76)
FAILED: junit.framework.TestSuite.org.apache.solr.cloud.FullSolrCloudDistribCmdsTest
Error Message:
ERROR: SolrIndexSearcher opens=66 closes=65
Stack Trace:
junit.framework.AssertionFailedError: ERROR: SolrIndexSearcher opens=66 closes=65
at org.apache.solr.SolrTestCaseJ4.endTrackingSearchers(SolrTestCaseJ4.java:151)
at org.apache.solr.SolrTestCaseJ4.afterClassSolrTestCase(SolrTestCaseJ4.java:76)
Build Log (for compile errors):
[...truncated 45133 lines...]
---------------------------------------------------------------------
To unsubscribe, e-mail: dev-unsubscribe@lucene.apache.org
For additional commands, e-mail: dev-help@lucene.apache.org
[JENKINS] Lucene-Solr-tests-only-trunk - Build # 12277 - Still
Failing
Posted by Apache Jenkins Server <je...@builds.apache.org>.
Build: https://builds.apache.org/job/Lucene-Solr-tests-only-trunk/12277/
7 tests failed.
FAILED: junit.framework.TestSuite.org.apache.solr.cloud.LeaderElectionTest
Error Message:
ERROR: SolrIndexSearcher opens=0 closes=1
Stack Trace:
junit.framework.AssertionFailedError: ERROR: SolrIndexSearcher opens=0 closes=1
at org.apache.solr.SolrTestCaseJ4.endTrackingSearchers(SolrTestCaseJ4.java:151)
at org.apache.solr.SolrTestCaseJ4.afterClassSolrTestCase(SolrTestCaseJ4.java:76)
REGRESSION: org.apache.solr.cloud.ZkControllerTest.testUploadToCloud
Error Message:
KeeperErrorCode = NodeExists for /configs/config1/solrconfig-xinclude.xml
Stack Trace:
org.apache.zookeeper.KeeperException$NodeExistsException: KeeperErrorCode = NodeExists for /configs/config1/solrconfig-xinclude.xml
at org.apache.zookeeper.KeeperException.create(KeeperException.java:110)
at org.apache.zookeeper.KeeperException.create(KeeperException.java:42)
at org.apache.zookeeper.ZooKeeper.create(ZooKeeper.java:643)
at org.apache.solr.common.cloud.SolrZkClient$10.execute(SolrZkClient.java:487)
at org.apache.solr.common.cloud.ZkCmdExecutor.retryOperation(ZkCmdExecutor.java:65)
at org.apache.solr.common.cloud.SolrZkClient.makePath(SolrZkClient.java:484)
at org.apache.solr.common.cloud.SolrZkClient.makePath(SolrZkClient.java:370)
at org.apache.solr.cloud.ZkController.uploadToZK(ZkController.java:896)
at org.apache.solr.cloud.ZkController.uploadToZK(ZkController.java:689)
at org.apache.solr.cloud.ZkControllerTest.testUploadToCloud(ZkControllerTest.java:121)
at org.apache.lucene.util.LuceneTestCase$3$1.evaluate(LuceneTestCase.java:529)
at org.apache.lucene.util.LuceneTestCaseRunner.runChild(LuceneTestCaseRunner.java:165)
at org.apache.lucene.util.LuceneTestCaseRunner.runChild(LuceneTestCaseRunner.java:57)
FAILED: junit.framework.TestSuite.org.apache.solr.cloud.RecoveryZkTest
Error Message:
ERROR: SolrIndexSearcher opens=13 closes=12
Stack Trace:
junit.framework.AssertionFailedError: ERROR: SolrIndexSearcher opens=13 closes=12
at org.apache.solr.SolrTestCaseJ4.endTrackingSearchers(SolrTestCaseJ4.java:151)
at org.apache.solr.SolrTestCaseJ4.afterClassSolrTestCase(SolrTestCaseJ4.java:76)
FAILED: junit.framework.TestSuite.org.apache.solr.search.TestFiltering
Error Message:
ERROR: SolrIndexSearcher opens=61 closes=62
Stack Trace:
junit.framework.AssertionFailedError: ERROR: SolrIndexSearcher opens=61 closes=62
at org.apache.solr.SolrTestCaseJ4.endTrackingSearchers(SolrTestCaseJ4.java:151)
at org.apache.solr.SolrTestCaseJ4.afterClassSolrTestCase(SolrTestCaseJ4.java:76)
FAILED: junit.framework.TestSuite.org.apache.solr.update.AutoCommitTest
Error Message:
ERROR: SolrIndexSearcher opens=10 closes=13
Stack Trace:
junit.framework.AssertionFailedError: ERROR: SolrIndexSearcher opens=10 closes=13
at org.apache.solr.SolrTestCaseJ4.endTrackingSearchers(SolrTestCaseJ4.java:151)
at org.apache.solr.util.AbstractSolrTestCase.afterClassAbstractSolrTestCase(AbstractSolrTestCase.java:104)
FAILED: junit.framework.TestSuite.org.apache.solr.cloud.ChaosMonkeySafeLeaderTest
Error Message:
ERROR: SolrIndexSearcher opens=165 closes=157
Stack Trace:
junit.framework.AssertionFailedError: ERROR: SolrIndexSearcher opens=165 closes=157
at org.apache.solr.SolrTestCaseJ4.endTrackingSearchers(SolrTestCaseJ4.java:151)
at org.apache.solr.SolrTestCaseJ4.afterClassSolrTestCase(SolrTestCaseJ4.java:76)
FAILED: junit.framework.TestSuite.org.apache.solr.cloud.FullSolrCloudDistribCmdsTest
Error Message:
ERROR: SolrIndexSearcher opens=66 closes=68
Stack Trace:
junit.framework.AssertionFailedError: ERROR: SolrIndexSearcher opens=66 closes=68
at org.apache.solr.SolrTestCaseJ4.endTrackingSearchers(SolrTestCaseJ4.java:151)
at org.apache.solr.SolrTestCaseJ4.afterClassSolrTestCase(SolrTestCaseJ4.java:76)
Build Log (for compile errors):
[...truncated 58466 lines...]
---------------------------------------------------------------------
To unsubscribe, e-mail: dev-unsubscribe@lucene.apache.org
For additional commands, e-mail: dev-help@lucene.apache.org