You are viewing a plain text version of this content. The canonical link for it is here.
Posted to builds@cassandra.apache.org by Apache Jenkins Server <je...@builds.apache.org> on 2021/09/10 12:00:13 UTC
Build complete: Cassandra-trunk #710 [UNSTABLE]
b015cbdff6882e20fbc76dcbaf30be982e6a0195
-------------------------------------------------------------------------------
Build Cassandra-trunk #710 Still Unstable
URL: https://ci-cassandra.apache.org/job/Cassandra-trunk/710/
-------------------------------------------------------------------------------
Changes:
[Berenguer Blasi] Cassandra fails to process OperationExecutionException which causes
-------------------------------------------------------------------------------
Failed Tests:
10 tests failed.
FAILED: org.apache.cassandra.distributed.upgrade.CompactStorageUpgradeTest.compactStorageUpgradeTest
FAILED: org.apache.cassandra.distributed.upgrade.CompactStorageUpgradeTest.compactStorageHiddenColumnTest
FAILED: org.apache.cassandra.distributed.upgrade.CompactStorageUpgradeTest.compactStorageUpgradeTest
FAILED: org.apache.cassandra.distributed.upgrade.MixedModeAvailabilityV22Test.testAvailabilityV22ToV30
FAILED: org.apache.cassandra.distributed.test.ClientTombstoneWarningTest.failThresholdSinglePartition
FAILED: org.apache.cassandra.distributed.test.ClientTombstoneWarningTest.failThresholdScan
FAILED: org.apache.cassandra.distributed.test.ClientTombstoneWarningTest.failThresholdSinglePartition
FAILED: org.apache.cassandra.distributed.upgrade.MixedModeReadTest.mixedModeReadColumnSubsetDigestCheck
FAILED: org.apache.cassandra.distributed.upgrade.MixedModeReadTest.mixedModeReadColumnSubsetDigestCheck
FAILED: org.apache.cassandra.distributed.upgrade.MixedModeReadTest.mixedModeReadColumnSubsetDigestCheck
-------------------------------------------------------------------------------
For complete test report and logs see https://nightlies.apache.org/cassandra/Cassandra-trunk/710/