You are viewing a plain text version of this content. The canonical link for it is here.
Posted to dev@poi.apache.org by Apache Jenkins Server <je...@builds.apache.org> on 2019/01/22 10:44:11 UTC
Build failed in Jenkins: POI-DSL-1.13 #2
See <https://builds.apache.org/job/POI-DSL-1.13/2/display/redirect?page=changes>
Changes:
[centic] Jenkins: Try to disable coverage for JDK 13 for now as it seems to cause issues
------------------------------------------
[...truncated 202.88 KB...]
[junit] Reading openxml4j/OPCCompliance_CoreProperties_AlternateTimezones.docx with OPCFileHandler
[junit] Reading openxml4j/OPCCompliance_CoreProperties_DCTermsNamespaceLimitedUseFAIL.docx with XWPFFileHandler
[junit] Reading openxml4j/OPCCompliance_CoreProperties_DCTermsNamespaceLimitedUseFAIL.docx with OPCFileHandler
[junit] Reading openxml4j/OPCCompliance_CoreProperties_DoNotUseCompatibilityMarkupFAIL.docx with XWPFFileHandler
[junit] Reading openxml4j/OPCCompliance_CoreProperties_DoNotUseCompatibilityMarkupFAIL.docx with OPCFileHandler
[junit] Reading openxml4j/OPCCompliance_CoreProperties_LimitedXSITypeAttribute_NotPresentFAIL.docx with XWPFFileHandler
[junit] Reading openxml4j/OPCCompliance_CoreProperties_LimitedXSITypeAttribute_NotPresentFAIL.docx with OPCFileHandler
[junit] Reading openxml4j/OPCCompliance_CoreProperties_LimitedXSITypeAttribute_PresentWithUnauthorizedValueFAIL.docx with XWPFFileHandler
[junit] Reading openxml4j/OPCCompliance_CoreProperties_LimitedXSITypeAttribute_PresentWithUnauthorizedValueFAIL.docx with OPCFileHandler
[junit] Reading openxml4j/OPCCompliance_CoreProperties_OnlyOneCorePropertiesPart.docx with XWPFFileHandler
[junit] Reading openxml4j/OPCCompliance_CoreProperties_OnlyOneCorePropertiesPart.docx with OPCFileHandler
[junit] Reading openxml4j/OPCCompliance_CoreProperties_OnlyOneCorePropertiesPartFAIL.docx with XWPFFileHandler
[junit] Reading openxml4j/OPCCompliance_CoreProperties_OnlyOneCorePropertiesPartFAIL.docx with OPCFileHandler
[junit] Reading openxml4j/OPCCompliance_CoreProperties_SUCCESS.docx with XWPFFileHandler
[junit] Reading openxml4j/OPCCompliance_CoreProperties_SUCCESS.docx with OPCFileHandler
[junit] Reading openxml4j/OPCCompliance_CoreProperties_UnauthorizedXMLLangAttributeFAIL.docx with XWPFFileHandler
[junit] Reading openxml4j/OPCCompliance_CoreProperties_UnauthorizedXMLLangAttributeFAIL.docx with OPCFileHandler
[junit] Reading openxml4j/OPCCompliance_DerivedPartNameFAIL.docx with XWPFFileHandler
[junit] Reading openxml4j/OPCCompliance_DerivedPartNameFAIL.docx with OPCFileHandler
[junit] Reading openxml4j/OPCCompliance_NoCoreProperties.xlsx with XSSFFileHandler
[junit] Reading openxml4j/OPCCompliance_NoCoreProperties.xlsx with OPCFileHandler
[junit] Reading openxml4j/PackageRelsHasEntities.ooxml with OPCFileHandler
[junit] Reading openxml4j/TestCreatePackageOUTPUT.docx with XWPFFileHandler
[junit] Reading openxml4j/TestCreatePackageOUTPUT.docx with OPCFileHandler
[junit] Reading openxml4j/TestOpenPackageINPUT.docx with XWPFFileHandler
[junit] Reading openxml4j/TestOpenPackageINPUT.docx with OPCFileHandler
[junit] Reading openxml4j/TestOpenPackageOUTPUT.docx with XWPFFileHandler
[junit] Reading openxml4j/TestOpenPackageOUTPUT.docx with OPCFileHandler
[junit] Reading openxml4j/TestPackageCommon.docx with XWPFFileHandler
[junit] Reading openxml4j/TestPackageCommon.docx with OPCFileHandler
[junit] Reading openxml4j/TestPackageCoreProperiesGetters.docx with XWPFFileHandler
[junit] Reading openxml4j/TestPackageCoreProperiesGetters.docx with OPCFileHandler
[junit] Reading openxml4j/TestPackageCoreProperiesSetters.docx with XWPFFileHandler
[junit] Reading openxml4j/TestPackageCoreProperiesSetters.docx with OPCFileHandler
[junit] Reading openxml4j/TestPackageThumbnail.docx with XWPFFileHandler
[junit] Reading openxml4j/TestPackageThumbnail.docx with OPCFileHandler
[junit] Reading openxml4j/at.pzp.www_uploads_media_PP_Scheinecker-jdk6error.pptx with XSLFFileHandler
[junit] Reading openxml4j/at.pzp.www_uploads_media_PP_Scheinecker-jdk6error.pptx with OPCFileHandler
[junit] Reading openxml4j/bug-60626.vml with NullFileHandler
[junit] Reading openxml4j/dcterms_bug_56479.zip with OPCFileHandler
[junit] Reading openxml4j/invalid.xlsx with XSSFFileHandler
[junit] Reading openxml4j/invalid.xlsx with OPCFileHandler
[junit] Reading openxml4j/sample.docx with XWPFFileHandler
[junit] Reading openxml4j/sample.docx with OPCFileHandler
[junit] Reading openxml4j/sample.xlsx with XSSFFileHandler
[junit] Reading openxml4j/sample.xlsx with OPCFileHandler
[junit] Reading openxml4j/thumbnail.jpg with NullFileHandler
[junit] Reading poifs/20-Force-on-a-current-S00.doc with HWPFFileHandler
[junit] Reading poifs/20-Force-on-a-current-S00.doc with HPSFFileHandler
[junit] Reading poifs/60256.bin with NullFileHandler
[junit] Reading poifs/60320-protected.xlsx with XSSFFileHandler
[junit] Reading poifs/60320-protected.xlsx with OPCFileHandler
[junit] Reading poifs/61300.bin with NullFileHandler
[junit] Reading poifs/BlockSize4096.zvi with NullFileHandler
[junit] Reading poifs/BlockSize512.zvi with NullFileHandler
[junit] Reading poifs/Notes.ole2 with POIFSFileHandler
[junit] Reading poifs/ReferencesInvalidSectors.mpp with NullFileHandler
[junit] Reading poifs/ShortLastBlock.qwp with NullFileHandler
[junit] Reading poifs/ShortLastBlock.wps with NullFileHandler
[junit] Reading poifs/extenxls_pwd123.xlsx with XSSFFileHandler
[junit] Reading poifs/extenxls_pwd123.xlsx with OPCFileHandler
[junit] Reading poifs/multimedia.doc with HWPFFileHandler
[junit] Reading poifs/multimedia.doc with HPSFFileHandler
[junit] Reading poifs/oleObject1.bin with NullFileHandler
[junit] Reading poifs/only-zero-byte-streams.ole2 with POIFSFileHandler
[junit] Reading poifs/poitest.pfx with NullFileHandler
[junit] Reading poifs/protect.xlsx with XSSFFileHandler
[junit] Reading poifs/protect.xlsx with OPCFileHandler
[junit] Reading poifs/protected_agile.docx with XWPFFileHandler
[junit] Reading poifs/protected_agile.docx with OPCFileHandler
[junit] Reading poifs/protected_sha512.xlsx with XSSFFileHandler
[junit] Reading poifs/protected_sha512.xlsx with OPCFileHandler
[junit] Reading poifs/unknown_properties.msg with HSMFFileHandler
[junit] Reading project-header.svg with NullFileHandler
[junit] Reading publisher/51318.pub with HPBFFileHandler
[junit] Reading publisher/60685.pub with HPBFFileHandler
[junit] Reading publisher/LinkAt0And10.pub with HPBFFileHandler
[junit] Reading publisher/LinkAt10.pub with HPBFFileHandler
[junit] Reading publisher/LinkAt10And20And30.pub with HPBFFileHandler
[junit] Reading publisher/LinkAt10And20And30And40.pub with HPBFFileHandler
[junit] Reading publisher/LinkAt10Longer.pub with HPBFFileHandler
[junit] Reading publisher/LinkAt20.pub with HPBFFileHandler
[junit] Reading publisher/Sample.pub with HPBFFileHandler
[junit] Reading publisher/Sample.txt with NullFileHandler
[junit] Reading publisher/Sample2.pub with HPBFFileHandler
[junit] Reading publisher/Sample2.txt with NullFileHandler
[junit] Reading publisher/Sample2000.pub with HPBFFileHandler
[junit] Reading publisher/Sample2_2010.pub with HPBFFileHandler
[junit] Reading publisher/Sample3.pub with HPBFFileHandler
[junit] Reading publisher/Sample3.txt with NullFileHandler
[junit] Reading publisher/Sample3_2010.pub with HPBFFileHandler
[junit] Reading publisher/Sample4.pub with HPBFFileHandler
[junit] Reading publisher/Sample4.txt with NullFileHandler
[junit] Reading publisher/Sample4_2010.pub with HPBFFileHandler
[junit] Reading publisher/Sample98.pub with HPBFFileHandler
[junit] Reading publisher/SampleBrochure.pub with HPBFFileHandler
[junit] Reading publisher/SampleNewsletter.pub with HPBFFileHandler
[junit] Reading publisher/Sample_2010.pub with HPBFFileHandler
[junit] Reading publisher/Simple.pub with HPBFFileHandler
[junit] Reading slideshow/2411-Performance_Up.pptx with XSLFFileHandler
[junit] Reading slideshow/2411-Performance_Up.pptx with OPCFileHandler
[junit] Reading slideshow/37625.ppt with HSLFFileHandler
[junit] Reading slideshow/37625.ppt with HPSFFileHandler
[junit] Reading slideshow/38256.ppt with HSLFFileHandler
[junit] Reading slideshow/38256.ppt with HPSFFileHandler
[junit] Reading slideshow/41071.ppt with HSLFFileHandler
[junit] Reading slideshow/41071.ppt with HPSFFileHandler
[junit] Reading slideshow/41246-1.ppt with HSLFFileHandler
[junit] Reading slideshow/41246-1.ppt with HPSFFileHandler
[junit] Reading slideshow/41246-2.ppt with HSLFFileHandler
[junit] Reading slideshow/41246-2.ppt with HPSFFileHandler
[junit] Reading slideshow/41384.ppt with HSLFFileHandler
[junit] Reading slideshow/41384.ppt with HPSFFileHandler
[junit] Reading slideshow/42474-1.ppt with HSLFFileHandler
[junit] Reading slideshow/42474-1.ppt with HPSFFileHandler
[junit] Reading slideshow/42474-2.ppt with HSLFFileHandler
[junit] Reading slideshow/42474-2.ppt with HPSFFileHandler
[junit] Reading slideshow/42485.ppt with HSLFFileHandler
[junit] Reading slideshow/42485.ppt with HPSFFileHandler
[junit] Reading slideshow/42486.ppt with HSLFFileHandler
[junit] Reading slideshow/42486.ppt with HPSFFileHandler
[junit] Reading slideshow/42520.ppt with HSLFFileHandler
[junit] Reading slideshow/42520.ppt with HPSFFileHandler
[junit] Reading slideshow/43781.ppt with HSLFFileHandler
[junit] Reading slideshow/43781.ppt with HPSFFileHandler
[junit] Reading slideshow/44296.ppt with HSLFFileHandler
[junit] Reading slideshow/44296.ppt with HPSFFileHandler
[junit] Reading slideshow/44770.ppt with HSLFFileHandler
[junit] Reading slideshow/44770.ppt with HPSFFileHandler
[junit] Reading slideshow/45537_Footer.ppt with HSLFFileHandler
[junit] Reading slideshow/45537_Footer.ppt with HPSFFileHandler
[junit] Reading slideshow/45537_Header.ppt with HSLFFileHandler
[junit] Reading slideshow/45537_Header.ppt with HPSFFileHandler
[junit] Reading slideshow/45541_Footer.pptx with XSLFFileHandler
[junit] Reading slideshow/45541_Footer.pptx with OPCFileHandler
[junit] Reading slideshow/45541_Header.pptx with XSLFFileHandler
[junit] Reading slideshow/45541_Header.pptx with OPCFileHandler
[junit] Reading slideshow/45543.ppt with HSLFFileHandler
[junit] Reading slideshow/45543.ppt with HPSFFileHandler
[junit] Reading slideshow/45545_Comment.pptx with XSLFFileHandler
[junit] Reading slideshow/45545_Comment.pptx with OPCFileHandler
[junit] Reading slideshow/45776.ppt with HSLFFileHandler
[junit] Reading slideshow/45776.ppt with HPSFFileHandler
[junit] Reading slideshow/47261.ppt with HSLFFileHandler
[junit] Reading slideshow/47261.ppt with HPSFFileHandler
[junit] Reading slideshow/49386-null_dates.pptx with XSLFFileHandler
[junit] Reading slideshow/49386-null_dates.pptx with OPCFileHandler
[junit] Reading slideshow/49541_symbol_map.ppt with HSLFFileHandler
[junit] Reading slideshow/49541_symbol_map.ppt with HPSFFileHandler
[junit] Reading slideshow/49648.ppt with HSLFFileHandler
[junit] Reading slideshow/49648.ppt with HPSFFileHandler
[junit] Reading slideshow/51187.pptx with XSLFFileHandler
[junit] Reading slideshow/51187.pptx with OPCFileHandler
[junit] Reading slideshow/51731.ppt with HSLFFileHandler
[junit] Reading slideshow/51731.ppt with HPSFFileHandler
[junit] Reading slideshow/52244.ppt with HSLFFileHandler
[junit] Reading slideshow/52244.ppt with HPSFFileHandler
[junit] Reading slideshow/52599.ppt with HSLFFileHandler
[junit] Reading slideshow/52599.ppt with HPSFFileHandler
[junit] Reading slideshow/53446.ppt with HSLFFileHandler
[junit] Reading slideshow/53446.ppt with HPSFFileHandler
[junit] Reading slideshow/54111.ppt with HSLFFileHandler
[junit] Reading slideshow/54111.ppt with HPSFFileHandler
[junit] Reading slideshow/54332a.ppt with HSLFFileHandler
[junit] Reading slideshow/54332a.ppt with HPSFFileHandler
[junit] Reading slideshow/54332b.ppt with HSLFFileHandler
[junit] Reading slideshow/54332b.ppt with HPSFFileHandler
[junit] Reading slideshow/54541_cropped_bitmap.ppt with HSLFFileHandler
[junit] Reading slideshow/54541_cropped_bitmap.ppt with HPSFFileHandler
[junit] Reading slideshow/54541_cropped_bitmap2.ppt with HSLFFileHandler
[junit] Reading slideshow/54541_cropped_bitmap2.ppt with HPSFFileHandler
[junit] Reading slideshow/54542_cropped_bitmap.pptx with XSLFFileHandler
[junit] Reading slideshow/54542_cropped_bitmap.pptx with OPCFileHandler
[junit] Reading slideshow/54722.ppt with HSLFFileHandler
[junit] Reading slideshow/54722.ppt with HPSFFileHandler
[junit] Reading slideshow/54880_chinese.ppt with HSLFFileHandler
[junit] Reading slideshow/54880_chinese.ppt with HPSFFileHandler
[junit] Reading slideshow/56260.ppt with HSLFFileHandler
[junit] Reading slideshow/56260.ppt with HPSFFileHandler
[junit] Reading slideshow/56812.pptx with XSLFFileHandler
[junit] Reading slideshow/56812.pptx with OPCFileHandler
[junit] Reading slideshow/57272_corrupted_usereditatom.ppt with HSLFFileHandler
[junit] Reading slideshow/57272_corrupted_usereditatom.ppt with HPSFFileHandler
[junit] Reading slideshow/59302.ppt with HSLFFileHandler
[junit] Reading slideshow/59302.ppt with HPSFFileHandler
[junit] Reading slideshow/60003.ppt with HSLFFileHandler
[junit] Reading slideshow/60003.ppt with HPSFFileHandler
[junit] Reading slideshow/60042.pptx with XSLFFileHandler
[junit] Reading slideshow/60042.pptx with OPCFileHandler
[junit] Reading slideshow/60294.ppt with HSLFFileHandler
[junit] Reading slideshow/60294.ppt with HPSFFileHandler
[junit] Reading slideshow/60810.pptx with XSLFFileHandler
[junit] Reading slideshow/60810.pptx with OPCFileHandler
[junit] Reading slideshow/61338.wmf with NullFileHandler
[junit] Reading slideshow/61515.pptx with XSLFFileHandler
[junit] Reading slideshow/61515.pptx with OPCFileHandler
[junit] Reading slideshow/Divino_Revelado.pptx with XSLFFileHandler
[junit] Reading slideshow/Divino_Revelado.pptx with OPCFileHandler
[junit] Reading slideshow/KEY02.pptx with XSLFFileHandler
[junit] Reading slideshow/KEY02.pptx with OPCFileHandler
[junit] Reading slideshow/OverlappingRelations.pptx with XSLFFileHandler
[junit] Reading slideshow/OverlappingRelations.pptx with OPCFileHandler
[junit] Reading slideshow/PPT95.ppt with HSLFFileHandler
[junit] Reading slideshow/PPT95.ppt with HPSFFileHandler
[junit] Reading slideshow/PPTWithAttachments.pptm with XSLFFileHandler
[junit] Reading slideshow/PPTWithAttachments.pptm with OPCFileHandler
[junit] Reading slideshow/ParagraphStylesShorterThanCharStyles.ppt with HSLFFileHandler
[junit] Reading slideshow/ParagraphStylesShorterThanCharStyles.ppt with HPSFFileHandler
[junit] Reading slideshow/Password_Protected-56-hello.ppt with HSLFFileHandler
[junit] Reading slideshow/Password_Protected-56-hello.ppt with HPSFFileHandler
[junit] Reading slideshow/Password_Protected-hello.ppt with HSLFFileHandler
[junit] Reading slideshow/Password_Protected-hello.ppt with HPSFFileHandler
[junit] Reading slideshow/Password_Protected-np-hello.ppt with HSLFFileHandler
[junit] Reading slideshow/Password_Protected-np-hello.ppt with HPSFFileHandler
[junit] Reading slideshow/PictureTypeZero.ppt with HSLFFileHandler
[junit] #
[junit] # A fatal error has been detected by the Java Runtime Environment:
[junit] #
[junit] # SIGSEGV (0xb) at pc=0x00007f2e2b28eec6, pid=16671, tid=16674
[junit] #
[junit] # JRE version: OpenJDK Runtime Environment (13.0+4) (build 13-ea+4)
[junit] # Java VM: OpenJDK 64-Bit Server VM (13-ea+4, mixed mode, sharing, tiered, compressed oops, g1 gc, linux-amd64)
[junit] # Problematic frame:
[junit] # C [libc.so.6+0x15fec6]
[junit] #
[junit] # No core dump will be written. Core dumps have been disabled. To enable core dumping, try "ulimit -c unlimited" before starting Java again
[junit] #
[junit] # An error report file with more information is saved as:
[junit] # <https://builds.apache.org/job/POI-DSL-1.13/ws/hs_err_pid16671.log>
[junit] #
[junit] # If you would like to submit a bug report, please visit:
[junit] # http://bugreport.java.com/bugreport/crash.jsp
[junit] # The crash happened outside the Java Virtual Machine in native code.
[junit] # See problematic frame for where to report the bug.
[junit] #
[junit] Running org.apache.poi.TestAllFiles
[junit] Tests run: 1, Failures: 0, Errors: 1, Skipped: 0, Time elapsed: 0 sec
BUILD FAILED
<https://builds.apache.org/job/POI-DSL-1.13/ws/build.xml>:1634: The following error occurred while executing this line:
<https://builds.apache.org/job/POI-DSL-1.13/ws/build.xml>:1226: Test org.apache.poi.TestAllFiles failed (crashed)
Total time: 12 minutes 0 seconds
Build step 'Invoke Ant' marked build as failure
Skipping publisher since build result is FAILURE
Archiving artifacts
[Fast Archiver] No prior successful build to compare, so performing full copy of artifacts
Skipping publisher since build result is FAILURE
Recording test results
---------------------------------------------------------------------
To unsubscribe, e-mail: dev-unsubscribe@poi.apache.org
For additional commands, e-mail: dev-help@poi.apache.org
Jenkins build is back to normal : POI-DSL-1.13 #8
Posted by Apache Jenkins Server <je...@builds.apache.org>.
See <https://builds.apache.org/job/POI-DSL-1.13/8/display/redirect?page=changes>
---------------------------------------------------------------------
To unsubscribe, e-mail: dev-unsubscribe@poi.apache.org
For additional commands, e-mail: dev-help@poi.apache.org
Build failed in Jenkins: POI-DSL-1.13 #7
Posted by Apache Jenkins Server <je...@builds.apache.org>.
See <https://builds.apache.org/job/POI-DSL-1.13/7/display/redirect?page=changes>
Changes:
[centic] Add batik-jars to findbugs-task
[centic] Close file-handles for slideshows also when construction fails or when dual-storage is used
Also avoid file-leak reports in some tests
[centic] Remove some remnants of NFileSystem
[centic] Add some more testing for bug 63151: NullPointerException in HSSFOptimiser.optimiseFonts(), also execute it as part of large regression tests in the future
[centic] Adjust BaseIntegrationTest some more to better handle invalid file extensions
[yegor] Bug 60980: Fix parsing formulas with intersections in functions args
[fanningpj] [bug-63151] handle NPE in UnicodeString
[fanningpj] [bug-63187] fix typos
------------------------------------------
[...truncated 77.60 KB...]
[junit] Tests run: 13, Failures: 0, Errors: 0, Skipped: 0, Time elapsed: 0.022 sec
[junit] Running org.apache.poi.ss.formula.functions.TestMathX
[junit] Tests run: 23, Failures: 0, Errors: 0, Skipped: 0, Time elapsed: 0.009 sec
[junit] Running org.apache.poi.ss.formula.functions.TestMid
[junit] Tests run: 4, Failures: 0, Errors: 0, Skipped: 0, Time elapsed: 0.025 sec
[junit] Running org.apache.poi.ss.formula.functions.TestMirr
[junit] Tests run: 4, Failures: 0, Errors: 0, Skipped: 0, Time elapsed: 0.003 sec
[junit] Running org.apache.poi.ss.formula.functions.TestMultiOperandNumericFunction
[junit] Tests run: 3, Failures: 0, Errors: 0, Skipped: 0, Time elapsed: 0.001 sec
[junit] Running org.apache.poi.ss.formula.functions.TestNper
[junit] Tests run: 2, Failures: 0, Errors: 0, Skipped: 0, Time elapsed: 0.002 sec
[junit] Running org.apache.poi.ss.formula.functions.TestNpv
[junit] Tests run: 2, Failures: 0, Errors: 0, Skipped: 0, Time elapsed: 0.003 sec
[junit] Running org.apache.poi.ss.formula.functions.TestOct2Dec
[junit] Tests run: 2, Failures: 0, Errors: 0, Skipped: 0, Time elapsed: 0.001 sec
[junit] Running org.apache.poi.ss.formula.functions.TestOffset
[junit] Tests run: 3, Failures: 0, Errors: 0, Skipped: 0, Time elapsed: 0.002 sec
[junit] Running org.apache.poi.ss.formula.functions.TestPPMT
[junit] Tests run: 1, Failures: 0, Errors: 0, Skipped: 0, Time elapsed: 0.001 sec
[junit] Running org.apache.poi.ss.formula.functions.TestPmt
[junit] Tests run: 2, Failures: 0, Errors: 0, Skipped: 0, Time elapsed: 0.001 sec
[junit] Running org.apache.poi.ss.formula.functions.TestPoisson
[junit] Tests run: 6, Failures: 0, Errors: 0, Skipped: 0, Time elapsed: 0.002 sec
[junit] Running org.apache.poi.ss.formula.functions.TestProduct
[junit] Tests run: 3, Failures: 0, Errors: 0, Skipped: 0, Time elapsed: 0.001 sec
[junit] Running org.apache.poi.ss.formula.functions.TestQuotient
[junit] Tests run: 2, Failures: 0, Errors: 0, Skipped: 0, Time elapsed: 0.001 sec
[junit] Running org.apache.poi.ss.formula.functions.TestQuotientFunctionsFromSpreadsheet
[junit] Tests run: 8, Failures: 0, Errors: 0, Skipped: 0, Time elapsed: 0.003 sec
[junit] Running org.apache.poi.ss.formula.functions.TestRank
[junit] Tests run: 1, Failures: 0, Errors: 0, Skipped: 0, Time elapsed: 0.004 sec
[junit] Running org.apache.poi.ss.formula.functions.TestRelationalOperations
[junit] Tests run: 5, Failures: 0, Errors: 0, Skipped: 0, Time elapsed: 0.002 sec
[junit] Running org.apache.poi.ss.formula.functions.TestReptFunctionsFromSpreadsheet
[junit] Tests run: 5, Failures: 0, Errors: 0, Skipped: 0, Time elapsed: 0.004 sec
[junit] Running org.apache.poi.ss.formula.functions.TestRomanFunctionsFromSpreadsheet
[junit] Tests run: 35, Failures: 0, Errors: 0, Skipped: 0, Time elapsed: 0.009 sec
[junit] Running org.apache.poi.ss.formula.functions.TestRoundFuncs
[junit] Tests run: 5, Failures: 0, Errors: 0, Skipped: 1, Time elapsed: 0.002 sec
[junit] Running org.apache.poi.ss.formula.functions.TestRowCol
[junit] Tests run: 4, Failures: 0, Errors: 0, Skipped: 0, Time elapsed: 0.001 sec
[junit] Running org.apache.poi.ss.formula.functions.TestSlope
[junit] Tests run: 3, Failures: 0, Errors: 0, Skipped: 0, Time elapsed: 0.001 sec
[junit] Running org.apache.poi.ss.formula.functions.TestStatsLib
[junit] Tests run: 9, Failures: 0, Errors: 0, Skipped: 0, Time elapsed: 0.002 sec
[junit] Running org.apache.poi.ss.formula.functions.TestSubtotal
[junit] Tests run: 11, Failures: 0, Errors: 0, Skipped: 0, Time elapsed: 0.011 sec
[junit] Running org.apache.poi.ss.formula.functions.TestSumif
[junit] Tests run: 3, Failures: 0, Errors: 0, Skipped: 0, Time elapsed: 0.002 sec
[junit] Running org.apache.poi.ss.formula.functions.TestSumifs
[junit] Tests run: 7, Failures: 0, Errors: 0, Skipped: 0, Time elapsed: 0.005 sec
[junit] Running org.apache.poi.ss.formula.functions.TestSumproduct
[junit] Tests run: 5, Failures: 0, Errors: 0, Skipped: 0, Time elapsed: 0.002 sec
[junit] Running org.apache.poi.ss.formula.functions.TestTFunc
[junit] Tests run: 5, Failures: 0, Errors: 0, Skipped: 0, Time elapsed: 0.001 sec
[junit] Running org.apache.poi.ss.formula.functions.TestText
[junit] Tests run: 4, Failures: 0, Errors: 0, Skipped: 0, Time elapsed: 0.004 sec
[junit] Running org.apache.poi.ss.formula.functions.TestTime
[junit] Tests run: 2, Failures: 0, Errors: 0, Skipped: 0, Time elapsed: 0.007 sec
[junit] Running org.apache.poi.ss.formula.functions.TestTrendFunctionsFromSpreadsheet
[junit] Tests run: 41, Failures: 0, Errors: 0, Skipped: 0, Time elapsed: 0.328 sec
[junit] Running org.apache.poi.ss.formula.functions.TestTrim
[junit] Tests run: 3, Failures: 0, Errors: 0, Skipped: 0, Time elapsed: 0.004 sec
[junit] Running org.apache.poi.ss.formula.functions.TestTrunc
[junit] Tests run: 5, Failures: 0, Errors: 0, Skipped: 0, Time elapsed: 0.003 sec
[junit] Running org.apache.poi.ss.formula.functions.TestTwoOperandNumericFunctionsFromSpreadsheet
[junit] Tests run: 34, Failures: 0, Errors: 0, Skipped: 0, Time elapsed: 0.019 sec
[junit] Running org.apache.poi.ss.formula.functions.TestValue
[junit] Tests run: 2, Failures: 0, Errors: 0, Skipped: 0, Time elapsed: 0.001 sec
[junit] Running org.apache.poi.ss.formula.functions.TestWeekNumFunctionsFromSpreadsheet
[junit] Tests run: 7, Failures: 0, Errors: 0, Skipped: 0, Time elapsed: 0.003 sec
[junit] Running org.apache.poi.ss.formula.functions.TestWeekNumFunctionsFromSpreadsheet2013
[junit] Tests run: 7, Failures: 0, Errors: 0, Skipped: 0, Time elapsed: 0.003 sec
[junit] Running org.apache.poi.ss.formula.functions.TestWeekdayFunc
[junit] Tests run: 2, Failures: 0, Errors: 0, Skipped: 0, Time elapsed: 0.002 sec
[junit] Running org.apache.poi.ss.formula.functions.TestXYNumericFunction
[junit] Tests run: 3, Failures: 0, Errors: 0, Skipped: 0, Time elapsed: 0.004 sec
[junit] Running org.apache.poi.ss.formula.ptg.TestAbstractFunctionPtg
[junit] Tests run: 3, Failures: 0, Errors: 0, Skipped: 0, Time elapsed: 0.002 sec
[junit] Running org.apache.poi.ss.formula.ptg.TestArea3DPtg
[junit] Tests run: 1, Failures: 0, Errors: 0, Skipped: 0, Time elapsed: 0.002 sec
[junit] Running org.apache.poi.ss.formula.ptg.TestAreaErrPtg
[junit] Tests run: 1, Failures: 0, Errors: 0, Skipped: 0, Time elapsed: 0.004 sec
[junit] Running org.apache.poi.ss.formula.ptg.TestAreaPtg
[junit] Tests run: 5, Failures: 0, Errors: 0, Skipped: 0, Time elapsed: 0.004 sec
[junit] Running org.apache.poi.ss.formula.ptg.TestArrayPtg
[junit] Tests run: 5, Failures: 0, Errors: 0, Skipped: 0, Time elapsed: 0.002 sec
[junit] Running org.apache.poi.ss.formula.ptg.TestAttrPtg
[junit] Tests run: 1, Failures: 0, Errors: 0, Skipped: 0, Time elapsed: 0.001 sec
[junit] Running org.apache.poi.ss.formula.ptg.TestErrPtg
[junit] Tests run: 1, Failures: 0, Errors: 0, Skipped: 0, Time elapsed: 0.001 sec
[junit] Running org.apache.poi.ss.formula.ptg.TestExternalFunctionFormulas
[junit] Tests run: 3, Failures: 0, Errors: 0, Skipped: 0, Time elapsed: 0.004 sec
[junit] Running org.apache.poi.ss.formula.ptg.TestExternalNameReference
[junit] Tests run: 3, Failures: 0, Errors: 0, Skipped: 0, Time elapsed: 0.004 sec
[junit] Running org.apache.poi.ss.formula.ptg.TestFuncPtg
[junit] Tests run: 2, Failures: 0, Errors: 0, Skipped: 0, Time elapsed: 0.001 sec
[junit] Running org.apache.poi.ss.formula.ptg.TestFuncVarPtg
[junit] Tests run: 1, Failures: 0, Errors: 0, Skipped: 0, Time elapsed: 0.013 sec
[junit] Running org.apache.poi.ss.formula.ptg.TestIntersectionPtg
[junit] Tests run: 1, Failures: 0, Errors: 0, Skipped: 0, Time elapsed: 0.002 sec
[junit] Running org.apache.poi.ss.formula.ptg.TestPercentPtg
[junit] Tests run: 1, Failures: 0, Errors: 0, Skipped: 0, Time elapsed: 0.001 sec
[junit] Running org.apache.poi.ss.formula.ptg.TestRangePtg
[junit] Tests run: 1, Failures: 0, Errors: 0, Skipped: 0, Time elapsed: 0.002 sec
[junit] Running org.apache.poi.ss.formula.ptg.TestRef3DPtg
[junit] Tests run: 1, Failures: 0, Errors: 0, Skipped: 0, Time elapsed: 0.001 sec
[junit] Running org.apache.poi.ss.formula.ptg.TestReferencePtg
[junit] Tests run: 4, Failures: 0, Errors: 0, Skipped: 0, Time elapsed: 0.008 sec
[junit] Running org.apache.poi.ss.formula.ptg.TestUnionPtg
[junit] Tests run: 1, Failures: 0, Errors: 0, Skipped: 0, Time elapsed: 0.001 sec
[junit] Running org.apache.poi.ss.formula.udf.TestAggregatingUDFFinder
[junit] Tests run: 2, Failures: 0, Errors: 0, Skipped: 0, Time elapsed: 0.001 sec
[junit] Running org.apache.poi.ss.formula.udf.TestDefaultUDFFinder
[junit] Tests run: 1, Failures: 0, Errors: 0, Skipped: 0, Time elapsed: 0.001 sec
[junit] Running org.apache.poi.ss.usermodel.TestDataFormatter
[junit] Tests run: 34, Failures: 0, Errors: 0, Skipped: 1, Time elapsed: 0.091 sec
[junit] Running org.apache.poi.ss.usermodel.TestDateUtil
[junit] Tests run: 5, Failures: 0, Errors: 0, Skipped: 0, Time elapsed: 0.002 sec
[junit] Running org.apache.poi.ss.usermodel.TestExcelStyleDateFormatter
[junit] Tests run: 4, Failures: 0, Errors: 0, Skipped: 0, Time elapsed: 0.026 sec
[junit] Running org.apache.poi.ss.usermodel.TestFractionFormat
[junit] Tests run: 2, Failures: 0, Errors: 0, Skipped: 0, Time elapsed: 0.143 sec
[junit] Running org.apache.poi.ss.usermodel.TestHSSFBorderStyle
[junit] Tests run: 1, Failures: 0, Errors: 0, Skipped: 0, Time elapsed: 0.01 sec
[junit] Running org.apache.poi.ss.usermodel.TestIndexedColors
[junit] Tests run: 3, Failures: 0, Errors: 0, Skipped: 0, Time elapsed: 0.037 sec
[junit] Running org.apache.poi.ss.usermodel.TestRangeCopier
[junit] Tests run: 1, Failures: 0, Errors: 0, Skipped: 1, Time elapsed: 0.001 sec
[junit] Running org.apache.poi.ss.usermodel.charts.TestDataSources
[junit] Tests run: 6, Failures: 0, Errors: 0, Skipped: 0, Time elapsed: 0.092 sec
[junit] Running org.apache.poi.ss.util.TestAreaReference
[junit] Tests run: 3, Failures: 0, Errors: 0, Skipped: 0, Time elapsed: 0.04 sec
[junit] Running org.apache.poi.ss.util.TestCellAddress
[junit] Tests run: 6, Failures: 0, Errors: 0, Skipped: 0, Time elapsed: 0.004 sec
[junit] Running org.apache.poi.ss.util.TestCellRangeAddress
[junit] Tests run: 14, Failures: 0, Errors: 0, Skipped: 0, Time elapsed: 0.017 sec
[junit] Running org.apache.poi.ss.util.TestCellRangeUtil
[junit] Tests run: 1, Failures: 0, Errors: 0, Skipped: 0, Time elapsed: 0.016 sec
[junit] Running org.apache.poi.ss.util.TestCellReference
[junit] Tests run: 27, Failures: 0, Errors: 0, Skipped: 0, Time elapsed: 0.244 sec
[junit] Running org.apache.poi.ss.util.TestDateFormatConverter
[junit] Tests run: 3, Failures: 0, Errors: 0, Skipped: 0, Time elapsed: 4.456 sec
[junit] Running org.apache.poi.ss.util.TestExpandedDouble
[junit] Tests run: 3, Failures: 0, Errors: 0, Skipped: 0, Time elapsed: 0.051 sec
[junit] Running org.apache.poi.ss.util.TestHSSFCellUtil
[junit] Tests run: 13, Failures: 0, Errors: 0, Skipped: 0, Time elapsed: 0.215 sec
[junit] Running org.apache.poi.ss.util.TestNumberComparer
[junit] Tests run: 4, Failures: 0, Errors: 0, Skipped: 0, Time elapsed: 0.048 sec
[junit] Running org.apache.poi.ss.util.TestNumberToTextConverter
[junit] Tests run: 2, Failures: 0, Errors: 0, Skipped: 0, Time elapsed: 0.006 sec
[junit] Running org.apache.poi.ss.util.TestPropertyTemplate
[junit] Tests run: 8, Failures: 0, Errors: 0, Skipped: 0, Time elapsed: 0.013 sec
[junit] Running org.apache.poi.ss.util.TestRegionUtil
[junit] Tests run: 10, Failures: 0, Errors: 0, Skipped: 0, Time elapsed: 0.017 sec
[junit] Running org.apache.poi.ss.util.TestSheetBuilder
[junit] Tests run: 3, Failures: 0, Errors: 0, Skipped: 0, Time elapsed: 0.002 sec
[junit] Running org.apache.poi.ss.util.TestSheetUtil
[junit] Tests run: 7, Failures: 0, Errors: 0, Skipped: 0, Time elapsed: 0.012 sec
[junit] Running org.apache.poi.ss.util.TestWorkbookUtil
[junit] Tests run: 1, Failures: 0, Errors: 0, Skipped: 0, Time elapsed: 0.001 sec
[junit] Running org.apache.poi.ss.util.cellwalk.TestCellWalk
[junit] Tests run: 1, Failures: 0, Errors: 0, Skipped: 0, Time elapsed: 0.002 sec
[junit] Running org.apache.poi.util.TestArrayUtil
[junit] Tests run: 2, Failures: 0, Errors: 0, Skipped: 0, Time elapsed: 0.002 sec
[junit] Running org.apache.poi.util.TestBitField
[junit] Tests run: 16, Failures: 0, Errors: 0, Skipped: 0, Time elapsed: 0.004 sec
[junit] Running org.apache.poi.util.TestByteField
[junit] Tests run: 5, Failures: 0, Errors: 0, Skipped: 0, Time elapsed: 0.004 sec
[junit] Running org.apache.poi.util.TestHexDump
[junit] Tests run: 10, Failures: 0, Errors: 0, Skipped: 0, Time elapsed: 0.014 sec
[junit] Running org.apache.poi.util.TestIOUtils
[junit] Tests run: 20, Failures: 0, Errors: 0, Skipped: 0, Time elapsed: 0.023 sec
[junit] Running org.apache.poi.util.TestIntList
[junit] Tests run: 19, Failures: 0, Errors: 0, Skipped: 0, Time elapsed: 0.041 sec
[junit] Running org.apache.poi.util.TestIntegerField
[junit] Tests run: 5, Failures: 0, Errors: 0, Skipped: 0, Time elapsed: 0.002 sec
[junit] Running org.apache.poi.util.TestLittleEndian
[junit] Tests run: 15, Failures: 0, Errors: 0, Skipped: 0, Time elapsed: 0.003 sec
[junit] Running org.apache.poi.util.TestLittleEndianCP950Reader
[junit] Tests run: 1, Failures: 0, Errors: 0, Skipped: 0, Time elapsed: 0.001 sec
[junit] Running org.apache.poi.util.TestLittleEndianStreams
[junit] Tests run: 5, Failures: 0, Errors: 0, Skipped: 0, Time elapsed: 0.001 sec
[junit] Running org.apache.poi.util.TestLocaleUtil
[junit] Tests run: 3, Failures: 0, Errors: 0, Skipped: 0, Time elapsed: 0.001 sec
[junit] Running org.apache.poi.util.TestLongField
[junit] Tests run: 5, Failures: 0, Errors: 0, Skipped: 0, Time elapsed: 0.002 sec
[junit] Running org.apache.poi.util.TestPOILogFactory
[junit] Tests run: 1, Failures: 0, Errors: 0, Skipped: 0, Time elapsed: 0.001 sec
[junit] Running org.apache.poi.util.TestPOILogger
[junit] Tests run: 1, Failures: 0, Errors: 0, Skipped: 0, Time elapsed: 0.001 sec
[junit] Running org.apache.poi.util.TestRLEDecompressingInputStream
[junit] Tests run: 4, Failures: 0, Errors: 0, Skipped: 0, Time elapsed: 0.001 sec
[junit] Running org.apache.poi.util.TestShortField
[junit] Tests run: 5, Failures: 0, Errors: 0, Skipped: 0, Time elapsed: 0.001 sec
[junit] Running org.apache.poi.util.TestStaxHelper
[junit] Tests run: 3, Failures: 0, Errors: 0, Skipped: 0, Time elapsed: 0.027 sec
[junit] Running org.apache.poi.util.TestStringCodepointsIterable
[junit] Tests run: 1, Failures: 0, Errors: 0, Skipped: 0, Time elapsed: 0.002 sec
[junit] Running org.apache.poi.util.TestStringUtil
[junit] Tests run: 8, Failures: 0, Errors: 0, Skipped: 0, Time elapsed: 0.003 sec
[junit] Running org.apache.poi.util.TestTempFile
[junit] Tests run: 4, Failures: 0, Errors: 0, Skipped: 0, Time elapsed: 0.005 sec
[propertyreset] Warning: Nashorn engine is planned to be removed from a future JDK release
[propertyreset] Warning: Nashorn engine is planned to be removed from a future JDK release
-test-main-write-testfile:
-test-scratchpad-check:
test-scratchpad-download-resources:
test-scratchpad:
[script] Warning: Nashorn engine is planned to be removed from a future JDK release
[junit] Running org.apache.poi.TestJDK12
[junit] #
[junit] # A fatal error has been detected by the Java Runtime Environment:
[junit] #
[junit] # SIGSEGV (0xb) at pc=0x00007fddfab70529, pid=21453, tid=21456
[junit] #
[junit] # JRE version: OpenJDK Runtime Environment (13.0+4) (build 13-ea+4)
[junit] # Java VM: OpenJDK 64-Bit Server VM (13-ea+4, mixed mode, sharing, tiered, compressed oops, g1 gc, linux-amd64)
[junit] # Problematic frame:
[junit] # C [libc.so.6+0x15e529]
[junit] #
[junit] # No core dump will be written. Core dumps have been disabled. To enable core dumping, try "ulimit -c unlimited" before starting Java again
[junit] #
[junit] # An error report file with more information is saved as:
[junit] # <https://builds.apache.org/job/POI-DSL-1.13/ws/hs_err_pid21453.log>
[junit] #
[junit] # If you would like to submit a bug report, please visit:
[junit] # http://bugreport.java.com/bugreport/crash.jsp
[junit] # The crash happened outside the Java Virtual Machine in native code.
[junit] # See problematic frame for where to report the bug.
[junit] #
[junit] Running org.apache.poi.hwpf.usermodel.Batch-With-Multiple-Tests
[junit] Tests run: 1, Failures: 0, Errors: 1, Skipped: 0, Time elapsed: 0 sec
BUILD FAILED
<https://builds.apache.org/job/POI-DSL-1.13/ws/build.xml>:1560: The following error occurred while executing this line:
<https://builds.apache.org/job/POI-DSL-1.13/ws/build.xml>:1239: Tests failed (crashed)
Total time: 6 minutes 36 seconds
Build step 'Invoke Ant' marked build as failure
Skipping publisher since build result is FAILURE
Archiving artifacts
[Fast Archiver] No prior successful build to compare, so performing full copy of artifacts
Skipping publisher since build result is FAILURE
Recording test results
---------------------------------------------------------------------
To unsubscribe, e-mail: dev-unsubscribe@poi.apache.org
For additional commands, e-mail: dev-help@poi.apache.org
Build failed in Jenkins: POI-DSL-1.13 #6
Posted by Apache Jenkins Server <je...@builds.apache.org>.
See <https://builds.apache.org/job/POI-DSL-1.13/6/display/redirect?page=changes>
Changes:
[yegor] Bug 63029: fixed failing test in test-ooxml-lite
[yegor] Bug 63029: revert handling NotOfficeXmlFileException in ZipPackage as this change broke the build
[yegor] Bug 63029: OPCPackage Potentially clobbers files on close()
[yegor] Bug 63029: OPCPackage Potentially clobbers files on close()
------------------------------------------
[...truncated 74.75 KB...]
[junit] Tests run: 13, Failures: 0, Errors: 0, Skipped: 0, Time elapsed: 0.1 sec
[junit] Running org.apache.poi.ss.formula.functions.TestMathX
[junit] Tests run: 23, Failures: 0, Errors: 0, Skipped: 0, Time elapsed: 0.194 sec
[junit] Running org.apache.poi.ss.formula.functions.TestMid
[junit] Tests run: 4, Failures: 0, Errors: 0, Skipped: 0, Time elapsed: 0.011 sec
[junit] Running org.apache.poi.ss.formula.functions.TestMirr
[junit] Tests run: 4, Failures: 0, Errors: 0, Skipped: 0, Time elapsed: 0.021 sec
[junit] Running org.apache.poi.ss.formula.functions.TestMultiOperandNumericFunction
[junit] Tests run: 3, Failures: 0, Errors: 0, Skipped: 0, Time elapsed: 0.018 sec
[junit] Running org.apache.poi.ss.formula.functions.TestNper
[junit] Tests run: 2, Failures: 0, Errors: 0, Skipped: 0, Time elapsed: 0.013 sec
[junit] Running org.apache.poi.ss.formula.functions.TestNpv
[junit] Tests run: 2, Failures: 0, Errors: 0, Skipped: 0, Time elapsed: 0.013 sec
[junit] Running org.apache.poi.ss.formula.functions.TestOct2Dec
[junit] Tests run: 2, Failures: 0, Errors: 0, Skipped: 0, Time elapsed: 0.01 sec
[junit] Running org.apache.poi.ss.formula.functions.TestOffset
[junit] Tests run: 3, Failures: 0, Errors: 0, Skipped: 0, Time elapsed: 0.02 sec
[junit] Running org.apache.poi.ss.formula.functions.TestPPMT
[junit] Tests run: 1, Failures: 0, Errors: 0, Skipped: 0, Time elapsed: 0.005 sec
[junit] Running org.apache.poi.ss.formula.functions.TestPmt
[junit] Tests run: 2, Failures: 0, Errors: 0, Skipped: 0, Time elapsed: 0.011 sec
[junit] Running org.apache.poi.ss.formula.functions.TestPoisson
[junit] Tests run: 6, Failures: 0, Errors: 0, Skipped: 0, Time elapsed: 0.039 sec
[junit] Running org.apache.poi.ss.formula.functions.TestProduct
[junit] Tests run: 3, Failures: 0, Errors: 0, Skipped: 0, Time elapsed: 0.02 sec
[junit] Running org.apache.poi.ss.formula.functions.TestQuotient
[junit] Tests run: 2, Failures: 0, Errors: 0, Skipped: 0, Time elapsed: 0.002 sec
[junit] Running org.apache.poi.ss.formula.functions.TestQuotientFunctionsFromSpreadsheet
[junit] Tests run: 8, Failures: 0, Errors: 0, Skipped: 0, Time elapsed: 0.059 sec
[junit] Running org.apache.poi.ss.formula.functions.TestRank
[junit] Tests run: 1, Failures: 0, Errors: 0, Skipped: 0, Time elapsed: 0.007 sec
[junit] Running org.apache.poi.ss.formula.functions.TestRelationalOperations
[junit] Tests run: 5, Failures: 0, Errors: 0, Skipped: 0, Time elapsed: 0.033 sec
[junit] Running org.apache.poi.ss.formula.functions.TestReptFunctionsFromSpreadsheet
[junit] Tests run: 5, Failures: 0, Errors: 0, Skipped: 0, Time elapsed: 0.036 sec
[junit] Running org.apache.poi.ss.formula.functions.TestRomanFunctionsFromSpreadsheet
[junit] Tests run: 35, Failures: 0, Errors: 0, Skipped: 0, Time elapsed: 0.283 sec
[junit] Running org.apache.poi.ss.formula.functions.TestRoundFuncs
[junit] Tests run: 5, Failures: 0, Errors: 0, Skipped: 1, Time elapsed: 0.028 sec
[junit] Running org.apache.poi.ss.formula.functions.TestRowCol
[junit] Tests run: 4, Failures: 0, Errors: 0, Skipped: 0, Time elapsed: 0.028 sec
[junit] Running org.apache.poi.ss.formula.functions.TestSlope
[junit] Tests run: 3, Failures: 0, Errors: 0, Skipped: 0, Time elapsed: 0.02 sec
[junit] Running org.apache.poi.ss.formula.functions.TestStatsLib
[junit] Tests run: 9, Failures: 0, Errors: 0, Skipped: 0, Time elapsed: 0.071 sec
[junit] Running org.apache.poi.ss.formula.functions.TestSubtotal
[junit] Tests run: 11, Failures: 0, Errors: 0, Skipped: 0, Time elapsed: 0.086 sec
[junit] Running org.apache.poi.ss.formula.functions.TestSumif
[junit] Tests run: 3, Failures: 0, Errors: 0, Skipped: 0, Time elapsed: 0.02 sec
[junit] Running org.apache.poi.ss.formula.functions.TestSumifs
[junit] Tests run: 7, Failures: 0, Errors: 0, Skipped: 0, Time elapsed: 0.055 sec
[junit] Running org.apache.poi.ss.formula.functions.TestSumproduct
[junit] Tests run: 5, Failures: 0, Errors: 0, Skipped: 0, Time elapsed: 0.039 sec
[junit] Running org.apache.poi.ss.formula.functions.TestTFunc
[junit] Tests run: 5, Failures: 0, Errors: 0, Skipped: 0, Time elapsed: 0.039 sec
[junit] Running org.apache.poi.ss.formula.functions.TestText
[junit] Tests run: 4, Failures: 0, Errors: 0, Skipped: 0, Time elapsed: 0.03 sec
[junit] Running org.apache.poi.ss.formula.functions.TestTime
[junit] Tests run: 2, Failures: 0, Errors: 0, Skipped: 0, Time elapsed: 0.012 sec
[junit] Running org.apache.poi.ss.formula.functions.TestTrendFunctionsFromSpreadsheet
[junit] Tests run: 41, Failures: 0, Errors: 0, Skipped: 0, Time elapsed: 0.261 sec
[junit] Running org.apache.poi.ss.formula.functions.TestTrim
[junit] Tests run: 3, Failures: 0, Errors: 0, Skipped: 0, Time elapsed: 0.018 sec
[junit] Running org.apache.poi.ss.formula.functions.TestTrunc
[junit] Tests run: 5, Failures: 0, Errors: 0, Skipped: 0, Time elapsed: 0.037 sec
[junit] Running org.apache.poi.ss.formula.functions.TestTwoOperandNumericFunctionsFromSpreadsheet
[junit] Tests run: 34, Failures: 0, Errors: 0, Skipped: 0, Time elapsed: 0.275 sec
[junit] Running org.apache.poi.ss.formula.functions.TestValue
[junit] Tests run: 2, Failures: 0, Errors: 0, Skipped: 0, Time elapsed: 0.012 sec
[junit] Running org.apache.poi.ss.formula.functions.TestWeekNumFunctionsFromSpreadsheet
[junit] Tests run: 7, Failures: 0, Errors: 0, Skipped: 0, Time elapsed: 0.053 sec
[junit] Running org.apache.poi.ss.formula.functions.TestWeekNumFunctionsFromSpreadsheet2013
[junit] Tests run: 7, Failures: 0, Errors: 0, Skipped: 0, Time elapsed: 0.054 sec
[junit] Running org.apache.poi.ss.formula.functions.TestWeekdayFunc
[junit] Tests run: 2, Failures: 0, Errors: 0, Skipped: 0, Time elapsed: 0.011 sec
[junit] Running org.apache.poi.ss.formula.functions.TestXYNumericFunction
[junit] Tests run: 3, Failures: 0, Errors: 0, Skipped: 0, Time elapsed: 0.021 sec
[junit] Running org.apache.poi.ss.formula.ptg.TestAbstractFunctionPtg
[junit] Tests run: 3, Failures: 0, Errors: 0, Skipped: 0, Time elapsed: 0.02 sec
[junit] Running org.apache.poi.ss.formula.ptg.TestArea3DPtg
[junit] Tests run: 1, Failures: 0, Errors: 0, Skipped: 0, Time elapsed: 0.005 sec
[junit] Running org.apache.poi.ss.formula.ptg.TestAreaErrPtg
[junit] Tests run: 1, Failures: 0, Errors: 0, Skipped: 0, Time elapsed: 0.005 sec
[junit] Running org.apache.poi.ss.formula.ptg.TestAreaPtg
[junit] Tests run: 5, Failures: 0, Errors: 0, Skipped: 0, Time elapsed: 0.046 sec
[junit] Running org.apache.poi.ss.formula.ptg.TestArrayPtg
[junit] Tests run: 5, Failures: 0, Errors: 0, Skipped: 0, Time elapsed: 0.036 sec
[junit] Running org.apache.poi.ss.formula.ptg.TestAttrPtg
[junit] Tests run: 1, Failures: 0, Errors: 0, Skipped: 0, Time elapsed: 0.004 sec
[junit] Running org.apache.poi.ss.formula.ptg.TestErrPtg
[junit] Tests run: 1, Failures: 0, Errors: 0, Skipped: 0, Time elapsed: 0.005 sec
[junit] Running org.apache.poi.ss.formula.ptg.TestExternalFunctionFormulas
[junit] Tests run: 3, Failures: 0, Errors: 0, Skipped: 0, Time elapsed: 0.02 sec
[junit] Running org.apache.poi.ss.formula.ptg.TestExternalNameReference
[junit] Tests run: 3, Failures: 0, Errors: 0, Skipped: 0, Time elapsed: 0.02 sec
[junit] Running org.apache.poi.ss.formula.ptg.TestFuncPtg
[junit] Tests run: 2, Failures: 0, Errors: 0, Skipped: 0, Time elapsed: 0.012 sec
[junit] Running org.apache.poi.ss.formula.ptg.TestFuncVarPtg
[junit] Tests run: 1, Failures: 0, Errors: 0, Skipped: 0, Time elapsed: 0.004 sec
[junit] Running org.apache.poi.ss.formula.ptg.TestIntersectionPtg
[junit] Tests run: 1, Failures: 0, Errors: 0, Skipped: 0, Time elapsed: 0.003 sec
[junit] Running org.apache.poi.ss.formula.ptg.TestPercentPtg
[junit] Tests run: 1, Failures: 0, Errors: 0, Skipped: 0, Time elapsed: 0.002 sec
[junit] Running org.apache.poi.ss.formula.ptg.TestRangePtg
[junit] Tests run: 1, Failures: 0, Errors: 0, Skipped: 0, Time elapsed: 0.004 sec
[junit] Running org.apache.poi.ss.formula.ptg.TestRef3DPtg
[junit] Tests run: 1, Failures: 0, Errors: 0, Skipped: 0, Time elapsed: 0.004 sec
[junit] Running org.apache.poi.ss.formula.ptg.TestReferencePtg
[junit] Tests run: 4, Failures: 0, Errors: 0, Skipped: 0, Time elapsed: 0.028 sec
[junit] Running org.apache.poi.ss.formula.ptg.TestUnionPtg
[junit] Tests run: 1, Failures: 0, Errors: 0, Skipped: 0, Time elapsed: 0.004 sec
[junit] Running org.apache.poi.ss.formula.udf.TestAggregatingUDFFinder
[junit] Tests run: 2, Failures: 0, Errors: 0, Skipped: 0, Time elapsed: 0.012 sec
[junit] Running org.apache.poi.ss.formula.udf.TestDefaultUDFFinder
[junit] Tests run: 1, Failures: 0, Errors: 0, Skipped: 0, Time elapsed: 0.004 sec
[junit] Running org.apache.poi.ss.usermodel.TestDataFormatter
[junit] Tests run: 34, Failures: 0, Errors: 0, Skipped: 1, Time elapsed: 0.321 sec
[junit] Running org.apache.poi.ss.usermodel.TestDateUtil
[junit] Tests run: 5, Failures: 0, Errors: 0, Skipped: 0, Time elapsed: 0.026 sec
[junit] Running org.apache.poi.ss.usermodel.TestExcelStyleDateFormatter
[junit] Tests run: 4, Failures: 0, Errors: 0, Skipped: 0, Time elapsed: 0.032 sec
[junit] Running org.apache.poi.ss.usermodel.TestFractionFormat
[junit] Tests run: 2, Failures: 0, Errors: 0, Skipped: 0, Time elapsed: 0.153 sec
[junit] Running org.apache.poi.ss.usermodel.TestHSSFBorderStyle
[junit] Tests run: 1, Failures: 0, Errors: 0, Skipped: 0, Time elapsed: 0.002 sec
[junit] Running org.apache.poi.ss.usermodel.TestIndexedColors
[junit] Tests run: 3, Failures: 0, Errors: 0, Skipped: 0, Time elapsed: 0.015 sec
[junit] Running org.apache.poi.ss.usermodel.TestRangeCopier
[junit] Tests run: 1, Failures: 0, Errors: 0, Skipped: 1, Time elapsed: 0.001 sec
[junit] Running org.apache.poi.ss.usermodel.charts.TestDataSources
[junit] Tests run: 6, Failures: 0, Errors: 0, Skipped: 0, Time elapsed: 0.018 sec
[junit] Running org.apache.poi.ss.util.TestAreaReference
[junit] Tests run: 3, Failures: 0, Errors: 0, Skipped: 0, Time elapsed: 0.014 sec
[junit] Running org.apache.poi.ss.util.TestCellAddress
[junit] Tests run: 6, Failures: 0, Errors: 0, Skipped: 0, Time elapsed: 0.037 sec
[junit] Running org.apache.poi.ss.util.TestCellRangeAddress
[junit] Tests run: 14, Failures: 0, Errors: 0, Skipped: 0, Time elapsed: 0.088 sec
[junit] Running org.apache.poi.ss.util.TestCellRangeUtil
[junit] Tests run: 1, Failures: 0, Errors: 0, Skipped: 0, Time elapsed: 0.04 sec
[junit] Running org.apache.poi.ss.util.TestCellReference
[junit] Tests run: 27, Failures: 0, Errors: 0, Skipped: 0, Time elapsed: 0.408 sec
[junit] Running org.apache.poi.ss.util.TestDateFormatConverter
[junit] Tests run: 3, Failures: 0, Errors: 0, Skipped: 0, Time elapsed: 4.484 sec
[junit] Running org.apache.poi.ss.util.TestExpandedDouble
[junit] Tests run: 3, Failures: 0, Errors: 0, Skipped: 0, Time elapsed: 0.009 sec
[junit] Running org.apache.poi.ss.util.TestHSSFCellUtil
[junit] Tests run: 13, Failures: 0, Errors: 0, Skipped: 0, Time elapsed: 0.074 sec
[junit] Running org.apache.poi.ss.util.TestNumberComparer
[junit] Tests run: 4, Failures: 0, Errors: 0, Skipped: 0, Time elapsed: 0.062 sec
[junit] Running org.apache.poi.ss.util.TestNumberToTextConverter
[junit] Tests run: 2, Failures: 0, Errors: 0, Skipped: 0, Time elapsed: 0.012 sec
[junit] Running org.apache.poi.ss.util.TestPropertyTemplate
[junit] Tests run: 8, Failures: 0, Errors: 0, Skipped: 0, Time elapsed: 0.063 sec
[junit] Running org.apache.poi.ss.util.TestRegionUtil
[junit] Tests run: 10, Failures: 0, Errors: 0, Skipped: 0, Time elapsed: 0.08 sec
[junit] Running org.apache.poi.ss.util.TestSheetBuilder
[junit] Tests run: 3, Failures: 0, Errors: 0, Skipped: 0, Time elapsed: 0.018 sec
[junit] Running org.apache.poi.ss.util.TestSheetUtil
[junit] Tests run: 7, Failures: 0, Errors: 0, Skipped: 0, Time elapsed: 0.053 sec
[junit] Running org.apache.poi.ss.util.TestWorkbookUtil
[junit] Tests run: 1, Failures: 0, Errors: 0, Skipped: 0, Time elapsed: 0.004 sec
[junit] Running org.apache.poi.ss.util.cellwalk.TestCellWalk
[junit] Tests run: 1, Failures: 0, Errors: 0, Skipped: 0, Time elapsed: 0.003 sec
[junit] Running org.apache.poi.util.TestArrayUtil
[junit] Tests run: 2, Failures: 0, Errors: 0, Skipped: 0, Time elapsed: 0.01 sec
[junit] Running org.apache.poi.util.TestBitField
[junit] Tests run: 16, Failures: 0, Errors: 0, Skipped: 0, Time elapsed: 0.162 sec
[junit] Running org.apache.poi.util.TestByteField
[junit] Tests run: 5, Failures: 0, Errors: 0, Skipped: 0, Time elapsed: 0.037 sec
[junit] Running org.apache.poi.util.TestHexDump
[junit] Tests run: 10, Failures: 0, Errors: 0, Skipped: 0, Time elapsed: 0.079 sec
[junit] Running org.apache.poi.util.TestIOUtils
[junit] Tests run: 20, Failures: 0, Errors: 0, Skipped: 0, Time elapsed: 0.093 sec
[junit] Running org.apache.poi.util.TestIntList
[junit] Tests run: 19, Failures: 0, Errors: 0, Skipped: 0, Time elapsed: 0.156 sec
[junit] Running org.apache.poi.util.TestIntegerField
[junit] Tests run: 5, Failures: 0, Errors: 0, Skipped: 0, Time elapsed: 0.035 sec
[junit] Running org.apache.poi.util.TestLittleEndian
[junit] Tests run: 15, Failures: 0, Errors: 0, Skipped: 0, Time elapsed: 0.12 sec
[junit] Running org.apache.poi.util.TestLittleEndianCP950Reader
[junit] Tests run: 1, Failures: 0, Errors: 0, Skipped: 0, Time elapsed: 0.005 sec
[junit] Running org.apache.poi.util.TestLittleEndianStreams
[junit] Tests run: 5, Failures: 0, Errors: 0, Skipped: 0, Time elapsed: 0.038 sec
[junit] Running org.apache.poi.util.TestLocaleUtil
[junit] Tests run: 3, Failures: 0, Errors: 0, Skipped: 0, Time elapsed: 0.02 sec
[junit] Running org.apache.poi.util.TestLongField
[junit] Tests run: 5, Failures: 0, Errors: 0, Skipped: 0, Time elapsed: 0.037 sec
[junit] Running org.apache.poi.util.TestPOILogFactory
[junit] Tests run: 1, Failures: 0, Errors: 0, Skipped: 0, Time elapsed: 0.004 sec
[junit] Running org.apache.poi.util.TestPOILogger
[junit] Tests run: 1, Failures: 0, Errors: 0, Skipped: 0, Time elapsed: 0.004 sec
[junit] Running org.apache.poi.util.TestRLEDecompressingInputStream
[junit] Tests run: 4, Failures: 0, Errors: 0, Skipped: 0, Time elapsed: 0.029 sec
[junit] Running org.apache.poi.util.TestShortField
[junit] Tests run: 5, Failures: 0, Errors: 0, Skipped: 0, Time elapsed: 0.038 sec
[junit] Running org.apache.poi.util.TestStaxHelper
[junit] Tests run: 3, Failures: 0, Errors: 0, Skipped: 0, Time elapsed: 0.03 sec
[junit] Running org.apache.poi.util.TestStringCodepointsIterable
[junit] Tests run: 1, Failures: 0, Errors: 0, Skipped: 0, Time elapsed: 0.006 sec
[junit] Running org.apache.poi.util.TestStringUtil
[junit] Tests run: 8, Failures: 0, Errors: 0, Skipped: 0, Time elapsed: 0.036 sec
[junit] Running org.apache.poi.util.TestTempFile
[junit] Tests run: 4, Failures: 0, Errors: 0, Skipped: 0, Time elapsed: 0.029 sec
[propertyreset] Warning: Nashorn engine is planned to be removed from a future JDK release
[propertyreset] Warning: Nashorn engine is planned to be removed from a future JDK release
-test-main-write-testfile:
-test-scratchpad-check:
test-scratchpad-download-resources:
test-scratchpad:
[script] Warning: Nashorn engine is planned to be removed from a future JDK release
[junit] Running org.apache.poi.TestJDK12
[junit] #
[junit] # A fatal error has been detected by the Java Runtime Environment:
[junit] #
[junit] # SIGSEGV (0xb) at pc=0x00007f0161fcf529, pid=26953, tid=26956
[junit] #
[junit] # JRE version: OpenJDK Runtime Environment (13.0+4) (build 13-ea+4)
[junit] # Java VM: OpenJDK 64-Bit Server VM (13-ea+4, mixed mode, sharing, tiered, compressed oops, g1 gc, linux-amd64)
[junit] # Problematic frame:
[junit] # C [libc.so.6+0x15e529]
[junit] #
[junit] # No core dump will be written. Core dumps have been disabled. To enable core dumping, try "ulimit -c unlimited" before starting Java again
[junit] #
[junit] # An error report file with more information is saved as:
[junit] # <https://builds.apache.org/job/POI-DSL-1.13/ws/hs_err_pid26953.log>
[junit] #
[junit] # If you would like to submit a bug report, please visit:
[junit] # http://bugreport.java.com/bugreport/crash.jsp
[junit] # The crash happened outside the Java Virtual Machine in native code.
[junit] # See problematic frame for where to report the bug.
[junit] #
[junit] Running org.apache.poi.hwpf.usermodel.Batch-With-Multiple-Tests
[junit] Tests run: 1, Failures: 0, Errors: 1, Skipped: 0, Time elapsed: 0 sec
BUILD FAILED
<https://builds.apache.org/job/POI-DSL-1.13/ws/build.xml>:1560: The following error occurred while executing this line:
<https://builds.apache.org/job/POI-DSL-1.13/ws/build.xml>:1239: Tests failed (crashed)
Total time: 6 minutes 17 seconds
Build step 'Invoke Ant' marked build as failure
Skipping publisher since build result is FAILURE
Archiving artifacts
[Fast Archiver] No prior successful build to compare, so performing full copy of artifacts
Skipping publisher since build result is FAILURE
Recording test results
---------------------------------------------------------------------
To unsubscribe, e-mail: dev-unsubscribe@poi.apache.org
For additional commands, e-mail: dev-help@poi.apache.org
Build failed in Jenkins: POI-DSL-1.13 #5
Posted by Apache Jenkins Server <je...@builds.apache.org>.
See <https://builds.apache.org/job/POI-DSL-1.13/5/display/redirect?page=changes>
Changes:
[yegor] Bug 62980: Make D* functions ignore case in headings
[yegor] Bug 62980: Make D* functions ignore case in headings
------------------------------------------
[...truncated 74.68 KB...]
[junit] Tests run: 13, Failures: 0, Errors: 0, Skipped: 0, Time elapsed: 0.065 sec
[junit] Running org.apache.poi.ss.formula.functions.TestMathX
[junit] Tests run: 23, Failures: 0, Errors: 0, Skipped: 0, Time elapsed: 0.118 sec
[junit] Running org.apache.poi.ss.formula.functions.TestMid
[junit] Tests run: 4, Failures: 0, Errors: 0, Skipped: 0, Time elapsed: 0.02 sec
[junit] Running org.apache.poi.ss.formula.functions.TestMirr
[junit] Tests run: 4, Failures: 0, Errors: 0, Skipped: 0, Time elapsed: 0.02 sec
[junit] Running org.apache.poi.ss.formula.functions.TestMultiOperandNumericFunction
[junit] Tests run: 3, Failures: 0, Errors: 0, Skipped: 0, Time elapsed: 0.013 sec
[junit] Running org.apache.poi.ss.formula.functions.TestNper
[junit] Tests run: 2, Failures: 0, Errors: 0, Skipped: 0, Time elapsed: 0.008 sec
[junit] Running org.apache.poi.ss.formula.functions.TestNpv
[junit] Tests run: 2, Failures: 0, Errors: 0, Skipped: 0, Time elapsed: 0.015 sec
[junit] Running org.apache.poi.ss.formula.functions.TestOct2Dec
[junit] Tests run: 2, Failures: 0, Errors: 0, Skipped: 0, Time elapsed: 0.011 sec
[junit] Running org.apache.poi.ss.formula.functions.TestOffset
[junit] Tests run: 3, Failures: 0, Errors: 0, Skipped: 0, Time elapsed: 0.012 sec
[junit] Running org.apache.poi.ss.formula.functions.TestPPMT
[junit] Tests run: 1, Failures: 0, Errors: 0, Skipped: 0, Time elapsed: 0.015 sec
[junit] Running org.apache.poi.ss.formula.functions.TestPmt
[junit] Tests run: 2, Failures: 0, Errors: 0, Skipped: 0, Time elapsed: 0.004 sec
[junit] Running org.apache.poi.ss.formula.functions.TestPoisson
[junit] Tests run: 6, Failures: 0, Errors: 0, Skipped: 0, Time elapsed: 0.02 sec
[junit] Running org.apache.poi.ss.formula.functions.TestProduct
[junit] Tests run: 3, Failures: 0, Errors: 0, Skipped: 0, Time elapsed: 0.017 sec
[junit] Running org.apache.poi.ss.formula.functions.TestQuotient
[junit] Tests run: 2, Failures: 0, Errors: 0, Skipped: 0, Time elapsed: 0.004 sec
[junit] Running org.apache.poi.ss.formula.functions.TestQuotientFunctionsFromSpreadsheet
[junit] Tests run: 8, Failures: 0, Errors: 0, Skipped: 0, Time elapsed: 0.051 sec
[junit] Running org.apache.poi.ss.formula.functions.TestRank
[junit] Tests run: 1, Failures: 0, Errors: 0, Skipped: 0, Time elapsed: 0.006 sec
[junit] Running org.apache.poi.ss.formula.functions.TestRelationalOperations
[junit] Tests run: 5, Failures: 0, Errors: 0, Skipped: 0, Time elapsed: 0.031 sec
[junit] Running org.apache.poi.ss.formula.functions.TestReptFunctionsFromSpreadsheet
[junit] Tests run: 5, Failures: 0, Errors: 0, Skipped: 0, Time elapsed: 0.023 sec
[junit] Running org.apache.poi.ss.formula.functions.TestRomanFunctionsFromSpreadsheet
[junit] Tests run: 35, Failures: 0, Errors: 0, Skipped: 0, Time elapsed: 0.261 sec
[junit] Running org.apache.poi.ss.formula.functions.TestRoundFuncs
[junit] Tests run: 5, Failures: 0, Errors: 0, Skipped: 1, Time elapsed: 0.029 sec
[junit] Running org.apache.poi.ss.formula.functions.TestRowCol
[junit] Tests run: 4, Failures: 0, Errors: 0, Skipped: 0, Time elapsed: 0.049 sec
[junit] Running org.apache.poi.ss.formula.functions.TestSlope
[junit] Tests run: 3, Failures: 0, Errors: 0, Skipped: 0, Time elapsed: 0.023 sec
[junit] Running org.apache.poi.ss.formula.functions.TestStatsLib
[junit] Tests run: 9, Failures: 0, Errors: 0, Skipped: 0, Time elapsed: 0.045 sec
[junit] Running org.apache.poi.ss.formula.functions.TestSubtotal
[junit] Tests run: 11, Failures: 0, Errors: 0, Skipped: 0, Time elapsed: 0.061 sec
[junit] Running org.apache.poi.ss.formula.functions.TestSumif
[junit] Tests run: 3, Failures: 0, Errors: 0, Skipped: 0, Time elapsed: 0.004 sec
[junit] Running org.apache.poi.ss.formula.functions.TestSumifs
[junit] Tests run: 7, Failures: 0, Errors: 0, Skipped: 0, Time elapsed: 0.045 sec
[junit] Running org.apache.poi.ss.formula.functions.TestSumproduct
[junit] Tests run: 5, Failures: 0, Errors: 0, Skipped: 0, Time elapsed: 0.03 sec
[junit] Running org.apache.poi.ss.formula.functions.TestTFunc
[junit] Tests run: 5, Failures: 0, Errors: 0, Skipped: 0, Time elapsed: 0.029 sec
[junit] Running org.apache.poi.ss.formula.functions.TestText
[junit] Tests run: 4, Failures: 0, Errors: 0, Skipped: 0, Time elapsed: 0.012 sec
[junit] Running org.apache.poi.ss.formula.functions.TestTime
[junit] Tests run: 2, Failures: 0, Errors: 0, Skipped: 0, Time elapsed: 0.007 sec
[junit] Running org.apache.poi.ss.formula.functions.TestTrendFunctionsFromSpreadsheet
[junit] Tests run: 41, Failures: 0, Errors: 0, Skipped: 0, Time elapsed: 0.244 sec
[junit] Running org.apache.poi.ss.formula.functions.TestTrim
[junit] Tests run: 3, Failures: 0, Errors: 0, Skipped: 0, Time elapsed: 0.007 sec
[junit] Running org.apache.poi.ss.formula.functions.TestTrunc
[junit] Tests run: 5, Failures: 0, Errors: 0, Skipped: 0, Time elapsed: 0.02 sec
[junit] Running org.apache.poi.ss.formula.functions.TestTwoOperandNumericFunctionsFromSpreadsheet
[junit] Tests run: 34, Failures: 0, Errors: 0, Skipped: 0, Time elapsed: 0.176 sec
[junit] Running org.apache.poi.ss.formula.functions.TestValue
[junit] Tests run: 2, Failures: 0, Errors: 0, Skipped: 0, Time elapsed: 0.009 sec
[junit] Running org.apache.poi.ss.formula.functions.TestWeekNumFunctionsFromSpreadsheet
[junit] Tests run: 7, Failures: 0, Errors: 0, Skipped: 0, Time elapsed: 0.038 sec
[junit] Running org.apache.poi.ss.formula.functions.TestWeekNumFunctionsFromSpreadsheet2013
[junit] Tests run: 7, Failures: 0, Errors: 0, Skipped: 0, Time elapsed: 0.036 sec
[junit] Running org.apache.poi.ss.formula.functions.TestWeekdayFunc
[junit] Tests run: 2, Failures: 0, Errors: 0, Skipped: 0, Time elapsed: 0.004 sec
[junit] Running org.apache.poi.ss.formula.functions.TestXYNumericFunction
[junit] Tests run: 3, Failures: 0, Errors: 0, Skipped: 0, Time elapsed: 0.013 sec
[junit] Running org.apache.poi.ss.formula.ptg.TestAbstractFunctionPtg
[junit] Tests run: 3, Failures: 0, Errors: 0, Skipped: 0, Time elapsed: 0.019 sec
[junit] Running org.apache.poi.ss.formula.ptg.TestArea3DPtg
[junit] Tests run: 1, Failures: 0, Errors: 0, Skipped: 0, Time elapsed: 0.004 sec
[junit] Running org.apache.poi.ss.formula.ptg.TestAreaErrPtg
[junit] Tests run: 1, Failures: 0, Errors: 0, Skipped: 0, Time elapsed: 0.004 sec
[junit] Running org.apache.poi.ss.formula.ptg.TestAreaPtg
[junit] Tests run: 5, Failures: 0, Errors: 0, Skipped: 0, Time elapsed: 0.036 sec
[junit] Running org.apache.poi.ss.formula.ptg.TestArrayPtg
[junit] Tests run: 5, Failures: 0, Errors: 0, Skipped: 0, Time elapsed: 0.021 sec
[junit] Running org.apache.poi.ss.formula.ptg.TestAttrPtg
[junit] Tests run: 1, Failures: 0, Errors: 0, Skipped: 0, Time elapsed: 0.001 sec
[junit] Running org.apache.poi.ss.formula.ptg.TestErrPtg
[junit] Tests run: 1, Failures: 0, Errors: 0, Skipped: 0, Time elapsed: 0.005 sec
[junit] Running org.apache.poi.ss.formula.ptg.TestExternalFunctionFormulas
[junit] Tests run: 3, Failures: 0, Errors: 0, Skipped: 0, Time elapsed: 0.015 sec
[junit] Running org.apache.poi.ss.formula.ptg.TestExternalNameReference
[junit] Tests run: 3, Failures: 0, Errors: 0, Skipped: 0, Time elapsed: 0.02 sec
[junit] Running org.apache.poi.ss.formula.ptg.TestFuncPtg
[junit] Tests run: 2, Failures: 0, Errors: 0, Skipped: 0, Time elapsed: 0.009 sec
[junit] Running org.apache.poi.ss.formula.ptg.TestFuncVarPtg
[junit] Tests run: 1, Failures: 0, Errors: 0, Skipped: 0, Time elapsed: 0.002 sec
[junit] Running org.apache.poi.ss.formula.ptg.TestIntersectionPtg
[junit] Tests run: 1, Failures: 0, Errors: 0, Skipped: 0, Time elapsed: 0.002 sec
[junit] Running org.apache.poi.ss.formula.ptg.TestPercentPtg
[junit] Tests run: 1, Failures: 0, Errors: 0, Skipped: 0, Time elapsed: 0.002 sec
[junit] Running org.apache.poi.ss.formula.ptg.TestRangePtg
[junit] Tests run: 1, Failures: 0, Errors: 0, Skipped: 0, Time elapsed: 0.001 sec
[junit] Running org.apache.poi.ss.formula.ptg.TestRef3DPtg
[junit] Tests run: 1, Failures: 0, Errors: 0, Skipped: 0, Time elapsed: 0.001 sec
[junit] Running org.apache.poi.ss.formula.ptg.TestReferencePtg
[junit] Tests run: 4, Failures: 0, Errors: 0, Skipped: 0, Time elapsed: 0.021 sec
[junit] Running org.apache.poi.ss.formula.ptg.TestUnionPtg
[junit] Tests run: 1, Failures: 0, Errors: 0, Skipped: 0, Time elapsed: 0.003 sec
[junit] Running org.apache.poi.ss.formula.udf.TestAggregatingUDFFinder
[junit] Tests run: 2, Failures: 0, Errors: 0, Skipped: 0, Time elapsed: 0.015 sec
[junit] Running org.apache.poi.ss.formula.udf.TestDefaultUDFFinder
[junit] Tests run: 1, Failures: 0, Errors: 0, Skipped: 0, Time elapsed: 0.001 sec
[junit] Running org.apache.poi.ss.usermodel.TestDataFormatter
[junit] Tests run: 34, Failures: 0, Errors: 0, Skipped: 1, Time elapsed: 0.283 sec
[junit] Running org.apache.poi.ss.usermodel.TestDateUtil
[junit] Tests run: 5, Failures: 0, Errors: 0, Skipped: 0, Time elapsed: 0.016 sec
[junit] Running org.apache.poi.ss.usermodel.TestExcelStyleDateFormatter
[junit] Tests run: 4, Failures: 0, Errors: 0, Skipped: 0, Time elapsed: 0.03 sec
[junit] Running org.apache.poi.ss.usermodel.TestFractionFormat
[junit] Tests run: 2, Failures: 0, Errors: 0, Skipped: 0, Time elapsed: 0.146 sec
[junit] Running org.apache.poi.ss.usermodel.TestHSSFBorderStyle
[junit] Tests run: 1, Failures: 0, Errors: 0, Skipped: 0, Time elapsed: 0.002 sec
[junit] Running org.apache.poi.ss.usermodel.TestIndexedColors
[junit] Tests run: 3, Failures: 0, Errors: 0, Skipped: 0, Time elapsed: 0.015 sec
[junit] Running org.apache.poi.ss.usermodel.TestRangeCopier
[junit] Tests run: 1, Failures: 0, Errors: 0, Skipped: 1, Time elapsed: 0 sec
[junit] Running org.apache.poi.ss.usermodel.charts.TestDataSources
[junit] Tests run: 6, Failures: 0, Errors: 0, Skipped: 0, Time elapsed: 0.035 sec
[junit] Running org.apache.poi.ss.util.TestAreaReference
[junit] Tests run: 3, Failures: 0, Errors: 0, Skipped: 0, Time elapsed: 0.016 sec
[junit] Running org.apache.poi.ss.util.TestCellAddress
[junit] Tests run: 6, Failures: 0, Errors: 0, Skipped: 0, Time elapsed: 0.034 sec
[junit] Running org.apache.poi.ss.util.TestCellRangeAddress
[junit] Tests run: 14, Failures: 0, Errors: 0, Skipped: 0, Time elapsed: 0.103 sec
[junit] Running org.apache.poi.ss.util.TestCellRangeUtil
[junit] Tests run: 1, Failures: 0, Errors: 0, Skipped: 0, Time elapsed: 0.008 sec
[junit] Running org.apache.poi.ss.util.TestCellReference
[junit] Tests run: 27, Failures: 0, Errors: 0, Skipped: 0, Time elapsed: 0.401 sec
[junit] Running org.apache.poi.ss.util.TestDateFormatConverter
[junit] Tests run: 3, Failures: 0, Errors: 0, Skipped: 0, Time elapsed: 4.985 sec
[junit] Running org.apache.poi.ss.util.TestExpandedDouble
[junit] Tests run: 3, Failures: 0, Errors: 0, Skipped: 0, Time elapsed: 0.014 sec
[junit] Running org.apache.poi.ss.util.TestHSSFCellUtil
[junit] Tests run: 13, Failures: 0, Errors: 0, Skipped: 0, Time elapsed: 0.063 sec
[junit] Running org.apache.poi.ss.util.TestNumberComparer
[junit] Tests run: 4, Failures: 0, Errors: 0, Skipped: 0, Time elapsed: 0.078 sec
[junit] Running org.apache.poi.ss.util.TestNumberToTextConverter
[junit] Tests run: 2, Failures: 0, Errors: 0, Skipped: 0, Time elapsed: 0.025 sec
[junit] Running org.apache.poi.ss.util.TestPropertyTemplate
[junit] Tests run: 8, Failures: 0, Errors: 0, Skipped: 0, Time elapsed: 0.057 sec
[junit] Running org.apache.poi.ss.util.TestRegionUtil
[junit] Tests run: 10, Failures: 0, Errors: 0, Skipped: 0, Time elapsed: 0.086 sec
[junit] Running org.apache.poi.ss.util.TestSheetBuilder
[junit] Tests run: 3, Failures: 0, Errors: 0, Skipped: 0, Time elapsed: 0.012 sec
[junit] Running org.apache.poi.ss.util.TestSheetUtil
[junit] Tests run: 7, Failures: 0, Errors: 0, Skipped: 0, Time elapsed: 0.033 sec
[junit] Running org.apache.poi.ss.util.TestWorkbookUtil
[junit] Tests run: 1, Failures: 0, Errors: 0, Skipped: 0, Time elapsed: 0.002 sec
[junit] Running org.apache.poi.ss.util.cellwalk.TestCellWalk
[junit] Tests run: 1, Failures: 0, Errors: 0, Skipped: 0, Time elapsed: 0.005 sec
[junit] Running org.apache.poi.util.TestArrayUtil
[junit] Tests run: 2, Failures: 0, Errors: 0, Skipped: 0, Time elapsed: 0.006 sec
[junit] Running org.apache.poi.util.TestBitField
[junit] Tests run: 16, Failures: 0, Errors: 0, Skipped: 0, Time elapsed: 0.121 sec
[junit] Running org.apache.poi.util.TestByteField
[junit] Tests run: 5, Failures: 0, Errors: 0, Skipped: 0, Time elapsed: 0.027 sec
[junit] Running org.apache.poi.util.TestHexDump
[junit] Tests run: 10, Failures: 0, Errors: 0, Skipped: 0, Time elapsed: 0.058 sec
[junit] Running org.apache.poi.util.TestIOUtils
[junit] Tests run: 20, Failures: 0, Errors: 0, Skipped: 0, Time elapsed: 0.151 sec
[junit] Running org.apache.poi.util.TestIntList
[junit] Tests run: 19, Failures: 0, Errors: 0, Skipped: 0, Time elapsed: 0.122 sec
[junit] Running org.apache.poi.util.TestIntegerField
[junit] Tests run: 5, Failures: 0, Errors: 0, Skipped: 0, Time elapsed: 0.027 sec
[junit] Running org.apache.poi.util.TestLittleEndian
[junit] Tests run: 15, Failures: 0, Errors: 0, Skipped: 0, Time elapsed: 0.075 sec
[junit] Running org.apache.poi.util.TestLittleEndianCP950Reader
[junit] Tests run: 1, Failures: 0, Errors: 0, Skipped: 0, Time elapsed: 0.002 sec
[junit] Running org.apache.poi.util.TestLittleEndianStreams
[junit] Tests run: 5, Failures: 0, Errors: 0, Skipped: 0, Time elapsed: 0.032 sec
[junit] Running org.apache.poi.util.TestLocaleUtil
[junit] Tests run: 3, Failures: 0, Errors: 0, Skipped: 0, Time elapsed: 0.005 sec
[junit] Running org.apache.poi.util.TestLongField
[junit] Tests run: 5, Failures: 0, Errors: 0, Skipped: 0, Time elapsed: 0.038 sec
[junit] Running org.apache.poi.util.TestPOILogFactory
[junit] Tests run: 1, Failures: 0, Errors: 0, Skipped: 0, Time elapsed: 0.001 sec
[junit] Running org.apache.poi.util.TestPOILogger
[junit] Tests run: 1, Failures: 0, Errors: 0, Skipped: 0, Time elapsed: 0.001 sec
[junit] Running org.apache.poi.util.TestRLEDecompressingInputStream
[junit] Tests run: 4, Failures: 0, Errors: 0, Skipped: 0, Time elapsed: 0.029 sec
[junit] Running org.apache.poi.util.TestShortField
[junit] Tests run: 5, Failures: 0, Errors: 0, Skipped: 0, Time elapsed: 0.037 sec
[junit] Running org.apache.poi.util.TestStaxHelper
[junit] Tests run: 3, Failures: 0, Errors: 0, Skipped: 0, Time elapsed: 0.027 sec
[junit] Running org.apache.poi.util.TestStringCodepointsIterable
[junit] Tests run: 1, Failures: 0, Errors: 0, Skipped: 0, Time elapsed: 0.012 sec
[junit] Running org.apache.poi.util.TestStringUtil
[junit] Tests run: 8, Failures: 0, Errors: 0, Skipped: 0, Time elapsed: 0.044 sec
[junit] Running org.apache.poi.util.TestTempFile
[junit] Tests run: 4, Failures: 0, Errors: 0, Skipped: 0, Time elapsed: 0.03 sec
[propertyreset] Warning: Nashorn engine is planned to be removed from a future JDK release
[propertyreset] Warning: Nashorn engine is planned to be removed from a future JDK release
-test-main-write-testfile:
-test-scratchpad-check:
test-scratchpad-download-resources:
test-scratchpad:
[script] Warning: Nashorn engine is planned to be removed from a future JDK release
[junit] Running org.apache.poi.TestJDK12
[junit] #
[junit] # A fatal error has been detected by the Java Runtime Environment:
[junit] #
[junit] # SIGSEGV (0xb) at pc=0x00007ff598612529, pid=3460, tid=3463
[junit] #
[junit] # JRE version: OpenJDK Runtime Environment (13.0+4) (build 13-ea+4)
[junit] # Java VM: OpenJDK 64-Bit Server VM (13-ea+4, mixed mode, sharing, tiered, compressed oops, g1 gc, linux-amd64)
[junit] # Problematic frame:
[junit] # C [libc.so.6+0x15e529]
[junit] #
[junit] # No core dump will be written. Core dumps have been disabled. To enable core dumping, try "ulimit -c unlimited" before starting Java again
[junit] #
[junit] # An error report file with more information is saved as:
[junit] # <https://builds.apache.org/job/POI-DSL-1.13/ws/hs_err_pid3460.log>
[junit] #
[junit] # If you would like to submit a bug report, please visit:
[junit] # http://bugreport.java.com/bugreport/crash.jsp
[junit] # The crash happened outside the Java Virtual Machine in native code.
[junit] # See problematic frame for where to report the bug.
[junit] #
[junit] Running org.apache.poi.hwpf.usermodel.Batch-With-Multiple-Tests
[junit] Tests run: 1, Failures: 0, Errors: 1, Skipped: 0, Time elapsed: 0 sec
BUILD FAILED
<https://builds.apache.org/job/POI-DSL-1.13/ws/build.xml>:1559: The following error occurred while executing this line:
<https://builds.apache.org/job/POI-DSL-1.13/ws/build.xml>:1238: Tests failed (crashed)
Total time: 6 minutes 21 seconds
Build step 'Invoke Ant' marked build as failure
Skipping publisher since build result is FAILURE
Archiving artifacts
[Fast Archiver] No prior successful build to compare, so performing full copy of artifacts
Skipping publisher since build result is FAILURE
Recording test results
---------------------------------------------------------------------
To unsubscribe, e-mail: dev-unsubscribe@poi.apache.org
For additional commands, e-mail: dev-help@poi.apache.org
Build failed in Jenkins: POI-DSL-1.13 #4
Posted by Apache Jenkins Server <je...@builds.apache.org>.
See <https://builds.apache.org/job/POI-DSL-1.13/4/display/redirect?page=changes>
Changes:
[centic] Jenkins DSL: Add more output in test-env-build
[kiwiwings] ... link external again
[kiwiwings] remove new documentation directory and then ...
[centic] Jenkins DSL: Adjust the list of JDKs that we look for in the testevn-job
[gallon] removed accidentally added release-notes
[centic] Add reproducing test-case for a bug we found newly introduced in JDK 12-ea+28
and fixed again in JDK 12-ea+29
[centic] Fix some IDE warnings and better output in unit test
[centic] Exclude one more local file from rat-checks
[centic] Adjust handling of some exceptions in regression tests
[centic] Bug 60405: Add initial support for cetab functions so some macros can be
parsed
Add some function-definitions for Excel 4 Macros and missing functions
found in regression tests
[centic] Ignore file-leaks from openjpa/derby/log4j for the regression tests
------------------------------------------
[...truncated 76.27 KB...]
[junit] Tests run: 13, Failures: 0, Errors: 0, Skipped: 0, Time elapsed: 0.006 sec
[junit] Running org.apache.poi.ss.formula.functions.TestMathX
[junit] Tests run: 23, Failures: 0, Errors: 0, Skipped: 0, Time elapsed: 0.035 sec
[junit] Running org.apache.poi.ss.formula.functions.TestMid
[junit] Tests run: 4, Failures: 0, Errors: 0, Skipped: 0, Time elapsed: 0.001 sec
[junit] Running org.apache.poi.ss.formula.functions.TestMirr
[junit] Tests run: 4, Failures: 0, Errors: 0, Skipped: 0, Time elapsed: 0.003 sec
[junit] Running org.apache.poi.ss.formula.functions.TestMultiOperandNumericFunction
[junit] Tests run: 3, Failures: 0, Errors: 0, Skipped: 0, Time elapsed: 0.001 sec
[junit] Running org.apache.poi.ss.formula.functions.TestNper
[junit] Tests run: 2, Failures: 0, Errors: 0, Skipped: 0, Time elapsed: 0.002 sec
[junit] Running org.apache.poi.ss.formula.functions.TestNpv
[junit] Tests run: 2, Failures: 0, Errors: 0, Skipped: 0, Time elapsed: 0.004 sec
[junit] Running org.apache.poi.ss.formula.functions.TestOct2Dec
[junit] Tests run: 2, Failures: 0, Errors: 0, Skipped: 0, Time elapsed: 0.001 sec
[junit] Running org.apache.poi.ss.formula.functions.TestOffset
[junit] Tests run: 3, Failures: 0, Errors: 0, Skipped: 0, Time elapsed: 0.001 sec
[junit] Running org.apache.poi.ss.formula.functions.TestPPMT
[junit] Tests run: 1, Failures: 0, Errors: 0, Skipped: 0, Time elapsed: 0.002 sec
[junit] Running org.apache.poi.ss.formula.functions.TestPmt
[junit] Tests run: 2, Failures: 0, Errors: 0, Skipped: 0, Time elapsed: 0.001 sec
[junit] Running org.apache.poi.ss.formula.functions.TestPoisson
[junit] Tests run: 6, Failures: 0, Errors: 0, Skipped: 0, Time elapsed: 0.001 sec
[junit] Running org.apache.poi.ss.formula.functions.TestProduct
[junit] Tests run: 3, Failures: 0, Errors: 0, Skipped: 0, Time elapsed: 0.001 sec
[junit] Running org.apache.poi.ss.formula.functions.TestQuotient
[junit] Tests run: 2, Failures: 0, Errors: 0, Skipped: 0, Time elapsed: 0.001 sec
[junit] Running org.apache.poi.ss.formula.functions.TestQuotientFunctionsFromSpreadsheet
[junit] Tests run: 8, Failures: 0, Errors: 0, Skipped: 0, Time elapsed: 0.003 sec
[junit] Running org.apache.poi.ss.formula.functions.TestRank
[junit] Tests run: 1, Failures: 0, Errors: 0, Skipped: 0, Time elapsed: 0.003 sec
[junit] Running org.apache.poi.ss.formula.functions.TestRelationalOperations
[junit] Tests run: 5, Failures: 0, Errors: 0, Skipped: 0, Time elapsed: 0.002 sec
[junit] Running org.apache.poi.ss.formula.functions.TestReptFunctionsFromSpreadsheet
[junit] Tests run: 5, Failures: 0, Errors: 0, Skipped: 0, Time elapsed: 0.005 sec
[junit] Running org.apache.poi.ss.formula.functions.TestRomanFunctionsFromSpreadsheet
[junit] Tests run: 35, Failures: 0, Errors: 0, Skipped: 0, Time elapsed: 0.012 sec
[junit] Running org.apache.poi.ss.formula.functions.TestRoundFuncs
[junit] Tests run: 5, Failures: 0, Errors: 0, Skipped: 1, Time elapsed: 0.002 sec
[junit] Running org.apache.poi.ss.formula.functions.TestRowCol
[junit] Tests run: 4, Failures: 0, Errors: 0, Skipped: 0, Time elapsed: 0.001 sec
[junit] Running org.apache.poi.ss.formula.functions.TestSlope
[junit] Tests run: 3, Failures: 0, Errors: 0, Skipped: 0, Time elapsed: 0.001 sec
[junit] Running org.apache.poi.ss.formula.functions.TestStatsLib
[junit] Tests run: 9, Failures: 0, Errors: 0, Skipped: 0, Time elapsed: 0.002 sec
[junit] Running org.apache.poi.ss.formula.functions.TestSubtotal
[junit] Tests run: 11, Failures: 0, Errors: 0, Skipped: 0, Time elapsed: 0.012 sec
[junit] Running org.apache.poi.ss.formula.functions.TestSumif
[junit] Tests run: 3, Failures: 0, Errors: 0, Skipped: 0, Time elapsed: 0.003 sec
[junit] Running org.apache.poi.ss.formula.functions.TestSumifs
[junit] Tests run: 7, Failures: 0, Errors: 0, Skipped: 0, Time elapsed: 0.008 sec
[junit] Running org.apache.poi.ss.formula.functions.TestSumproduct
[junit] Tests run: 5, Failures: 0, Errors: 0, Skipped: 0, Time elapsed: 0.002 sec
[junit] Running org.apache.poi.ss.formula.functions.TestTFunc
[junit] Tests run: 5, Failures: 0, Errors: 0, Skipped: 0, Time elapsed: 0.001 sec
[junit] Running org.apache.poi.ss.formula.functions.TestText
[junit] Tests run: 4, Failures: 0, Errors: 0, Skipped: 0, Time elapsed: 0.003 sec
[junit] Running org.apache.poi.ss.formula.functions.TestTime
[junit] Tests run: 2, Failures: 0, Errors: 0, Skipped: 0, Time elapsed: 0.005 sec
[junit] Running org.apache.poi.ss.formula.functions.TestTrendFunctionsFromSpreadsheet
[junit] Tests run: 41, Failures: 0, Errors: 0, Skipped: 0, Time elapsed: 0.064 sec
[junit] Running org.apache.poi.ss.formula.functions.TestTrim
[junit] Tests run: 3, Failures: 0, Errors: 0, Skipped: 0, Time elapsed: 0.002 sec
[junit] Running org.apache.poi.ss.formula.functions.TestTrunc
[junit] Tests run: 5, Failures: 0, Errors: 0, Skipped: 0, Time elapsed: 0.003 sec
[junit] Running org.apache.poi.ss.formula.functions.TestTwoOperandNumericFunctionsFromSpreadsheet
[junit] Tests run: 34, Failures: 0, Errors: 0, Skipped: 0, Time elapsed: 0.014 sec
[junit] Running org.apache.poi.ss.formula.functions.TestValue
[junit] Tests run: 2, Failures: 0, Errors: 0, Skipped: 0, Time elapsed: 0.004 sec
[junit] Running org.apache.poi.ss.formula.functions.TestWeekNumFunctionsFromSpreadsheet
[junit] Tests run: 7, Failures: 0, Errors: 0, Skipped: 0, Time elapsed: 0.006 sec
[junit] Running org.apache.poi.ss.formula.functions.TestWeekNumFunctionsFromSpreadsheet2013
[junit] Tests run: 7, Failures: 0, Errors: 0, Skipped: 0, Time elapsed: 0.005 sec
[junit] Running org.apache.poi.ss.formula.functions.TestWeekdayFunc
[junit] Tests run: 2, Failures: 0, Errors: 0, Skipped: 0, Time elapsed: 0.004 sec
[junit] Running org.apache.poi.ss.formula.functions.TestXYNumericFunction
[junit] Tests run: 3, Failures: 0, Errors: 0, Skipped: 0, Time elapsed: 0.012 sec
[junit] Running org.apache.poi.ss.formula.ptg.TestAbstractFunctionPtg
[junit] Tests run: 3, Failures: 0, Errors: 0, Skipped: 0, Time elapsed: 0.003 sec
[junit] Running org.apache.poi.ss.formula.ptg.TestArea3DPtg
[junit] Tests run: 1, Failures: 0, Errors: 0, Skipped: 0, Time elapsed: 0.002 sec
[junit] Running org.apache.poi.ss.formula.ptg.TestAreaErrPtg
[junit] Tests run: 1, Failures: 0, Errors: 0, Skipped: 0, Time elapsed: 0.003 sec
[junit] Running org.apache.poi.ss.formula.ptg.TestAreaPtg
[junit] Tests run: 5, Failures: 0, Errors: 0, Skipped: 0, Time elapsed: 0.002 sec
[junit] Running org.apache.poi.ss.formula.ptg.TestArrayPtg
[junit] Tests run: 5, Failures: 0, Errors: 0, Skipped: 0, Time elapsed: 0.004 sec
[junit] Running org.apache.poi.ss.formula.ptg.TestAttrPtg
[junit] Tests run: 1, Failures: 0, Errors: 0, Skipped: 0, Time elapsed: 0.001 sec
[junit] Running org.apache.poi.ss.formula.ptg.TestErrPtg
[junit] Tests run: 1, Failures: 0, Errors: 0, Skipped: 0, Time elapsed: 0.002 sec
[junit] Running org.apache.poi.ss.formula.ptg.TestExternalFunctionFormulas
[junit] Tests run: 3, Failures: 0, Errors: 0, Skipped: 0, Time elapsed: 0.005 sec
[junit] Running org.apache.poi.ss.formula.ptg.TestExternalNameReference
[junit] Tests run: 3, Failures: 0, Errors: 0, Skipped: 0, Time elapsed: 0.006 sec
[junit] Running org.apache.poi.ss.formula.ptg.TestFuncPtg
[junit] Tests run: 2, Failures: 0, Errors: 0, Skipped: 0, Time elapsed: 0.002 sec
[junit] Running org.apache.poi.ss.formula.ptg.TestFuncVarPtg
[junit] Tests run: 1, Failures: 0, Errors: 0, Skipped: 0, Time elapsed: 0.001 sec
[junit] Running org.apache.poi.ss.formula.ptg.TestIntersectionPtg
[junit] Tests run: 1, Failures: 0, Errors: 0, Skipped: 0, Time elapsed: 0.002 sec
[junit] Running org.apache.poi.ss.formula.ptg.TestPercentPtg
[junit] Tests run: 1, Failures: 0, Errors: 0, Skipped: 0, Time elapsed: 0.003 sec
[junit] Running org.apache.poi.ss.formula.ptg.TestRangePtg
[junit] Tests run: 1, Failures: 0, Errors: 0, Skipped: 0, Time elapsed: 0.002 sec
[junit] Running org.apache.poi.ss.formula.ptg.TestRef3DPtg
[junit] Tests run: 1, Failures: 0, Errors: 0, Skipped: 0, Time elapsed: 0.002 sec
[junit] Running org.apache.poi.ss.formula.ptg.TestReferencePtg
[junit] Tests run: 4, Failures: 0, Errors: 0, Skipped: 0, Time elapsed: 0.034 sec
[junit] Running org.apache.poi.ss.formula.ptg.TestUnionPtg
[junit] Tests run: 1, Failures: 0, Errors: 0, Skipped: 0, Time elapsed: 0.003 sec
[junit] Running org.apache.poi.ss.formula.udf.TestAggregatingUDFFinder
[junit] Tests run: 2, Failures: 0, Errors: 0, Skipped: 0, Time elapsed: 0.003 sec
[junit] Running org.apache.poi.ss.formula.udf.TestDefaultUDFFinder
[junit] Tests run: 1, Failures: 0, Errors: 0, Skipped: 0, Time elapsed: 0.001 sec
[junit] Running org.apache.poi.ss.usermodel.TestDataFormatter
[junit] Tests run: 34, Failures: 0, Errors: 0, Skipped: 1, Time elapsed: 0.074 sec
[junit] Running org.apache.poi.ss.usermodel.TestDateUtil
[junit] Tests run: 5, Failures: 0, Errors: 0, Skipped: 0, Time elapsed: 0.002 sec
[junit] Running org.apache.poi.ss.usermodel.TestExcelStyleDateFormatter
[junit] Tests run: 4, Failures: 0, Errors: 0, Skipped: 0, Time elapsed: 0.021 sec
[junit] Running org.apache.poi.ss.usermodel.TestFractionFormat
[junit] Tests run: 2, Failures: 0, Errors: 0, Skipped: 0, Time elapsed: 0.107 sec
[junit] Running org.apache.poi.ss.usermodel.TestHSSFBorderStyle
[junit] Tests run: 1, Failures: 0, Errors: 0, Skipped: 0, Time elapsed: 0.003 sec
[junit] Running org.apache.poi.ss.usermodel.TestIndexedColors
[junit] Tests run: 3, Failures: 0, Errors: 0, Skipped: 0, Time elapsed: 0.002 sec
[junit] Running org.apache.poi.ss.usermodel.TestRangeCopier
[junit] Tests run: 1, Failures: 0, Errors: 0, Skipped: 1, Time elapsed: 0.002 sec
[junit] Running org.apache.poi.ss.usermodel.charts.TestDataSources
[junit] Tests run: 6, Failures: 0, Errors: 0, Skipped: 0, Time elapsed: 0.006 sec
[junit] Running org.apache.poi.ss.util.TestAreaReference
[junit] Tests run: 3, Failures: 0, Errors: 0, Skipped: 0, Time elapsed: 0.003 sec
[junit] Running org.apache.poi.ss.util.TestCellAddress
[junit] Tests run: 6, Failures: 0, Errors: 0, Skipped: 0, Time elapsed: 0.003 sec
[junit] Running org.apache.poi.ss.util.TestCellRangeAddress
[junit] Tests run: 14, Failures: 0, Errors: 0, Skipped: 0, Time elapsed: 0.005 sec
[junit] Running org.apache.poi.ss.util.TestCellRangeUtil
[junit] Tests run: 1, Failures: 0, Errors: 0, Skipped: 0, Time elapsed: 0.025 sec
[junit] Running org.apache.poi.ss.util.TestCellReference
[junit] Tests run: 27, Failures: 0, Errors: 0, Skipped: 0, Time elapsed: 0.471 sec
[junit] Running org.apache.poi.ss.util.TestDateFormatConverter
[junit] Tests run: 3, Failures: 0, Errors: 0, Skipped: 0, Time elapsed: 4.774 sec
[junit] Running org.apache.poi.ss.util.TestExpandedDouble
[junit] Tests run: 3, Failures: 0, Errors: 0, Skipped: 0, Time elapsed: 0.006 sec
[junit] Running org.apache.poi.ss.util.TestHSSFCellUtil
[junit] Tests run: 13, Failures: 0, Errors: 0, Skipped: 0, Time elapsed: 0.016 sec
[junit] Running org.apache.poi.ss.util.TestNumberComparer
[junit] Tests run: 4, Failures: 0, Errors: 0, Skipped: 0, Time elapsed: 0.121 sec
[junit] Running org.apache.poi.ss.util.TestNumberToTextConverter
[junit] Tests run: 2, Failures: 0, Errors: 0, Skipped: 0, Time elapsed: 0.019 sec
[junit] Running org.apache.poi.ss.util.TestPropertyTemplate
[junit] Tests run: 8, Failures: 0, Errors: 0, Skipped: 0, Time elapsed: 0.018 sec
[junit] Running org.apache.poi.ss.util.TestRegionUtil
[junit] Tests run: 10, Failures: 0, Errors: 0, Skipped: 0, Time elapsed: 0.023 sec
[junit] Running org.apache.poi.ss.util.TestSheetBuilder
[junit] Tests run: 3, Failures: 0, Errors: 0, Skipped: 0, Time elapsed: 0.003 sec
[junit] Running org.apache.poi.ss.util.TestSheetUtil
[junit] Tests run: 7, Failures: 0, Errors: 0, Skipped: 0, Time elapsed: 0.006 sec
[junit] Running org.apache.poi.ss.util.TestWorkbookUtil
[junit] Tests run: 1, Failures: 0, Errors: 0, Skipped: 0, Time elapsed: 0.001 sec
[junit] Running org.apache.poi.ss.util.cellwalk.TestCellWalk
[junit] Tests run: 1, Failures: 0, Errors: 0, Skipped: 0, Time elapsed: 0.002 sec
[junit] Running org.apache.poi.util.TestArrayUtil
[junit] Tests run: 2, Failures: 0, Errors: 0, Skipped: 0, Time elapsed: 0.001 sec
[junit] Running org.apache.poi.util.TestBitField
[junit] Tests run: 16, Failures: 0, Errors: 0, Skipped: 0, Time elapsed: 0.004 sec
[junit] Running org.apache.poi.util.TestByteField
[junit] Tests run: 5, Failures: 0, Errors: 0, Skipped: 0, Time elapsed: 0.002 sec
[junit] Running org.apache.poi.util.TestHexDump
[junit] Tests run: 10, Failures: 0, Errors: 0, Skipped: 0, Time elapsed: 0.01 sec
[junit] Running org.apache.poi.util.TestIOUtils
[junit] Tests run: 20, Failures: 0, Errors: 0, Skipped: 0, Time elapsed: 0.026 sec
[junit] Running org.apache.poi.util.TestIntList
[junit] Tests run: 19, Failures: 0, Errors: 0, Skipped: 0, Time elapsed: 0.038 sec
[junit] Running org.apache.poi.util.TestIntegerField
[junit] Tests run: 5, Failures: 0, Errors: 0, Skipped: 0, Time elapsed: 0.002 sec
[junit] Running org.apache.poi.util.TestLittleEndian
[junit] Tests run: 15, Failures: 0, Errors: 0, Skipped: 0, Time elapsed: 0.003 sec
[junit] Running org.apache.poi.util.TestLittleEndianCP950Reader
[junit] Tests run: 1, Failures: 0, Errors: 0, Skipped: 0, Time elapsed: 0.002 sec
[junit] Running org.apache.poi.util.TestLittleEndianStreams
[junit] Tests run: 5, Failures: 0, Errors: 0, Skipped: 0, Time elapsed: 0.002 sec
[junit] Running org.apache.poi.util.TestLocaleUtil
[junit] Tests run: 3, Failures: 0, Errors: 0, Skipped: 0, Time elapsed: 0.001 sec
[junit] Running org.apache.poi.util.TestLongField
[junit] Tests run: 5, Failures: 0, Errors: 0, Skipped: 0, Time elapsed: 0.002 sec
[junit] Running org.apache.poi.util.TestPOILogFactory
[junit] Tests run: 1, Failures: 0, Errors: 0, Skipped: 0, Time elapsed: 0.001 sec
[junit] Running org.apache.poi.util.TestPOILogger
[junit] Tests run: 1, Failures: 0, Errors: 0, Skipped: 0, Time elapsed: 0.001 sec
[junit] Running org.apache.poi.util.TestRLEDecompressingInputStream
[junit] Tests run: 4, Failures: 0, Errors: 0, Skipped: 0, Time elapsed: 0.002 sec
[junit] Running org.apache.poi.util.TestShortField
[junit] Tests run: 5, Failures: 0, Errors: 0, Skipped: 0, Time elapsed: 0.002 sec
[junit] Running org.apache.poi.util.TestStaxHelper
[junit] Tests run: 3, Failures: 0, Errors: 0, Skipped: 0, Time elapsed: 0.007 sec
[junit] Running org.apache.poi.util.TestStringCodepointsIterable
[junit] Tests run: 1, Failures: 0, Errors: 0, Skipped: 0, Time elapsed: 0.002 sec
[junit] Running org.apache.poi.util.TestStringUtil
[junit] Tests run: 8, Failures: 0, Errors: 0, Skipped: 0, Time elapsed: 0.004 sec
[junit] Running org.apache.poi.util.TestTempFile
[junit] Tests run: 4, Failures: 0, Errors: 0, Skipped: 0, Time elapsed: 0.006 sec
[propertyreset] Warning: Nashorn engine is planned to be removed from a future JDK release
[propertyreset] Warning: Nashorn engine is planned to be removed from a future JDK release
-test-main-write-testfile:
-test-scratchpad-check:
test-scratchpad-download-resources:
test-scratchpad:
[script] Warning: Nashorn engine is planned to be removed from a future JDK release
[junit] Running org.apache.poi.TestJDK12
[junit] #
[junit] # A fatal error has been detected by the Java Runtime Environment:
[junit] #
[junit] # SIGSEGV (0xb) at pc=0x00007fda7cbe5529, pid=19166, tid=19169
[junit] #
[junit] # JRE version: OpenJDK Runtime Environment (13.0+4) (build 13-ea+4)
[junit] # Java VM: OpenJDK 64-Bit Server VM (13-ea+4, mixed mode, sharing, tiered, compressed oops, g1 gc, linux-amd64)
[junit] # Problematic frame:
[junit] # C [libc.so.6+0x15e529]
[junit] #
[junit] # No core dump will be written. Core dumps have been disabled. To enable core dumping, try "ulimit -c unlimited" before starting Java again
[junit] #
[junit] # An error report file with more information is saved as:
[junit] # <https://builds.apache.org/job/POI-DSL-1.13/ws/hs_err_pid19166.log>
[junit] #
[junit] # If you would like to submit a bug report, please visit:
[junit] # http://bugreport.java.com/bugreport/crash.jsp
[junit] # The crash happened outside the Java Virtual Machine in native code.
[junit] # See problematic frame for where to report the bug.
[junit] #
[junit] Running org.apache.poi.hwpf.usermodel.Batch-With-Multiple-Tests
[junit] Tests run: 1, Failures: 0, Errors: 1, Skipped: 0, Time elapsed: 0 sec
BUILD FAILED
<https://builds.apache.org/job/POI-DSL-1.13/ws/build.xml>:1559: The following error occurred while executing this line:
<https://builds.apache.org/job/POI-DSL-1.13/ws/build.xml>:1238: Tests failed (crashed)
Total time: 5 minutes 58 seconds
Build step 'Invoke Ant' marked build as failure
Skipping publisher since build result is FAILURE
Archiving artifacts
[Fast Archiver] No prior successful build to compare, so performing full copy of artifacts
Skipping publisher since build result is FAILURE
Recording test results
---------------------------------------------------------------------
To unsubscribe, e-mail: dev-unsubscribe@poi.apache.org
For additional commands, e-mail: dev-help@poi.apache.org
Build failed in Jenkins: POI-DSL-1.13 #3
Posted by Apache Jenkins Server <je...@builds.apache.org>.
See <https://builds.apache.org/job/POI-DSL-1.13/3/display/redirect?page=changes>
Changes:
[gallon] pulled *Cell.setCellValue(String), setCellValue(RichTextString) to the common base
[gallon] pulled *Cell.setCellValue(Date) and setCellValue(Calendar) to the common base
[gallon] pulled *Cell.setCellValue(double) to the common base
[gallon] pulled *Cell.getCellTypeEnum() to common base
[gallon] pulled *Cell.getAddress to common base
[gallon] purged usages of Cell.setCellType (left only in tests, where conversions are tested)
[gallon] made call Cell.setCellType(CellType.FORMULA) illegall. Deprecated Cell.setCellType(). Purged all redundant calls from project.
[gallon] purged calls to cell.setCellType(CellType.BLANK) from the project, replaced with setBlank()
[gallon] added Cell.setBlank() - as an alias, for now
[gallon] setCellFormula: blank cell gets value 0, non-blank value is preserved
[kiwiwings] try to fix missing modules error and move addOpens detection into ant build
[centic] Add required --add-opens and other settings for JDK 12 on Windows
------------------------------------------
[...truncated 586.67 KB...]
[junit] Reading openxml4j/OPCCompliance_CoreProperties_AlternateTimezones.docx with OPCFileHandler
[junit] Reading openxml4j/OPCCompliance_CoreProperties_DCTermsNamespaceLimitedUseFAIL.docx with XWPFFileHandler
[junit] Reading openxml4j/OPCCompliance_CoreProperties_DCTermsNamespaceLimitedUseFAIL.docx with OPCFileHandler
[junit] Reading openxml4j/OPCCompliance_CoreProperties_DoNotUseCompatibilityMarkupFAIL.docx with XWPFFileHandler
[junit] Reading openxml4j/OPCCompliance_CoreProperties_DoNotUseCompatibilityMarkupFAIL.docx with OPCFileHandler
[junit] Reading openxml4j/OPCCompliance_CoreProperties_LimitedXSITypeAttribute_NotPresentFAIL.docx with XWPFFileHandler
[junit] Reading openxml4j/OPCCompliance_CoreProperties_LimitedXSITypeAttribute_NotPresentFAIL.docx with OPCFileHandler
[junit] Reading openxml4j/OPCCompliance_CoreProperties_LimitedXSITypeAttribute_PresentWithUnauthorizedValueFAIL.docx with XWPFFileHandler
[junit] Reading openxml4j/OPCCompliance_CoreProperties_LimitedXSITypeAttribute_PresentWithUnauthorizedValueFAIL.docx with OPCFileHandler
[junit] Reading openxml4j/OPCCompliance_CoreProperties_OnlyOneCorePropertiesPart.docx with XWPFFileHandler
[junit] Reading openxml4j/OPCCompliance_CoreProperties_OnlyOneCorePropertiesPart.docx with OPCFileHandler
[junit] Reading openxml4j/OPCCompliance_CoreProperties_OnlyOneCorePropertiesPartFAIL.docx with XWPFFileHandler
[junit] Reading openxml4j/OPCCompliance_CoreProperties_OnlyOneCorePropertiesPartFAIL.docx with OPCFileHandler
[junit] Reading openxml4j/OPCCompliance_CoreProperties_SUCCESS.docx with XWPFFileHandler
[junit] Reading openxml4j/OPCCompliance_CoreProperties_SUCCESS.docx with OPCFileHandler
[junit] Reading openxml4j/OPCCompliance_CoreProperties_UnauthorizedXMLLangAttributeFAIL.docx with XWPFFileHandler
[junit] Reading openxml4j/OPCCompliance_CoreProperties_UnauthorizedXMLLangAttributeFAIL.docx with OPCFileHandler
[junit] Reading openxml4j/OPCCompliance_DerivedPartNameFAIL.docx with XWPFFileHandler
[junit] Reading openxml4j/OPCCompliance_DerivedPartNameFAIL.docx with OPCFileHandler
[junit] Reading openxml4j/OPCCompliance_NoCoreProperties.xlsx with XSSFFileHandler
[junit] Reading openxml4j/OPCCompliance_NoCoreProperties.xlsx with OPCFileHandler
[junit] Reading openxml4j/PackageRelsHasEntities.ooxml with OPCFileHandler
[junit] Reading openxml4j/TestCreatePackageOUTPUT.docx with XWPFFileHandler
[junit] Reading openxml4j/TestCreatePackageOUTPUT.docx with OPCFileHandler
[junit] Reading openxml4j/TestOpenPackageINPUT.docx with XWPFFileHandler
[junit] Reading openxml4j/TestOpenPackageINPUT.docx with OPCFileHandler
[junit] Reading openxml4j/TestOpenPackageOUTPUT.docx with XWPFFileHandler
[junit] Reading openxml4j/TestOpenPackageOUTPUT.docx with OPCFileHandler
[junit] Reading openxml4j/TestPackageCommon.docx with XWPFFileHandler
[junit] Reading openxml4j/TestPackageCommon.docx with OPCFileHandler
[junit] Reading openxml4j/TestPackageCoreProperiesGetters.docx with XWPFFileHandler
[junit] Reading openxml4j/TestPackageCoreProperiesGetters.docx with OPCFileHandler
[junit] Reading openxml4j/TestPackageCoreProperiesSetters.docx with XWPFFileHandler
[junit] Reading openxml4j/TestPackageCoreProperiesSetters.docx with OPCFileHandler
[junit] Reading openxml4j/TestPackageThumbnail.docx with XWPFFileHandler
[junit] Reading openxml4j/TestPackageThumbnail.docx with OPCFileHandler
[junit] Reading openxml4j/at.pzp.www_uploads_media_PP_Scheinecker-jdk6error.pptx with XSLFFileHandler
[junit] Reading openxml4j/at.pzp.www_uploads_media_PP_Scheinecker-jdk6error.pptx with OPCFileHandler
[junit] Reading openxml4j/bug-60626.vml with NullFileHandler
[junit] Reading openxml4j/dcterms_bug_56479.zip with OPCFileHandler
[junit] Reading openxml4j/invalid.xlsx with XSSFFileHandler
[junit] Reading openxml4j/invalid.xlsx with OPCFileHandler
[junit] Reading openxml4j/sample.docx with XWPFFileHandler
[junit] Reading openxml4j/sample.docx with OPCFileHandler
[junit] Reading openxml4j/sample.xlsx with XSSFFileHandler
[junit] Reading openxml4j/sample.xlsx with OPCFileHandler
[junit] Reading openxml4j/thumbnail.jpg with NullFileHandler
[junit] Reading poifs/20-Force-on-a-current-S00.doc with HWPFFileHandler
[junit] Reading poifs/20-Force-on-a-current-S00.doc with HPSFFileHandler
[junit] Reading poifs/60256.bin with NullFileHandler
[junit] Reading poifs/60320-protected.xlsx with XSSFFileHandler
[junit] Reading poifs/60320-protected.xlsx with OPCFileHandler
[junit] Reading poifs/61300.bin with NullFileHandler
[junit] Reading poifs/BlockSize4096.zvi with NullFileHandler
[junit] Reading poifs/BlockSize512.zvi with NullFileHandler
[junit] Reading poifs/Notes.ole2 with POIFSFileHandler
[junit] Reading poifs/ReferencesInvalidSectors.mpp with NullFileHandler
[junit] Reading poifs/ShortLastBlock.qwp with NullFileHandler
[junit] Reading poifs/ShortLastBlock.wps with NullFileHandler
[junit] Reading poifs/extenxls_pwd123.xlsx with XSSFFileHandler
[junit] Reading poifs/extenxls_pwd123.xlsx with OPCFileHandler
[junit] Reading poifs/multimedia.doc with HWPFFileHandler
[junit] Reading poifs/multimedia.doc with HPSFFileHandler
[junit] Reading poifs/oleObject1.bin with NullFileHandler
[junit] Reading poifs/only-zero-byte-streams.ole2 with POIFSFileHandler
[junit] Reading poifs/poitest.pfx with NullFileHandler
[junit] Reading poifs/protect.xlsx with XSSFFileHandler
[junit] Reading poifs/protect.xlsx with OPCFileHandler
[junit] Reading poifs/protected_agile.docx with XWPFFileHandler
[junit] Reading poifs/protected_agile.docx with OPCFileHandler
[junit] Reading poifs/protected_sha512.xlsx with XSSFFileHandler
[junit] Reading poifs/protected_sha512.xlsx with OPCFileHandler
[junit] Reading poifs/unknown_properties.msg with HSMFFileHandler
[junit] Reading project-header.svg with NullFileHandler
[junit] Reading publisher/51318.pub with HPBFFileHandler
[junit] Reading publisher/60685.pub with HPBFFileHandler
[junit] Reading publisher/LinkAt0And10.pub with HPBFFileHandler
[junit] Reading publisher/LinkAt10.pub with HPBFFileHandler
[junit] Reading publisher/LinkAt10And20And30.pub with HPBFFileHandler
[junit] Reading publisher/LinkAt10And20And30And40.pub with HPBFFileHandler
[junit] Reading publisher/LinkAt10Longer.pub with HPBFFileHandler
[junit] Reading publisher/LinkAt20.pub with HPBFFileHandler
[junit] Reading publisher/Sample.pub with HPBFFileHandler
[junit] Reading publisher/Sample.txt with NullFileHandler
[junit] Reading publisher/Sample2.pub with HPBFFileHandler
[junit] Reading publisher/Sample2.txt with NullFileHandler
[junit] Reading publisher/Sample2000.pub with HPBFFileHandler
[junit] Reading publisher/Sample2_2010.pub with HPBFFileHandler
[junit] Reading publisher/Sample3.pub with HPBFFileHandler
[junit] Reading publisher/Sample3.txt with NullFileHandler
[junit] Reading publisher/Sample3_2010.pub with HPBFFileHandler
[junit] Reading publisher/Sample4.pub with HPBFFileHandler
[junit] Reading publisher/Sample4.txt with NullFileHandler
[junit] Reading publisher/Sample4_2010.pub with HPBFFileHandler
[junit] Reading publisher/Sample98.pub with HPBFFileHandler
[junit] Reading publisher/SampleBrochure.pub with HPBFFileHandler
[junit] Reading publisher/SampleNewsletter.pub with HPBFFileHandler
[junit] Reading publisher/Sample_2010.pub with HPBFFileHandler
[junit] Reading publisher/Simple.pub with HPBFFileHandler
[junit] Reading slideshow/2411-Performance_Up.pptx with XSLFFileHandler
[junit] Reading slideshow/2411-Performance_Up.pptx with OPCFileHandler
[junit] Reading slideshow/37625.ppt with HSLFFileHandler
[junit] Reading slideshow/37625.ppt with HPSFFileHandler
[junit] Reading slideshow/38256.ppt with HSLFFileHandler
[junit] Reading slideshow/38256.ppt with HPSFFileHandler
[junit] Reading slideshow/41071.ppt with HSLFFileHandler
[junit] Reading slideshow/41071.ppt with HPSFFileHandler
[junit] Reading slideshow/41246-1.ppt with HSLFFileHandler
[junit] Reading slideshow/41246-1.ppt with HPSFFileHandler
[junit] Reading slideshow/41246-2.ppt with HSLFFileHandler
[junit] Reading slideshow/41246-2.ppt with HPSFFileHandler
[junit] Reading slideshow/41384.ppt with HSLFFileHandler
[junit] Reading slideshow/41384.ppt with HPSFFileHandler
[junit] Reading slideshow/42474-1.ppt with HSLFFileHandler
[junit] Reading slideshow/42474-1.ppt with HPSFFileHandler
[junit] Reading slideshow/42474-2.ppt with HSLFFileHandler
[junit] Reading slideshow/42474-2.ppt with HPSFFileHandler
[junit] Reading slideshow/42485.ppt with HSLFFileHandler
[junit] Reading slideshow/42485.ppt with HPSFFileHandler
[junit] Reading slideshow/42486.ppt with HSLFFileHandler
[junit] Reading slideshow/42486.ppt with HPSFFileHandler
[junit] Reading slideshow/42520.ppt with HSLFFileHandler
[junit] Reading slideshow/42520.ppt with HPSFFileHandler
[junit] Reading slideshow/43781.ppt with HSLFFileHandler
[junit] Reading slideshow/43781.ppt with HPSFFileHandler
[junit] Reading slideshow/44296.ppt with HSLFFileHandler
[junit] Reading slideshow/44296.ppt with HPSFFileHandler
[junit] Reading slideshow/44770.ppt with HSLFFileHandler
[junit] Reading slideshow/44770.ppt with HPSFFileHandler
[junit] Reading slideshow/45537_Footer.ppt with HSLFFileHandler
[junit] Reading slideshow/45537_Footer.ppt with HPSFFileHandler
[junit] Reading slideshow/45537_Header.ppt with HSLFFileHandler
[junit] Reading slideshow/45537_Header.ppt with HPSFFileHandler
[junit] Reading slideshow/45541_Footer.pptx with XSLFFileHandler
[junit] Reading slideshow/45541_Footer.pptx with OPCFileHandler
[junit] Reading slideshow/45541_Header.pptx with XSLFFileHandler
[junit] Reading slideshow/45541_Header.pptx with OPCFileHandler
[junit] Reading slideshow/45543.ppt with HSLFFileHandler
[junit] Reading slideshow/45543.ppt with HPSFFileHandler
[junit] Reading slideshow/45545_Comment.pptx with XSLFFileHandler
[junit] Reading slideshow/45545_Comment.pptx with OPCFileHandler
[junit] Reading slideshow/45776.ppt with HSLFFileHandler
[junit] Reading slideshow/45776.ppt with HPSFFileHandler
[junit] Reading slideshow/47261.ppt with HSLFFileHandler
[junit] Reading slideshow/47261.ppt with HPSFFileHandler
[junit] Reading slideshow/49386-null_dates.pptx with XSLFFileHandler
[junit] Reading slideshow/49386-null_dates.pptx with OPCFileHandler
[junit] Reading slideshow/49541_symbol_map.ppt with HSLFFileHandler
[junit] Reading slideshow/49541_symbol_map.ppt with HPSFFileHandler
[junit] Reading slideshow/49648.ppt with HSLFFileHandler
[junit] Reading slideshow/49648.ppt with HPSFFileHandler
[junit] Reading slideshow/51187.pptx with XSLFFileHandler
[junit] Reading slideshow/51187.pptx with OPCFileHandler
[junit] Reading slideshow/51731.ppt with HSLFFileHandler
[junit] Reading slideshow/51731.ppt with HPSFFileHandler
[junit] Reading slideshow/52244.ppt with HSLFFileHandler
[junit] Reading slideshow/52244.ppt with HPSFFileHandler
[junit] Reading slideshow/52599.ppt with HSLFFileHandler
[junit] Reading slideshow/52599.ppt with HPSFFileHandler
[junit] Reading slideshow/53446.ppt with HSLFFileHandler
[junit] Reading slideshow/53446.ppt with HPSFFileHandler
[junit] Reading slideshow/54111.ppt with HSLFFileHandler
[junit] Reading slideshow/54111.ppt with HPSFFileHandler
[junit] Reading slideshow/54332a.ppt with HSLFFileHandler
[junit] Reading slideshow/54332a.ppt with HPSFFileHandler
[junit] Reading slideshow/54332b.ppt with HSLFFileHandler
[junit] Reading slideshow/54332b.ppt with HPSFFileHandler
[junit] Reading slideshow/54541_cropped_bitmap.ppt with HSLFFileHandler
[junit] Reading slideshow/54541_cropped_bitmap.ppt with HPSFFileHandler
[junit] Reading slideshow/54541_cropped_bitmap2.ppt with HSLFFileHandler
[junit] Reading slideshow/54541_cropped_bitmap2.ppt with HPSFFileHandler
[junit] Reading slideshow/54542_cropped_bitmap.pptx with XSLFFileHandler
[junit] Reading slideshow/54542_cropped_bitmap.pptx with OPCFileHandler
[junit] Reading slideshow/54722.ppt with HSLFFileHandler
[junit] Reading slideshow/54722.ppt with HPSFFileHandler
[junit] Reading slideshow/54880_chinese.ppt with HSLFFileHandler
[junit] Reading slideshow/54880_chinese.ppt with HPSFFileHandler
[junit] Reading slideshow/56260.ppt with HSLFFileHandler
[junit] Reading slideshow/56260.ppt with HPSFFileHandler
[junit] Reading slideshow/56812.pptx with XSLFFileHandler
[junit] Reading slideshow/56812.pptx with OPCFileHandler
[junit] Reading slideshow/57272_corrupted_usereditatom.ppt with HSLFFileHandler
[junit] Reading slideshow/57272_corrupted_usereditatom.ppt with HPSFFileHandler
[junit] Reading slideshow/59302.ppt with HSLFFileHandler
[junit] Reading slideshow/59302.ppt with HPSFFileHandler
[junit] Reading slideshow/60003.ppt with HSLFFileHandler
[junit] Reading slideshow/60003.ppt with HPSFFileHandler
[junit] Reading slideshow/60042.pptx with XSLFFileHandler
[junit] Reading slideshow/60042.pptx with OPCFileHandler
[junit] Reading slideshow/60294.ppt with HSLFFileHandler
[junit] Reading slideshow/60294.ppt with HPSFFileHandler
[junit] Reading slideshow/60810.pptx with XSLFFileHandler
[junit] Reading slideshow/60810.pptx with OPCFileHandler
[junit] Reading slideshow/61338.wmf with NullFileHandler
[junit] Reading slideshow/61515.pptx with XSLFFileHandler
[junit] Reading slideshow/61515.pptx with OPCFileHandler
[junit] Reading slideshow/Divino_Revelado.pptx with XSLFFileHandler
[junit] Reading slideshow/Divino_Revelado.pptx with OPCFileHandler
[junit] Reading slideshow/KEY02.pptx with XSLFFileHandler
[junit] Reading slideshow/KEY02.pptx with OPCFileHandler
[junit] Reading slideshow/OverlappingRelations.pptx with XSLFFileHandler
[junit] Reading slideshow/OverlappingRelations.pptx with OPCFileHandler
[junit] Reading slideshow/PPT95.ppt with HSLFFileHandler
[junit] Reading slideshow/PPT95.ppt with HPSFFileHandler
[junit] Reading slideshow/PPTWithAttachments.pptm with XSLFFileHandler
[junit] Reading slideshow/PPTWithAttachments.pptm with OPCFileHandler
[junit] Reading slideshow/ParagraphStylesShorterThanCharStyles.ppt with HSLFFileHandler
[junit] Reading slideshow/ParagraphStylesShorterThanCharStyles.ppt with HPSFFileHandler
[junit] Reading slideshow/Password_Protected-56-hello.ppt with HSLFFileHandler
[junit] Reading slideshow/Password_Protected-56-hello.ppt with HPSFFileHandler
[junit] Reading slideshow/Password_Protected-hello.ppt with HSLFFileHandler
[junit] Reading slideshow/Password_Protected-hello.ppt with HPSFFileHandler
[junit] Reading slideshow/Password_Protected-np-hello.ppt with HSLFFileHandler
[junit] Reading slideshow/Password_Protected-np-hello.ppt with HPSFFileHandler
[junit] Reading slideshow/PictureTypeZero.ppt with HSLFFileHandler
[junit] #
[junit] # A fatal error has been detected by the Java Runtime Environment:
[junit] #
[junit] # SIGSEGV (0xb) at pc=0x00007f7250419ec6, pid=13554, tid=13557
[junit] #
[junit] # JRE version: OpenJDK Runtime Environment (13.0+4) (build 13-ea+4)
[junit] # Java VM: OpenJDK 64-Bit Server VM (13-ea+4, mixed mode, sharing, tiered, compressed oops, g1 gc, linux-amd64)
[junit] # Problematic frame:
[junit] # C [libc.so.6+0x15fec6]
[junit] #
[junit] # No core dump will be written. Core dumps have been disabled. To enable core dumping, try "ulimit -c unlimited" before starting Java again
[junit] #
[junit] # An error report file with more information is saved as:
[junit] # <https://builds.apache.org/job/POI-DSL-1.13/ws/hs_err_pid13554.log>
[junit] #
[junit] # If you would like to submit a bug report, please visit:
[junit] # http://bugreport.java.com/bugreport/crash.jsp
[junit] # The crash happened outside the Java Virtual Machine in native code.
[junit] # See problematic frame for where to report the bug.
[junit] #
[junit] Running org.apache.poi.TestAllFiles
[junit] Tests run: 1, Failures: 0, Errors: 1, Skipped: 0, Time elapsed: 0 sec
BUILD FAILED
<https://builds.apache.org/job/POI-DSL-1.13/ws/build.xml>:1647: The following error occurred while executing this line:
<https://builds.apache.org/job/POI-DSL-1.13/ws/build.xml>:1238: Test org.apache.poi.TestAllFiles failed (crashed)
Total time: 17 minutes 28 seconds
Build step 'Invoke Ant' marked build as failure
Skipping publisher since build result is FAILURE
Archiving artifacts
[Fast Archiver] No prior successful build to compare, so performing full copy of artifacts
Skipping publisher since build result is FAILURE
Recording test results
---------------------------------------------------------------------
To unsubscribe, e-mail: dev-unsubscribe@poi.apache.org
For additional commands, e-mail: dev-help@poi.apache.org