You are viewing a plain text version of this content. The canonical link for it is here.
Posted to commits@beam.apache.org by Apache Jenkins Server <je...@builds.apache.org> on 2018/06/26 18:31:15 UTC

Build failed in Jenkins: beam_PerformanceTests_TextIOIT_HDFS #354

See <https://builds.apache.org/job/beam_PerformanceTests_TextIOIT_HDFS/354/display/redirect?page=changes>

Changes:

[daniel.o.programmer] [BEAM-2937] Comment Combine Grouped Values URN.

[daniel.o.programmer] [BEAM-2973] Moving CombineValues URN to different enum.

[apilloud] [SQL] Don't wait on Unbounded PCollections

[daniel.o.programmer] [BEAM-3708] Adding Combine component implementations to Java SDK

[daniel.o.programmer] Quick fix, removing commented out code.

------------------------------------------
[...truncated 224.50 KB...]
Build cache key for task ':beam-runners-google-cloud-dataflow-java:shadowJar' is fa4b11f439488361fe29d3fe90f8e030
Caching disabled for task ':beam-runners-google-cloud-dataflow-java:shadowJar': Caching has not been enabled for the task
Skipping task ':beam-runners-google-cloud-dataflow-java:shadowJar' as it is up-to-date.
:beam-runners-google-cloud-dataflow-java:shadowJar (Thread[Task worker for ':' Thread 11,5,main]) completed. Took 0.015 secs.

> Task :beam-sdks-java-core:compileTestJava UP-TO-DATE
Build cache key for task ':beam-sdks-java-core:compileTestJava' is 366029909c59d966ca9bd1b46246b8f6
Skipping task ':beam-sdks-java-core:compileTestJava' as it is up-to-date.
:beam-sdks-java-core:compileTestJava (Thread[Task worker for ':' Thread 15,5,main]) completed. Took 0.288 secs.
:beam-sdks-java-core:processTestResources (Thread[Task worker for ':' Thread 15,5,main]) started.

> Task :beam-sdks-java-core:processTestResources NO-SOURCE
file or directory '<https://builds.apache.org/job/beam_PerformanceTests_TextIOIT_HDFS/ws/src/sdks/java/core/src/test/resources',> not found
Skipping task ':beam-sdks-java-core:processTestResources' as it has no source files and no previous output files.
:beam-sdks-java-core:processTestResources (Thread[Task worker for ':' Thread 15,5,main]) completed. Took 0.001 secs.
:beam-sdks-java-core:testClasses (Thread[Task worker for ':' Thread 15,5,main]) started.

> Task :beam-sdks-java-core:testClasses UP-TO-DATE
Skipping task ':beam-sdks-java-core:testClasses' as it has no actions.
:beam-sdks-java-core:testClasses (Thread[Task worker for ':' Thread 15,5,main]) completed. Took 0.0 secs.
:beam-sdks-java-core:shadowTestJar (Thread[Task worker for ':' Thread 15,5,main]) started.

> Task :beam-sdks-java-core:shadowTestJar UP-TO-DATE
Build cache key for task ':beam-sdks-java-core:shadowTestJar' is 76d678c892c0e55a4a8c89bfe2c09e41
Caching disabled for task ':beam-sdks-java-core:shadowTestJar': Caching has not been enabled for the task
Skipping task ':beam-sdks-java-core:shadowTestJar' as it is up-to-date.
:beam-sdks-java-core:shadowTestJar (Thread[Task worker for ':' Thread 15,5,main]) completed. Took 0.061 secs.
:beam-sdks-java-extensions-google-cloud-platform-core:compileTestJava (Thread[Task worker for ':' Thread 15,5,main]) started.

> Task :beam-sdks-java-harness:compileJava
Build cache key for task ':beam-sdks-java-harness:compileJava' is 85e20866f9bd7f80a1b0046bef156ae8
Task ':beam-sdks-java-harness:compileJava' is not up-to-date because:
  Task has failed previously.
Custom actions are attached to task ':beam-sdks-java-harness:compileJava'.
All input files are considered out-of-date for incremental task ':beam-sdks-java-harness:compileJava'.
Compiling with error-prone compiler

> Task :beam-sdks-java-harness:compileJava FAILED
:beam-sdks-java-harness:compileJava (Thread[main,5,main]) completed. Took 4.332 secs.

> Task :beam-sdks-java-extensions-google-cloud-platform-core:compileTestJava
Build cache key for task ':beam-sdks-java-extensions-google-cloud-platform-core:compileTestJava' is 1c20458fdc8e8ffa548f13dc62430af9
Task ':beam-sdks-java-extensions-google-cloud-platform-core:compileTestJava' is not up-to-date because:
  No history is available.
Custom actions are attached to task ':beam-sdks-java-extensions-google-cloud-platform-core:compileTestJava'.
All input files are considered out-of-date for incremental task ':beam-sdks-java-extensions-google-cloud-platform-core:compileTestJava'.
Compiling with error-prone compiler
Packing task ':beam-sdks-java-extensions-google-cloud-platform-core:compileTestJava'
:beam-sdks-java-extensions-google-cloud-platform-core:compileTestJava (Thread[Task worker for ':' Thread 15,5,main]) completed. Took 5.939 secs.

Deprecated Gradle features were used in this build, making it incompatible with Gradle 5.0.
See https://docs.gradle.org/4.8/userguide/command_line_interface.html#sec:command_line_warnings
54 actionable tasks: 2 executed, 52 up-to-date

Publishing build scan...
https://gradle.com/s/7tffsckfzglo4


STDERR: <https://builds.apache.org/job/beam_PerformanceTests_TextIOIT_HDFS/ws/src/sdks/java/harness/src/main/java/org/apache/beam/fn/harness/CombineRunners.java>:53: error: cannot find symbol
          BeamUrns.getUrn(StandardPTransforms.Composites.COMBINE_GROUPED_VALUES),
                                                        ^
  symbol:   variable COMBINE_GROUPED_VALUES
  location: class Composites
Note: <https://builds.apache.org/job/beam_PerformanceTests_TextIOIT_HDFS/ws/src/sdks/java/harness/src/main/java/org/apache/beam/fn/harness/state/FnApiStateAccessor.java> uses or overrides a deprecated API.
Note: Recompile with -Xlint:deprecation for details.
Note: Some input files use unchecked or unsafe operations.
Note: Recompile with -Xlint:unchecked for details.
1 error

FAILURE: Build failed with an exception.

* What went wrong:
Execution failed for task ':beam-sdks-java-harness:compileJava'.
> Compilation failed with exit code 1; see the compiler error output for details.

* Try:
Run with --debug option to get more log output. Run with --scan to get full insights.

* Exception is:
org.gradle.api.tasks.TaskExecutionException: Execution failed for task ':beam-sdks-java-harness:compileJava'.
	at org.gradle.api.internal.tasks.execution.ExecuteActionsTaskExecuter.executeActions(ExecuteActionsTaskExecuter.java:110)
	at org.gradle.api.internal.tasks.execution.ExecuteActionsTaskExecuter.execute(ExecuteActionsTaskExecuter.java:77)
	at org.gradle.api.internal.tasks.execution.OutputDirectoryCreatingTaskExecuter.execute(OutputDirectoryCreatingTaskExecuter.java:51)
	at org.gradle.api.internal.tasks.execution.SkipCachedTaskExecuter.execute(SkipCachedTaskExecuter.java:105)
	at org.gradle.api.internal.tasks.execution.SkipUpToDateTaskExecuter.execute(SkipUpToDateTaskExecuter.java:59)
	at org.gradle.api.internal.tasks.execution.ResolveTaskOutputCachingStateExecuter.execute(ResolveTaskOutputCachingStateExecuter.java:54)
	at org.gradle.api.internal.tasks.execution.ResolveBuildCacheKeyExecuter.execute(ResolveBuildCacheKeyExecuter.java:66)
	at org.gradle.api.internal.tasks.execution.ValidatingTaskExecuter.execute(ValidatingTaskExecuter.java:59)
	at org.gradle.api.internal.tasks.execution.SkipEmptySourceFilesTaskExecuter.execute(SkipEmptySourceFilesTaskExecuter.java:101)
	at org.gradle.api.internal.tasks.execution.FinalizeInputFilePropertiesTaskExecuter.execute(FinalizeInputFilePropertiesTaskExecuter.java:44)
	at org.gradle.api.internal.tasks.execution.CleanupStaleOutputsExecuter.execute(CleanupStaleOutputsExecuter.java:91)
	at org.gradle.api.internal.tasks.execution.ResolveTaskArtifactStateTaskExecuter.execute(ResolveTaskArtifactStateTaskExecuter.java:62)
	at org.gradle.api.internal.tasks.execution.SkipTaskWithNoActionsExecuter.execute(SkipTaskWithNoActionsExecuter.java:59)
	at org.gradle.api.internal.tasks.execution.SkipOnlyIfTaskExecuter.execute(SkipOnlyIfTaskExecuter.java:54)
	at org.gradle.api.internal.tasks.execution.ExecuteAtMostOnceTaskExecuter.execute(ExecuteAtMostOnceTaskExecuter.java:43)
	at org.gradle.api.internal.tasks.execution.CatchExceptionTaskExecuter.execute(CatchExceptionTaskExecuter.java:34)
	at org.gradle.api.internal.tasks.execution.EventFiringTaskExecuter$1.run(EventFiringTaskExecuter.java:51)
	at org.gradle.internal.operations.DefaultBuildOperationExecutor$RunnableBuildOperationWorker.execute(DefaultBuildOperationExecutor.java:317)
	at org.gradle.internal.operations.DefaultBuildOperationExecutor$RunnableBuildOperationWorker.execute(DefaultBuildOperationExecutor.java:309)
	at org.gradle.internal.operations.DefaultBuildOperationExecutor.execute(DefaultBuildOperationExecutor.java:185)
	at org.gradle.internal.operations.DefaultBuildOperationExecutor.run(DefaultBuildOperationExecutor.java:97)
	at org.gradle.internal.operations.DelegatingBuildOperationExecutor.run(DelegatingBuildOperationExecutor.java:31)
	at org.gradle.api.internal.tasks.execution.EventFiringTaskExecuter.execute(EventFiringTaskExecuter.java:46)
	at org.gradle.execution.taskgraph.DefaultTaskExecutionGraph$ExecuteTaskAction.execute(DefaultTaskExecutionGraph.java:262)
	at org.gradle.execution.taskgraph.DefaultTaskExecutionGraph$ExecuteTaskAction.execute(DefaultTaskExecutionGraph.java:246)
	at org.gradle.execution.taskgraph.DefaultTaskPlanExecutor$TaskExecutorWorker$1.execute(DefaultTaskPlanExecutor.java:136)
	at org.gradle.execution.taskgraph.DefaultTaskPlanExecutor$TaskExecutorWorker$1.execute(DefaultTaskPlanExecutor.java:130)
	at org.gradle.execution.taskgraph.DefaultTaskPlanExecutor$TaskExecutorWorker.execute(DefaultTaskPlanExecutor.java:201)
	at org.gradle.execution.taskgraph.DefaultTaskPlanExecutor$TaskExecutorWorker.executeWithTask(DefaultTaskPlanExecutor.java:192)
	at org.gradle.execution.taskgraph.DefaultTaskPlanExecutor$TaskExecutorWorker.run(DefaultTaskPlanExecutor.java:130)
	at org.gradle.execution.taskgraph.DefaultTaskPlanExecutor.process(DefaultTaskPlanExecutor.java:74)
	at org.gradle.execution.taskgraph.DefaultTaskExecutionGraph.execute(DefaultTaskExecutionGraph.java:131)
	at org.gradle.execution.SelectedTaskExecutionAction.execute(SelectedTaskExecutionAction.java:37)
	at org.gradle.execution.DefaultBuildExecuter.execute(DefaultBuildExecuter.java:37)
	at org.gradle.execution.DefaultBuildExecuter.access$000(DefaultBuildExecuter.java:23)
	at org.gradle.execution.DefaultBuildExecuter$1.proceed(DefaultBuildExecuter.java:43)
	at org.gradle.execution.DryRunBuildExecutionAction.execute(DryRunBuildExecutionAction.java:46)
	at org.gradle.execution.DefaultBuildExecuter.execute(DefaultBuildExecuter.java:37)
	at org.gradle.execution.DefaultBuildExecuter.execute(DefaultBuildExecuter.java:30)
	at org.gradle.initialization.DefaultGradleLauncher$ExecuteTasks.run(DefaultGradleLauncher.java:343)
	at org.gradle.internal.operations.DefaultBuildOperationExecutor$RunnableBuildOperationWorker.execute(DefaultBuildOperationExecutor.java:317)
	at org.gradle.internal.operations.DefaultBuildOperationExecutor$RunnableBuildOperationWorker.execute(DefaultBuildOperationExecutor.java:309)
	at org.gradle.internal.operations.DefaultBuildOperationExecutor.execute(DefaultBuildOperationExecutor.java:185)
	at org.gradle.internal.operations.DefaultBuildOperationExecutor.run(DefaultBuildOperationExecutor.java:97)
	at org.gradle.internal.operations.DelegatingBuildOperationExecutor.run(DelegatingBuildOperationExecutor.java:31)
	at org.gradle.initialization.DefaultGradleLauncher.runTasks(DefaultGradleLauncher.java:212)
	at org.gradle.initialization.DefaultGradleLauncher.doBuildStages(DefaultGradleLauncher.java:140)
	at org.gradle.initialization.DefaultGradleLauncher.executeTasks(DefaultGradleLauncher.java:115)
	at org.gradle.internal.invocation.GradleBuildController$1.call(GradleBuildController.java:77)
	at org.gradle.internal.invocation.GradleBuildController$1.call(GradleBuildController.java:74)
	at org.gradle.internal.work.DefaultWorkerLeaseService.withLocks(DefaultWorkerLeaseService.java:152)
	at org.gradle.internal.work.StopShieldingWorkerLeaseService.withLocks(StopShieldingWorkerLeaseService.java:38)
	at org.gradle.internal.invocation.GradleBuildController.doBuild(GradleBuildController.java:96)
	at org.gradle.internal.invocation.GradleBuildController.run(GradleBuildController.java:74)
	at org.gradle.tooling.internal.provider.ExecuteBuildActionRunner.run(ExecuteBuildActionRunner.java:28)
	at org.gradle.launcher.exec.ChainingBuildActionRunner.run(ChainingBuildActionRunner.java:35)
	at org.gradle.tooling.internal.provider.ValidatingBuildActionRunner.run(ValidatingBuildActionRunner.java:32)
	at org.gradle.launcher.exec.RunAsBuildOperationBuildActionRunner$3.run(RunAsBuildOperationBuildActionRunner.java:47)
	at org.gradle.internal.operations.DefaultBuildOperationExecutor$RunnableBuildOperationWorker.execute(DefaultBuildOperationExecutor.java:317)
	at org.gradle.internal.operations.DefaultBuildOperationExecutor$RunnableBuildOperationWorker.execute(DefaultBuildOperationExecutor.java:309)
	at org.gradle.internal.operations.DefaultBuildOperationExecutor.execute(DefaultBuildOperationExecutor.java:185)
	at org.gradle.internal.operations.DefaultBuildOperationExecutor.run(DefaultBuildOperationExecutor.java:97)
	at org.gradle.internal.operations.DelegatingBuildOperationExecutor.run(DelegatingBuildOperationExecutor.java:31)
	at org.gradle.launcher.exec.RunAsBuildOperationBuildActionRunner.run(RunAsBuildOperationBuildActionRunner.java:43)
	at org.gradle.tooling.internal.provider.SubscribableBuildActionRunner.run(SubscribableBuildActionRunner.java:51)
	at org.gradle.launcher.exec.InProcessBuildActionExecuter$1.transform(InProcessBuildActionExecuter.java:50)
	at org.gradle.launcher.exec.InProcessBuildActionExecuter$1.transform(InProcessBuildActionExecuter.java:46)
	at org.gradle.composite.internal.DefaultRootBuildState.run(DefaultRootBuildState.java:65)
	at org.gradle.launcher.exec.InProcessBuildActionExecuter.execute(InProcessBuildActionExecuter.java:46)
	at org.gradle.launcher.exec.InProcessBuildActionExecuter.execute(InProcessBuildActionExecuter.java:32)
	at org.gradle.launcher.exec.BuildTreeScopeBuildActionExecuter.execute(BuildTreeScopeBuildActionExecuter.java:39)
	at org.gradle.launcher.exec.BuildTreeScopeBuildActionExecuter.execute(BuildTreeScopeBuildActionExecuter.java:25)
	at org.gradle.tooling.internal.provider.ContinuousBuildActionExecuter.execute(ContinuousBuildActionExecuter.java:80)
	at org.gradle.tooling.internal.provider.ContinuousBuildActionExecuter.execute(ContinuousBuildActionExecuter.java:53)
	at org.gradle.tooling.internal.provider.ServicesSetupBuildActionExecuter.execute(ServicesSetupBuildActionExecuter.java:62)
	at org.gradle.tooling.internal.provider.ServicesSetupBuildActionExecuter.execute(ServicesSetupBuildActionExecuter.java:34)
	at org.gradle.tooling.internal.provider.GradleThreadBuildActionExecuter.execute(GradleThreadBuildActionExecuter.java:36)
	at org.gradle.tooling.internal.provider.GradleThreadBuildActionExecuter.execute(GradleThreadBuildActionExecuter.java:25)
	at org.gradle.tooling.internal.provider.ParallelismConfigurationBuildActionExecuter.execute(ParallelismConfigurationBuildActionExecuter.java:43)
	at org.gradle.tooling.internal.provider.ParallelismConfigurationBuildActionExecuter.execute(ParallelismConfigurationBuildActionExecuter.java:29)
	at org.gradle.tooling.internal.provider.StartParamsValidatingActionExecuter.execute(StartParamsValidatingActionExecuter.java:59)
	at org.gradle.tooling.internal.provider.StartParamsValidatingActionExecuter.execute(StartParamsValidatingActionExecuter.java:31)
	at org.gradle.tooling.internal.provider.SessionFailureReportingActionExecuter.execute(SessionFailureReportingActionExecuter.java:59)
	at org.gradle.tooling.internal.provider.SessionFailureReportingActionExecuter.execute(SessionFailureReportingActionExecuter.java:44)
	at org.gradle.tooling.internal.provider.SetupLoggingActionExecuter.execute(SetupLoggingActionExecuter.java:46)
	at org.gradle.tooling.internal.provider.SetupLoggingActionExecuter.execute(SetupLoggingActionExecuter.java:30)
	at org.gradle.launcher.cli.RunBuildAction.run(RunBuildAction.java:52)
	at org.gradle.internal.Actions$RunnableActionAdapter.execute(Actions.java:173)
	at org.gradle.launcher.cli.CommandLineActionFactory$ParseAndBuildAction.execute(CommandLineActionFactory.java:379)
	at org.gradle.launcher.cli.CommandLineActionFactory$ParseAndBuildAction.execute(CommandLineActionFactory.java:352)
	at org.gradle.launcher.cli.ExceptionReportingAction.execute(ExceptionReportingAction.java:37)
	at org.gradle.launcher.cli.ExceptionReportingAction.execute(ExceptionReportingAction.java:23)
	at org.gradle.launcher.cli.CommandLineActionFactory$WithLogging.execute(CommandLineActionFactory.java:345)
	at org.gradle.launcher.cli.CommandLineActionFactory$WithLogging.execute(CommandLineActionFactory.java:275)
	at org.gradle.launcher.Main.doAction(Main.java:36)
	at org.gradle.launcher.bootstrap.EntryPoint.run(EntryPoint.java:45)
	at org.gradle.launcher.bootstrap.ProcessBootstrap.runNoExit(ProcessBootstrap.java:60)
	at org.gradle.launcher.bootstrap.ProcessBootstrap.run(ProcessBootstrap.java:37)
	at org.gradle.launcher.GradleMain.main(GradleMain.java:23)
	at org.gradle.wrapper.BootstrapMainStarter.start(BootstrapMainStarter.java:31)
	at org.gradle.wrapper.WrapperExecutor.execute(WrapperExecutor.java:108)
	at org.gradle.wrapper.GradleWrapperMain.main(GradleWrapperMain.java:61)
Caused by: org.gradle.api.internal.tasks.compile.CompilationFailedException: Compilation failed with exit code 1; see the compiler error output for details.
	at net.ltgt.gradle.errorprone.ErrorProneCompiler.execute(ErrorProneCompiler.java:74)
	at net.ltgt.gradle.errorprone.ErrorProneCompiler.execute(ErrorProneCompiler.java:23)
	at org.gradle.api.internal.tasks.compile.NormalizingJavaCompiler.delegateAndHandleErrors(NormalizingJavaCompiler.java:86)
	at org.gradle.api.internal.tasks.compile.NormalizingJavaCompiler.execute(NormalizingJavaCompiler.java:47)
	at org.gradle.api.internal.tasks.compile.NormalizingJavaCompiler.execute(NormalizingJavaCompiler.java:33)
	at org.gradle.api.internal.tasks.compile.CleaningJavaCompilerSupport.execute(CleaningJavaCompilerSupport.java:40)
	at org.gradle.api.internal.tasks.compile.CleaningJavaCompilerSupport.execute(CleaningJavaCompilerSupport.java:27)
	at org.gradle.api.tasks.compile.JavaCompile.performCompilation(JavaCompile.java:161)
	at org.gradle.api.tasks.compile.JavaCompile.compile(JavaCompile.java:146)
	at org.gradle.api.tasks.compile.JavaCompile.compile(JavaCompile.java:118)
	at org.gradle.internal.reflect.JavaMethod.invoke(JavaMethod.java:73)
	at org.gradle.api.internal.project.taskfactory.IncrementalTaskAction.doExecute(IncrementalTaskAction.java:50)
	at org.gradle.api.internal.project.taskfactory.StandardTaskAction.execute(StandardTaskAction.java:39)
	at org.gradle.api.internal.project.taskfactory.StandardTaskAction.execute(StandardTaskAction.java:26)
	at org.gradle.api.internal.tasks.execution.ExecuteActionsTaskExecuter$1.run(ExecuteActionsTaskExecuter.java:131)
	at org.gradle.internal.operations.DefaultBuildOperationExecutor$RunnableBuildOperationWorker.execute(DefaultBuildOperationExecutor.java:317)
	at org.gradle.internal.operations.DefaultBuildOperationExecutor$RunnableBuildOperationWorker.execute(DefaultBuildOperationExecutor.java:309)
	at org.gradle.internal.operations.DefaultBuildOperationExecutor.execute(DefaultBuildOperationExecutor.java:185)
	at org.gradle.internal.operations.DefaultBuildOperationExecutor.run(DefaultBuildOperationExecutor.java:97)
	at org.gradle.internal.operations.DelegatingBuildOperationExecutor.run(DelegatingBuildOperationExecutor.java:31)
	at org.gradle.api.internal.tasks.execution.ExecuteActionsTaskExecuter.executeAction(ExecuteActionsTaskExecuter.java:120)
	at org.gradle.api.internal.tasks.execution.ExecuteActionsTaskExecuter.executeActions(ExecuteActionsTaskExecuter.java:99)
	... 101 more


* Get more help at https://help.gradle.org

BUILD FAILED in 18s

2018-06-26 18:29:25,154 bdc18942 MainThread beam_integration_benchmark(1/1) ERROR    Error during benchmark beam_integration_benchmark
Traceback (most recent call last):
  File "<https://builds.apache.org/job/beam_PerformanceTests_TextIOIT_HDFS/ws/PerfKitBenchmarker/perfkitbenchmarker/pkb.py",> line 667, in RunBenchmark
    DoRunPhase(spec, collector, detailed_timer)
  File "<https://builds.apache.org/job/beam_PerformanceTests_TextIOIT_HDFS/ws/PerfKitBenchmarker/perfkitbenchmarker/pkb.py",> line 547, in DoRunPhase
    samples = spec.BenchmarkRun(spec)
  File "<https://builds.apache.org/job/beam_PerformanceTests_TextIOIT_HDFS/ws/PerfKitBenchmarker/perfkitbenchmarker/linux_benchmarks/beam_integration_benchmark.py",> line 159, in Run
    job_type=job_type)
  File "<https://builds.apache.org/job/beam_PerformanceTests_TextIOIT_HDFS/ws/PerfKitBenchmarker/perfkitbenchmarker/providers/gcp/gcp_dpb_dataflow.py",> line 90, in SubmitJob
    assert retcode == 0, "Integration Test Failed."
AssertionError: Integration Test Failed.
2018-06-26 18:29:25,155 bdc18942 MainThread beam_integration_benchmark(1/1) INFO     Cleaning up benchmark beam_integration_benchmark
2018-06-26 18:29:25,156 bdc18942 MainThread beam_integration_benchmark(1/1) INFO     Running: kubectl --kubeconfig=<https://builds.apache.org/job/beam_PerformanceTests_TextIOIT_HDFS/ws/config-beam-performancetests-textioit-hdfs-354> delete -f <https://builds.apache.org/job/beam_PerformanceTests_TextIOIT_HDFS/ws/src/.test-infra/kubernetes/hadoop/LargeITCluster/hdfs-multi-datanode-cluster.yml> --ignore-not-found
2018-06-26 18:31:14,663 bdc18942 MainThread beam_integration_benchmark(1/1) ERROR    Exception running benchmark
Traceback (most recent call last):
  File "<https://builds.apache.org/job/beam_PerformanceTests_TextIOIT_HDFS/ws/PerfKitBenchmarker/perfkitbenchmarker/pkb.py",> line 801, in RunBenchmarkTask
    RunBenchmark(spec, collector)
  File "<https://builds.apache.org/job/beam_PerformanceTests_TextIOIT_HDFS/ws/PerfKitBenchmarker/perfkitbenchmarker/pkb.py",> line 667, in RunBenchmark
    DoRunPhase(spec, collector, detailed_timer)
  File "<https://builds.apache.org/job/beam_PerformanceTests_TextIOIT_HDFS/ws/PerfKitBenchmarker/perfkitbenchmarker/pkb.py",> line 547, in DoRunPhase
    samples = spec.BenchmarkRun(spec)
  File "<https://builds.apache.org/job/beam_PerformanceTests_TextIOIT_HDFS/ws/PerfKitBenchmarker/perfkitbenchmarker/linux_benchmarks/beam_integration_benchmark.py",> line 159, in Run
    job_type=job_type)
  File "<https://builds.apache.org/job/beam_PerformanceTests_TextIOIT_HDFS/ws/PerfKitBenchmarker/perfkitbenchmarker/providers/gcp/gcp_dpb_dataflow.py",> line 90, in SubmitJob
    assert retcode == 0, "Integration Test Failed."
AssertionError: Integration Test Failed.
2018-06-26 18:31:14,664 bdc18942 MainThread beam_integration_benchmark(1/1) ERROR    Benchmark 1/1 beam_integration_benchmark (UID: beam_integration_benchmark0) failed. Execution will continue.
2018-06-26 18:31:14,677 bdc18942 MainThread INFO     Benchmark run statuses:
---------------------------------------------------------------------------------
Name                        UID                          Status  Failed Substatus
---------------------------------------------------------------------------------
beam_integration_benchmark  beam_integration_benchmark0  FAILED                  
---------------------------------------------------------------------------------
Success rate: 0.00% (0/1)
2018-06-26 18:31:14,678 bdc18942 MainThread INFO     Complete logs can be found at: <https://builds.apache.org/job/beam_PerformanceTests_TextIOIT_HDFS/ws/runs/bdc18942/pkb.log>
2018-06-26 18:31:14,678 bdc18942 MainThread INFO     Completion statuses can be found at: <https://builds.apache.org/job/beam_PerformanceTests_TextIOIT_HDFS/ws/runs/bdc18942/completion_statuses.json>
Build step 'Execute shell' marked build as failure

Jenkins build is back to normal : beam_PerformanceTests_TextIOIT_HDFS #355

Posted by Apache Jenkins Server <je...@builds.apache.org>.
See <https://builds.apache.org/job/beam_PerformanceTests_TextIOIT_HDFS/355/display/redirect?page=changes>