You are viewing a plain text version of this content. The canonical link for it is here.
Posted to builds@cassandra.apache.org by Apache Jenkins Server <je...@builds.apache.org> on 2025/04/14 17:23:20 UTC

Build complete: Cassandra-5.0 #441 [UNSTABLE] 0f9bb246cd1b2a32cad947f26b63106ba858748b

-------------------------------------------------------------------------------
  Build Cassandra-5.0 #441 Still Unstable
  URL: https://ci-cassandra.apache.org/job/Cassandra-5.0/441/
  -------------------------------------------------------------------------------
  Changes:
  [Berenguer Blasi] CASSANDRA-19633 Replaced node is stuck in a loop calculating ranges


  -------------------------------------------------------------------------------
  Failed Tests:
  3 tests failed.
FAILED:  dtest.bootstrap_test.TestBootstrap.Tests / dtest jdk17 2/64 / test_read_from_bootstrapped_node
FAILED:  dtest.cqlsh_tests.test_cqlsh_copy.TestCqlshCopy.Tests / dtest jdk11 4/64 / test_bulk_round_trip_blogposts_with_max_connections
FAILED:  dtest.bootstrap_test.TestBootstrap.Tests / dtest jdk11 2/64 / test_read_from_bootstrapped_node

  -------------------------------------------------------------------------------
  For complete test report and logs see https://nightlies.apache.org/cassandra/Cassandra-5.0/441/