You are viewing a plain text version of this content. The canonical link for it is here.
Posted to builds@solr.apache.org by Apache Jenkins Server <je...@builds.apache.org> on 2025/11/02 10:04:59 UTC

[JENKINS] Solr » Solr-Test-10.x - Build # 162 - Still Failing!

Build: https://ci-builds.apache.org/job/Solr/job/Solr-Test-10.x/162/

No tests ran.

Build Log:
[...truncated 54 lines...]
BUILD FAILED in 21s
4 actionable tasks: 4 executed

Publishing build scan...
https://develocity.apache.org/s/i75tdgulepcwc

Build step 'Invoke Gradle script' changed build result to FAILURE
Build step 'Invoke Gradle script' marked build as failure
Archiving artifacts
Recording test results
ERROR: Step ‘Publish JUnit test result report’ failed: No test report files were found. Configuration error?
Email was triggered for: Failure - Any
Sending email for trigger: Failure - Any

[JENKINS] Solr » Solr-Test-10.x - Build # 165 - Still Failing!

Posted by Apache Jenkins Server <je...@builds.apache.org>.
Build: https://ci-builds.apache.org/job/Solr/job/Solr-Test-10.x/165/

No tests ran.

Build Log:
[...truncated 55 lines...]
BUILD FAILED in 25s
4 actionable tasks: 4 executed

Publishing build scan...
https://develocity.apache.org/s/n74ylrc7nyp2c

Build step 'Invoke Gradle script' changed build result to FAILURE
Build step 'Invoke Gradle script' marked build as failure
Archiving artifacts
Recording test results
ERROR: Step ‘Publish JUnit test result report’ failed: No test report files were found. Configuration error?
Email was triggered for: Failure - Any
Sending email for trigger: Failure - Any

[JENKINS] Solr » Solr-Test-10.x - Build # 164 - Still Failing!

Posted by Apache Jenkins Server <je...@builds.apache.org>.
Build: https://ci-builds.apache.org/job/Solr/job/Solr-Test-10.x/164/

No tests ran.

Build Log:
[...truncated 55 lines...]
BUILD FAILED in 18s
4 actionable tasks: 4 executed

Publishing build scan...
https://develocity.apache.org/s/nfvrfov5cqyos

Build step 'Invoke Gradle script' changed build result to FAILURE
Build step 'Invoke Gradle script' marked build as failure
Archiving artifacts
Recording test results
ERROR: Step ‘Publish JUnit test result report’ failed: No test report files were found. Configuration error?
Email was triggered for: Failure - Any
Sending email for trigger: Failure - Any

[JENKINS] Solr » Solr-Test-10.x - Build # 163 - Still Failing!

Posted by Apache Jenkins Server <je...@builds.apache.org>.
Build: https://ci-builds.apache.org/job/Solr/job/Solr-Test-10.x/163/

No tests ran.

Build Log:
[...truncated 54 lines...]
BUILD FAILED in 21s
4 actionable tasks: 4 executed

Publishing build scan...
https://develocity.apache.org/s/kcopofm5d35fo

Build step 'Invoke Gradle script' changed build result to FAILURE
Build step 'Invoke Gradle script' marked build as failure
Archiving artifacts
Recording test results
ERROR: Step ‘Publish JUnit test result report’ failed: No test report files were found. Configuration error?
Email was triggered for: Failure - Any
Sending email for trigger: Failure - Any