You are viewing a plain text version of this content. The canonical link for it is here.
Posted to builds@beam.apache.org by Apache Jenkins Server <je...@builds.apache.org> on 2021/06/17 07:39:58 UTC
Build failed in Jenkins: beam_PostCommit_Python36 #4007
See <https://ci-beam.apache.org/job/beam_PostCommit_Python36/4007/display/redirect?page=changes>
Changes:
[noreply] [BEAM-8137] Refactor External Worker Service to be part of
------------------------------------------
[...truncated 49.04 MB...]
INFO:apache_beam.runners.dataflow.dataflow_runner:2021-06-17T07:38:50.146Z: JOB_MESSAGE_DEBUG: Executing success step success48
INFO:apache_beam.runners.dataflow.dataflow_runner:2021-06-17T07:38:50.237Z: JOB_MESSAGE_DETAILED: Cleaning up.
INFO:apache_beam.runners.dataflow.dataflow_runner:2021-06-17T07:38:50.300Z: JOB_MESSAGE_DEBUG: Starting worker pool teardown.
INFO:apache_beam.runners.dataflow.dataflow_runner:2021-06-17T07:38:50.337Z: JOB_MESSAGE_BASIC: Stopping worker pool...
INFO:apache_beam.runners.dataflow.dataflow_runner:2021-06-17T07:39:44.347Z: JOB_MESSAGE_DETAILED: Autoscaling: Resized worker pool from 1 to 0.
INFO:apache_beam.runners.dataflow.dataflow_runner:2021-06-17T07:39:44.488Z: JOB_MESSAGE_BASIC: Worker pool stopped.
INFO:apache_beam.runners.dataflow.dataflow_runner:2021-06-17T07:39:44.579Z: JOB_MESSAGE_DEBUG: Tearing down pending resources...
INFO:apache_beam.runners.dataflow.dataflow_runner:Job 2021-06-17_00_30_36-13143677425749229915 is in state JOB_STATE_DONE
INFO:apache_beam.io.gcp.tests.bigquery_matcher:Attempting to perform query SELECT bytes, date, time FROM python_write_to_table_16239150205338.python_no_schema_table to BQ
DEBUG:google.auth._default:Checking None for explicit credentials as part of auth process...
DEBUG:google.auth._default:Checking Cloud SDK credentials as part of auth process...
DEBUG:google.auth._default:Cloud SDK credentials not found on disk; not using them
DEBUG:google.auth._default:Checking for App Engine runtime as part of auth process...
DEBUG:google.auth._default:No App Engine library was found so cannot authentication via App Engine Identity Credentials.
DEBUG:google.auth.transport._http_client:Making request: GET http://169.254.169.254
DEBUG:google.auth.transport._http_client:Making request: GET http://metadata.google.internal/computeMetadata/v1/project/project-id
DEBUG:urllib3.util.retry:Converted retries value: 3 -> Retry(total=3, connect=None, read=None, redirect=None, status=None)
DEBUG:google.auth.transport.requests:Making request: GET http://metadata.google.internal/computeMetadata/v1/instance/service-accounts/default/?recursive=true
DEBUG:urllib3.connectionpool:Starting new HTTP connection (1): metadata.google.internal:80
DEBUG:urllib3.connectionpool:http://metadata.google.internal:80 "GET /computeMetadata/v1/instance/service-accounts/default/?recursive=true HTTP/1.1" 200 144
DEBUG:google.auth.transport.requests:Making request: GET http://metadata.google.internal/computeMetadata/v1/instance/service-accounts/844138762903-compute@developer.gserviceaccount.com/token?scopes=https%3A%2F%2Fwww.googleapis.com%2Fauth%2Fbigquery%2Chttps%3A%2F%2Fwww.googleapis.com%2Fauth%2Fcloud-platform
DEBUG:urllib3.connectionpool:http://metadata.google.internal:80 "GET /computeMetadata/v1/instance/service-accounts/844138762903-compute@developer.gserviceaccount.com/token?scopes=https%3A%2F%2Fwww.googleapis.com%2Fauth%2Fbigquery%2Chttps%3A%2F%2Fwww.googleapis.com%2Fauth%2Fcloud-platform HTTP/1.1" 200 244
DEBUG:urllib3.connectionpool:Starting new HTTPS connection (1): bigquery.googleapis.com:443
DEBUG:urllib3.connectionpool:https://bigquery.googleapis.com:443 "POST /bigquery/v2/projects/apache-beam-testing/jobs?prettyPrint=false HTTP/1.1" 200 None
DEBUG:urllib3.connectionpool:https://bigquery.googleapis.com:443 "GET /bigquery/v2/projects/apache-beam-testing/queries/dc7fe98f-7a1f-45d6-9ac8-9cbbb20c875b?maxResults=0&timeoutMs=10000&location=US&prettyPrint=false HTTP/1.1" 200 None
DEBUG:urllib3.connectionpool:https://bigquery.googleapis.com:443 "GET /bigquery/v2/projects/apache-beam-testing/queries/dc7fe98f-7a1f-45d6-9ac8-9cbbb20c875b?fields=jobReference%2CtotalRows%2CpageToken%2Crows&location=US&formatOptions.useInt64Timestamp=True&prettyPrint=false HTTP/1.1" 200 None
INFO:apache_beam.io.gcp.tests.bigquery_matcher:Result of query is: [(b'xyw', datetime.date(2011, 1, 1), datetime.time(23, 59, 59, 999999)), (b'\xe4\xbd\xa0\xe5\xa5\xbd', datetime.date(3000, 12, 31), datetime.time(23, 59, 59)), (b'abc', datetime.date(2000, 1, 1), datetime.time(0, 0)), (b'\xab\xac\xad', datetime.date(2000, 1, 1), datetime.time(0, 0))]
INFO:apache_beam.io.gcp.bigquery_write_it_test:Deleting dataset python_write_to_table_16239150205338 in project apache-beam-testing
test_autocomplete_it (apache_beam.examples.complete.autocomplete_test.AutocompleteTest) ... ok
test_datastore_wordcount_it (apache_beam.examples.cookbook.datastore_wordcount_it_test.DatastoreWordCountIT) ... ok
test_bigquery_tornadoes_it (apache_beam.examples.cookbook.bigquery_tornadoes_it_test.BigqueryTornadoesIT) ... ok
test_leader_board_it (apache_beam.examples.complete.game.leader_board_it_test.LeaderBoardIT) ... ok
test_streaming_wordcount_debugging_it (apache_beam.examples.streaming_wordcount_debugging_it_test.StreamingWordcountDebuggingIT) ... SKIP: Skipped due to [BEAM-3377]: assert_that not working for streaming
test_run_example_with_setup_file (apache_beam.examples.complete.juliaset.juliaset.juliaset_test_it.JuliaSetTestIT) ... ok
test_streaming_wordcount_it (apache_beam.examples.streaming_wordcount_it_test.StreamingWordCountIT) ... ERROR
test_game_stats_it (apache_beam.examples.complete.game.game_stats_it_test.GameStatsIT) ... ok
test_flight_delays (apache_beam.examples.dataframe.flight_delays_it_test.FlightDelaysTest) ... ok
test_user_score_it (apache_beam.examples.complete.game.user_score_it_test.UserScoreIT) ... ok
test_wordcount_it (apache_beam.examples.wordcount_it_test.WordCountIT) ... ok
test_wordcount_fnapi_it (apache_beam.examples.wordcount_it_test.WordCountIT) ... ok
test_hourly_team_score_it (apache_beam.examples.complete.game.hourly_team_score_it_test.HourlyTeamScoreIT) ... ok
test_avro_it (apache_beam.examples.fastavro_it_test.FastavroIT) ... ok
test_read_via_sql (apache_beam.io.gcp.experimental.spannerio_read_it_test.SpannerReadIntegrationTest) ... ok
test_read_via_table (apache_beam.io.gcp.experimental.spannerio_read_it_test.SpannerReadIntegrationTest) ... ok
test_bigquery_read_1M_python (apache_beam.io.gcp.bigquery_io_read_it_test.BigqueryIOReadIT) ... ok
test_bigquery_read_custom_1M_python (apache_beam.io.gcp.bigquery_io_read_it_test.BigqueryIOReadIT) ... ok
test_bqfl_streaming (apache_beam.io.gcp.bigquery_file_loads_test.BigQueryFileLoadsIT) ... SKIP: TestStream is not supported on TestDataflowRunner
test_multiple_destinations_transform (apache_beam.io.gcp.bigquery_file_loads_test.BigQueryFileLoadsIT) ... ok
test_one_job_fails_all_jobs_fail (apache_beam.io.gcp.bigquery_file_loads_test.BigQueryFileLoadsIT) ... ok
test_spanner_error (apache_beam.io.gcp.experimental.spannerio_write_it_test.SpannerWriteIntegrationTest) ... ok
test_spanner_update (apache_beam.io.gcp.experimental.spannerio_write_it_test.SpannerWriteIntegrationTest) ... ok
test_write_batches (apache_beam.io.gcp.experimental.spannerio_write_it_test.SpannerWriteIntegrationTest) ... ok
test_iobase_source (apache_beam.io.gcp.bigquery_read_it_test.ReadNewTypesTests) ... ok
test_native_source (apache_beam.io.gcp.bigquery_read_it_test.ReadNewTypesTests) ... ok
test_aggregation (apache_beam.examples.dataframe.taxiride_it_test.TaxirideIT) ... ok
test_enrich (apache_beam.examples.dataframe.taxiride_it_test.TaxirideIT) ... ok
test_avro_file_load (apache_beam.io.gcp.bigquery_test.BigQueryFileLoadsIntegrationTests) ... ok
test_read_queries (apache_beam.io.gcp.bigquery_read_it_test.ReadAllBQTests) ... ok
test_multiple_destinations_transform (apache_beam.io.gcp.bigquery_test.BigQueryStreamingInsertTransformIntegrationTests) ... ok
test_copy (apache_beam.io.gcp.gcsio_integration_test.GcsIOIntegrationTest) ... ok
test_copy_batch (apache_beam.io.gcp.gcsio_integration_test.GcsIOIntegrationTest) ... ok
test_copy_batch_kms (apache_beam.io.gcp.gcsio_integration_test.GcsIOIntegrationTest) ... ok
test_copy_batch_rewrite_token (apache_beam.io.gcp.gcsio_integration_test.GcsIOIntegrationTest) ... SKIP: BEAM-12352: enable once maxBytesRewrittenPerCall works again
test_copy_kms (apache_beam.io.gcp.gcsio_integration_test.GcsIOIntegrationTest) ... ok
test_copy_rewrite_token (apache_beam.io.gcp.gcsio_integration_test.GcsIOIntegrationTest) ... SKIP: BEAM-12352: enable once maxBytesRewrittenPerCall works again
test_datastore_write_limit (apache_beam.io.gcp.datastore.v1new.datastore_write_it_test.DatastoreWriteIT) ... ok
test_value_provider_transform (apache_beam.io.gcp.bigquery_test.BigQueryStreamingInsertTransformIntegrationTests) ... ok
test_iobase_source (apache_beam.io.gcp.bigquery_read_it_test.ReadTests) ... ok
test_native_source (apache_beam.io.gcp.bigquery_read_it_test.ReadTests) ... ok
test_transform_on_gcs (apache_beam.io.fileio_test.MatchIntegrationTest) ... ok
test_parquetio_it (apache_beam.io.parquetio_it_test.TestParquetIT) ... ok
test_streaming_data_only (apache_beam.io.gcp.pubsub_integration_test.PubSubIntegrationTest) ... ok
test_streaming_with_attributes (apache_beam.io.gcp.pubsub_integration_test.PubSubIntegrationTest) ... ok
test_dicom_search_instances (apache_beam.io.gcp.dicomio_integration_test.DICOMIoIntegrationTest) ... ok
test_dicom_store_instance_from_gcs (apache_beam.io.gcp.dicomio_integration_test.DICOMIoIntegrationTest) ... ok
test_analyzing_syntax (apache_beam.ml.gcp.naturallanguageml_test_it.NaturalLanguageMlTestIT) ... ok
test_big_query_legacy_sql (apache_beam.io.gcp.big_query_query_to_table_it_test.BigQueryQueryToTableIT) ... ok
test_big_query_new_types (apache_beam.io.gcp.big_query_query_to_table_it_test.BigQueryQueryToTableIT) ... ok
test_big_query_new_types_avro (apache_beam.io.gcp.big_query_query_to_table_it_test.BigQueryQueryToTableIT) ... ok
test_big_query_new_types_native (apache_beam.io.gcp.big_query_query_to_table_it_test.BigQueryQueryToTableIT) ... ok
test_big_query_standard_sql (apache_beam.io.gcp.big_query_query_to_table_it_test.BigQueryQueryToTableIT) ... ok
test_big_query_standard_sql_kms_key_native (apache_beam.io.gcp.big_query_query_to_table_it_test.BigQueryQueryToTableIT) ... ok
test_basic_execution (apache_beam.testing.test_stream_it_test.TestStreamIntegrationTests) ... SKIP: The "TestDataflowRunner", does not support the TestStream transform. Supported runners: ['DirectRunner', 'SwitchingDirectRunner']
Tests that the TestStream supports emitting to multiple PCollections. ... SKIP: The "TestDataflowRunner", does not support the TestStream transform. Supported runners: ['DirectRunner', 'SwitchingDirectRunner']
Tests that the TestStream can independently control output watermarks. ... SKIP: The "TestDataflowRunner", does not support the TestStream transform. Supported runners: ['DirectRunner', 'SwitchingDirectRunner']
test_label_detection_with_video_context (apache_beam.ml.gcp.videointelligenceml_test_it.VideoIntelligenceMlTestIT) ... ok
test_deidentification (apache_beam.ml.gcp.cloud_dlp_it_test.CloudDLPIT) ... ok
test_inspection (apache_beam.ml.gcp.cloud_dlp_it_test.CloudDLPIT) ... ok
test_text_detection_with_language_hint (apache_beam.ml.gcp.visionml_test_it.VisionMlTestIT) ... ok
test_job_python_from_python_it (apache_beam.transforms.external_it_test.ExternalTransformIT) ... ok
test_file_loads (apache_beam.io.gcp.bigquery_test.PubSubBigQueryIT) ... ok
test_streaming_inserts (apache_beam.io.gcp.bigquery_test.PubSubBigQueryIT) ... ok
test_metrics_fnapi_it (apache_beam.runners.dataflow.dataflow_exercise_metrics_pipeline_test.ExerciseMetricsPipelineTest) ... ok
test_metrics_it (apache_beam.runners.dataflow.dataflow_exercise_metrics_pipeline_test.ExerciseMetricsPipelineTest) ... ok
test_big_query_write (apache_beam.io.gcp.bigquery_write_it_test.BigQueryWriteIntegrationTests) ... ok
test_big_query_write_new_types (apache_beam.io.gcp.bigquery_write_it_test.BigQueryWriteIntegrationTests) ... ok
test_big_query_write_schema_autodetect (apache_beam.io.gcp.bigquery_write_it_test.BigQueryWriteIntegrationTests) ... SKIP: DataflowRunner does not support schema autodetection
Test that schema update options are respected when appending to an existing ... ok
test_big_query_write_without_schema (apache_beam.io.gcp.bigquery_write_it_test.BigQueryWriteIntegrationTests) ... ok
======================================================================
ERROR: test_streaming_wordcount_it (apache_beam.examples.streaming_wordcount_it_test.StreamingWordCountIT)
----------------------------------------------------------------------
Traceback (most recent call last):
File "<https://ci-beam.apache.org/job/beam_PostCommit_Python36/ws/src/sdks/python/apache_beam/examples/streaming_wordcount_it_test.py",> line 66, in setUp
ack_deadline_seconds=60)
File "<https://ci-beam.apache.org/job/beam_PostCommit_Python36/ws/src/build/gradleenv/-1734967053/lib/python3.6/site-packages/google/cloud/pubsub_v1/_gapic.py",> line 40, in <lambda>
fx = lambda self, *a, **kw: wrapped_fx(self.api, *a, **kw) # noqa
File "<https://ci-beam.apache.org/job/beam_PostCommit_Python36/ws/src/build/gradleenv/-1734967053/lib/python3.6/site-packages/google/cloud/pubsub_v1/gapic/subscriber_client.py",> line 439, in create_subscription
request, retry=retry, timeout=timeout, metadata=metadata
File "<https://ci-beam.apache.org/job/beam_PostCommit_Python36/ws/src/build/gradleenv/-1734967053/lib/python3.6/site-packages/google/api_core/gapic_v1/method.py",> line 145, in __call__
return wrapped_func(*args, **kwargs)
File "<https://ci-beam.apache.org/job/beam_PostCommit_Python36/ws/src/build/gradleenv/-1734967053/lib/python3.6/site-packages/google/api_core/retry.py",> line 290, in retry_wrapped_func
on_error=on_error,
File "<https://ci-beam.apache.org/job/beam_PostCommit_Python36/ws/src/build/gradleenv/-1734967053/lib/python3.6/site-packages/google/api_core/retry.py",> line 188, in retry_target
return target()
File "<https://ci-beam.apache.org/job/beam_PostCommit_Python36/ws/src/build/gradleenv/-1734967053/lib/python3.6/site-packages/google/api_core/timeout.py",> line 214, in func_with_timeout
return func(*args, **kwargs)
File "<https://ci-beam.apache.org/job/beam_PostCommit_Python36/ws/src/build/gradleenv/-1734967053/lib/python3.6/site-packages/google/api_core/grpc_helpers.py",> line 69, in error_remapped_callable
six.raise_from(exceptions.from_grpc_error(exc), exc)
File "<string>", line 3, in raise_from
google.api_core.exceptions.DeadlineExceeded: 504 Deadline Exceeded
-------------------- >> begin captured logging << --------------------
google.auth._default: DEBUG: Checking None for explicit credentials as part of auth process...
google.auth._default: DEBUG: Checking Cloud SDK credentials as part of auth process...
google.auth._default: DEBUG: Cloud SDK credentials not found on disk; not using them
google.auth._default: DEBUG: Checking for App Engine runtime as part of auth process...
google.auth._default: DEBUG: No App Engine library was found so cannot authentication via App Engine Identity Credentials.
google.auth.transport._http_client: DEBUG: Making request: GET http://169.254.169.254
google.auth.transport._http_client: DEBUG: Making request: GET http://metadata.google.internal/computeMetadata/v1/project/project-id
google.auth.transport.requests: DEBUG: Making request: GET http://metadata.google.internal/computeMetadata/v1/instance/service-accounts/default/?recursive=true
urllib3.connectionpool: DEBUG: Starting new HTTP connection (1): metadata.google.internal:80
urllib3.connectionpool: DEBUG: http://metadata.google.internal:80 "GET /computeMetadata/v1/instance/service-accounts/default/?recursive=true HTTP/1.1" 200 144
google.auth.transport.requests: DEBUG: Making request: GET http://metadata.google.internal/computeMetadata/v1/instance/service-accounts/844138762903-compute@developer.gserviceaccount.com/token?scopes=https%3A%2F%2Fwww.googleapis.com%2Fauth%2Fcloud-platform%2Chttps%3A%2F%2Fwww.googleapis.com%2Fauth%2Fpubsub
urllib3.connectionpool: DEBUG: http://metadata.google.internal:80 "GET /computeMetadata/v1/instance/service-accounts/844138762903-compute@developer.gserviceaccount.com/token?scopes=https%3A%2F%2Fwww.googleapis.com%2Fauth%2Fcloud-platform%2Chttps%3A%2F%2Fwww.googleapis.com%2Fauth%2Fpubsub HTTP/1.1" 200 244
google.auth._default: DEBUG: Checking None for explicit credentials as part of auth process...
google.auth._default: DEBUG: Checking Cloud SDK credentials as part of auth process...
google.auth._default: DEBUG: Cloud SDK credentials not found on disk; not using them
google.auth._default: DEBUG: Checking for App Engine runtime as part of auth process...
google.auth._default: DEBUG: No App Engine library was found so cannot authentication via App Engine Identity Credentials.
google.auth.transport._http_client: DEBUG: Making request: GET http://169.254.169.254
google.auth.transport._http_client: DEBUG: Making request: GET http://metadata.google.internal/computeMetadata/v1/project/project-id
google.auth.transport.requests: DEBUG: Making request: GET http://metadata.google.internal/computeMetadata/v1/instance/service-accounts/default/?recursive=true
urllib3.connectionpool: DEBUG: Starting new HTTP connection (1): metadata.google.internal:80
urllib3.connectionpool: DEBUG: http://metadata.google.internal:80 "GET /computeMetadata/v1/instance/service-accounts/default/?recursive=true HTTP/1.1" 200 144
google.auth.transport.requests: DEBUG: Making request: GET http://metadata.google.internal/computeMetadata/v1/instance/service-accounts/844138762903-compute@developer.gserviceaccount.com/token?scopes=https%3A%2F%2Fwww.googleapis.com%2Fauth%2Fcloud-platform%2Chttps%3A%2F%2Fwww.googleapis.com%2Fauth%2Fpubsub
urllib3.connectionpool: DEBUG: http://metadata.google.internal:80 "GET /computeMetadata/v1/instance/service-accounts/844138762903-compute@developer.gserviceaccount.com/token?scopes=https%3A%2F%2Fwww.googleapis.com%2Fauth%2Fcloud-platform%2Chttps%3A%2F%2Fwww.googleapis.com%2Fauth%2Fpubsub HTTP/1.1" 200 244
--------------------- >> end captured logging << ---------------------
Worker logs: https://console.cloud.google.com/dataflow/jobs/us-central1/2021-06-16_23_07_11-16160559694436488319?project=apache-beam-testing
Worker logs: https://console.cloud.google.com/dataflow/jobs/us-central1/2021-06-16_23_21_22-18364003449858583314?project=apache-beam-testing
Worker logs: https://console.cloud.google.com/dataflow/jobs/us-central1/2021-06-16_23_29_33-14877132139474260091?project=apache-beam-testing
Worker logs: https://console.cloud.google.com/dataflow/jobs/us-central1/2021-06-16_23_37_44-6829763270240311939?project=apache-beam-testing
Worker logs: https://console.cloud.google.com/dataflow/jobs/us-central1/2021-06-16_23_46_39-4058290987559174445?project=apache-beam-testing
Worker logs: https://console.cloud.google.com/dataflow/jobs/us-central1/2021-06-16_23_55_18-5308805088899642341?project=apache-beam-testing
Worker logs: https://console.cloud.google.com/dataflow/jobs/us-central1/2021-06-17_00_03_54-15373672259459447559?project=apache-beam-testing
Worker logs: https://console.cloud.google.com/dataflow/jobs/us-central1/2021-06-17_00_13_40-1532252127468367940?project=apache-beam-testing
Worker logs: https://console.cloud.google.com/dataflow/jobs/us-central1/2021-06-17_00_21_40-15147132880835843250?project=apache-beam-testing
Worker logs: https://console.cloud.google.com/dataflow/jobs/us-central1/2021-06-16_23_07_12-8913387193993136437?project=apache-beam-testing
Worker logs: https://console.cloud.google.com/dataflow/jobs/us-central1/2021-06-16_23_30_15-15750859367225611442?project=apache-beam-testing
Worker logs: https://console.cloud.google.com/dataflow/jobs/us-central1/2021-06-16_23_39_01-5684596126735114039?project=apache-beam-testing
Worker logs: https://console.cloud.google.com/dataflow/jobs/us-central1/2021-06-16_23_48_26-13627461569851077761?project=apache-beam-testing
Worker logs: https://console.cloud.google.com/dataflow/jobs/us-central1/2021-06-16_23_58_00-3866823482777261804?project=apache-beam-testing
Worker logs: https://console.cloud.google.com/dataflow/jobs/us-central1/2021-06-17_00_10_11-16974166726488137494?project=apache-beam-testing
Worker logs: https://console.cloud.google.com/dataflow/jobs/us-central1/2021-06-17_00_18_36-8430923167885197615?project=apache-beam-testing
Worker logs: https://console.cloud.google.com/dataflow/jobs/us-central1/2021-06-16_23_07_10-13014635552498470658?project=apache-beam-testing
Worker logs: https://console.cloud.google.com/dataflow/jobs/us-central1/2021-06-16_23_19_47-14751471279465553255?project=apache-beam-testing
Worker logs: https://console.cloud.google.com/dataflow/jobs/us-central1/2021-06-16_23_28_31-2701573787786978316?project=apache-beam-testing
Worker logs: https://console.cloud.google.com/dataflow/jobs/us-central1/2021-06-16_23_38_25-347804946980674228?project=apache-beam-testing
Worker logs: https://console.cloud.google.com/dataflow/jobs/us-central1/2021-06-16_23_49_07-8681237507824328865?project=apache-beam-testing
Worker logs: https://console.cloud.google.com/dataflow/jobs/us-central1/2021-06-16_23_59_09-8357218642575474755?project=apache-beam-testing
Worker logs: https://console.cloud.google.com/dataflow/jobs/us-central1/2021-06-17_00_07_28-1106125062892820264?project=apache-beam-testing
Worker logs: https://console.cloud.google.com/dataflow/jobs/us-central1/2021-06-17_00_16_27-18446256330241426785?project=apache-beam-testing
Worker logs: https://console.cloud.google.com/dataflow/jobs/us-central1/2021-06-16_23_07_07-10691068773487036703?project=apache-beam-testing
Worker logs: https://console.cloud.google.com/dataflow/jobs/us-central1/2021-06-16_23_28_24-14758242875058321202?project=apache-beam-testing
Worker logs: https://console.cloud.google.com/dataflow/jobs/us-central1/2021-06-16_23_36_08-2794615211046157819?project=apache-beam-testing
Worker logs: https://console.cloud.google.com/dataflow/jobs/us-central1/2021-06-16_23_44_48-16146452939134113400?project=apache-beam-testing
Worker logs: https://console.cloud.google.com/dataflow/jobs/us-central1/2021-06-16_23_53_20-1929302655760913397?project=apache-beam-testing
Worker logs: https://console.cloud.google.com/dataflow/jobs/us-central1/2021-06-17_00_02_37-8016787225676181852?project=apache-beam-testing
Worker logs: https://console.cloud.google.com/dataflow/jobs/us-central1/2021-06-17_00_10_36-6724944707609353482?project=apache-beam-testing
Worker logs: https://console.cloud.google.com/dataflow/jobs/us-central1/2021-06-17_00_18_12-17205895344761226004?project=apache-beam-testing
Worker logs: https://console.cloud.google.com/dataflow/jobs/us-central1/2021-06-16_23_10_02-873085595561540468?project=apache-beam-testing
Worker logs: https://console.cloud.google.com/dataflow/jobs/us-central1/2021-06-16_23_19_03-9213640213365535902?project=apache-beam-testing
Worker logs: https://console.cloud.google.com/dataflow/jobs/us-central1/2021-06-16_23_28_47-14183096261489292863?project=apache-beam-testing
Worker logs: https://console.cloud.google.com/dataflow/jobs/us-central1/2021-06-16_23_40_29-11388386317757760873?project=apache-beam-testing
Worker logs: https://console.cloud.google.com/dataflow/jobs/us-central1/2021-06-16_23_50_07-17764699415584505056?project=apache-beam-testing
Worker logs: https://console.cloud.google.com/dataflow/jobs/us-central1/2021-06-17_00_00_46-6273418017884929198?project=apache-beam-testing
Worker logs: https://console.cloud.google.com/dataflow/jobs/us-central1/2021-06-17_00_11_00-8599388366571496573?project=apache-beam-testing
Worker logs: https://console.cloud.google.com/dataflow/jobs/us-central1/2021-06-17_00_21_07-7140437541735891814?project=apache-beam-testing
Worker logs: https://console.cloud.google.com/dataflow/jobs/us-central1/2021-06-17_00_30_36-13143677425749229915?project=apache-beam-testing
Worker logs: https://console.cloud.google.com/dataflow/jobs/us-central1/2021-06-16_23_07_07-12620098318678989134?project=apache-beam-testing
Worker logs: https://console.cloud.google.com/dataflow/jobs/us-central1/2021-06-16_23_15_47-12365658378844725250?project=apache-beam-testing
Worker logs: https://console.cloud.google.com/dataflow/jobs/us-central1/2021-06-16_23_24_56-2469449271008954528?project=apache-beam-testing
Worker logs: https://console.cloud.google.com/dataflow/jobs/us-central1/2021-06-16_23_32_41-5722685870330683689?project=apache-beam-testing
Worker logs: https://console.cloud.google.com/dataflow/jobs/us-central1/2021-06-16_23_40_01-9833335046311187877?project=apache-beam-testing
Worker logs: https://console.cloud.google.com/dataflow/jobs/us-central1/2021-06-16_23_49_05-17315988545891340003?project=apache-beam-testing
Worker logs: https://console.cloud.google.com/dataflow/jobs/us-central1/2021-06-16_23_57_52-4143668969631612163?project=apache-beam-testing
Worker logs: https://console.cloud.google.com/dataflow/jobs/us-central1/2021-06-17_00_06_39-5676320782720115100?project=apache-beam-testing
Worker logs: https://console.cloud.google.com/dataflow/jobs/us-central1/2021-06-17_00_17_40-7646953975896187340?project=apache-beam-testing
Worker logs: https://console.cloud.google.com/dataflow/jobs/us-central1/2021-06-16_23_07_11-9007294946035245769?project=apache-beam-testing
Worker logs: https://console.cloud.google.com/dataflow/jobs/us-central1/2021-06-16_23_17_40-6498881264043592009?project=apache-beam-testing
Worker logs: https://console.cloud.google.com/dataflow/jobs/us-central1/2021-06-16_23_28_05-17967902581693721000?project=apache-beam-testing
Worker logs: https://console.cloud.google.com/dataflow/jobs/us-central1/2021-06-16_23_39_47-16550554289001630865?project=apache-beam-testing
Worker logs: https://console.cloud.google.com/dataflow/jobs/us-central1/2021-06-17_00_00_58-7659165724527249597?project=apache-beam-testing
Worker logs: https://console.cloud.google.com/dataflow/jobs/us-central1/2021-06-17_00_09_46-13801399040069334881?project=apache-beam-testing
Worker logs: https://console.cloud.google.com/dataflow/jobs/us-central1/2021-06-17_00_18_46-8225896077866948900?project=apache-beam-testing
Worker logs: https://console.cloud.google.com/dataflow/jobs/us-central1/2021-06-17_00_26_51-16030771190580396801?project=apache-beam-testing
Worker logs: https://console.cloud.google.com/dataflow/jobs/us-central1/2021-06-16_23_07_09-9448531853588259907?project=apache-beam-testing
Worker logs: https://console.cloud.google.com/dataflow/jobs/us-central1/2021-06-16_23_17_06-4851127587753888247?project=apache-beam-testing
Worker logs: https://console.cloud.google.com/dataflow/jobs/us-central1/2021-06-16_23_34_16-2239515539220056238?project=apache-beam-testing
Worker logs: https://console.cloud.google.com/dataflow/jobs/us-central1/2021-06-16_23_59_36-4441553975794444768?project=apache-beam-testing
Worker logs: https://console.cloud.google.com/dataflow/jobs/us-central1/2021-06-17_00_16_43-6007698742015327199?project=apache-beam-testing
----------------------------------------------------------------------
XML: nosetests-postCommitIT-df-py36.xml
----------------------------------------------------------------------
XML: <https://ci-beam.apache.org/job/beam_PostCommit_Python36/ws/src/sdks/python/nosetests.xml>
----------------------------------------------------------------------
Ran 71 tests in 5611.719s
FAILED (SKIP=8, errors=1)
> Task :sdks:python:test-suites:dataflow:py36:postCommitIT FAILED
FAILURE: Build failed with an exception.
* Where:
Script '<https://ci-beam.apache.org/job/beam_PostCommit_Python36/ws/src/sdks/python/test-suites/dataflow/common.gradle'> line: 126
* What went wrong:
Execution failed for task ':sdks:python:test-suites:dataflow:py36:postCommitIT'.
> Process 'command 'sh'' finished with non-zero exit value 1
* Try:
Run with --stacktrace option to get the stack trace. Run with --info or --debug option to get more log output. Run with --scan to get full insights.
* Get more help at https://help.gradle.org
Deprecated Gradle features were used in this build, making it incompatible with Gradle 7.0.
Use '--warning-mode all' to show the individual deprecation warnings.
See https://docs.gradle.org/6.8.3/userguide/command_line_interface.html#sec:command_line_warnings
BUILD FAILED in 1h 39m 31s
213 actionable tasks: 161 executed, 48 from cache, 4 up-to-date
Publishing build scan...
https://gradle.com/s/imsqnufsik3sk
Build step 'Invoke Gradle script' changed build result to FAILURE
Build step 'Invoke Gradle script' marked build as failure
---------------------------------------------------------------------
To unsubscribe, e-mail: builds-unsubscribe@beam.apache.org
For additional commands, e-mail: builds-help@beam.apache.org
Jenkins build is back to normal : beam_PostCommit_Python36 #4008
Posted by Apache Jenkins Server <je...@builds.apache.org>.
See <https://ci-beam.apache.org/job/beam_PostCommit_Python36/4008/display/redirect>
---------------------------------------------------------------------
To unsubscribe, e-mail: builds-unsubscribe@beam.apache.org
For additional commands, e-mail: builds-help@beam.apache.org