You are viewing a plain text version of this content. The canonical link for it is here.
Posted to dev@sling.apache.org by Apache Jenkins Server <je...@builds.apache.org> on 2011/09/19 19:52:27 UTC

Build failed in Jenkins: sling-contrib-1.5 » Apache Sling Launchpad Contrib Testing #726

See <https://builds.apache.org/job/sling-contrib-1.5/org.apache.sling$org.apache.sling.launchpad.contrib-testing/726/>

------------------------------------------
[INFO] ------------------------------------------------------------------------
[INFO] Building Apache Sling Launchpad Contrib Testing
[INFO]    task-segment: [clean, install]
[INFO] ------------------------------------------------------------------------
[INFO] [clean:clean {execution: default-clean}]
[INFO] Deleting file-set: <https://builds.apache.org/job/sling-contrib-1.5/org.apache.sling$org.apache.sling.launchpad.contrib-testing/ws/> (included: [derby.log, cachedir, sling], excluded: [])
[INFO] [enforcer:enforce {execution: enforce-java}]
[INFO] [launchpad:prepare-package {execution: prepare-package}]
Downloading: http://scala-tools.org/repo-releases/org/apache/sling/org.apache.sling.launchpad/6-SNAPSHOT/org.apache.sling.launchpad-6-SNAPSHOT-bundlelist.xml
[INFO] Unable to find resource 'org.apache.sling:org.apache.sling.launchpad:xml:bundlelist:6-SNAPSHOT' in repository scala-tools.org (http://scala-tools.org/repo-releases)
Downloading: http://repository.apache.org/snapshots/org/apache/sling/org.apache.sling.launchpad/6-SNAPSHOT/org.apache.sling.launchpad-6-SNAPSHOT-bundlelist.xml
[INFO] Unable to find resource 'org.apache.sling:org.apache.sling.launchpad:xml:bundlelist:6-SNAPSHOT' in repository apache.snapshots (http://repository.apache.org/snapshots)
[JENKINS] Archiving <https://builds.apache.org/job/sling-contrib-1.5/org.apache.sling$org.apache.sling.launchpad.contrib-testing/ws/pom.xml> to /home/hudson/hudson/jobs/sling-contrib-1.5/modules/org.apache.sling$org.apache.sling.launchpad.contrib-testing/builds/2011-09-19_17-42-27/archive/org.apache.sling/org.apache.sling.launchpad.contrib-testing/4-SNAPSHOT/org.apache.sling.launchpad.contrib-testing-4-SNAPSHOT.pom
[INFO] ------------------------------------------------------------------------
[ERROR] BUILD ERROR
[INFO] ------------------------------------------------------------------------
[INFO] Failed to resolve artifact.

GroupId: org.apache.sling
ArtifactId: org.apache.sling.launchpad
Version: 6-SNAPSHOT

Reason: Unable to download the artifact from any repository

Try downloading the file manually from the project website.

Then, install it using the command: 
    mvn install:install-file -DgroupId=org.apache.sling -DartifactId=org.apache.sling.launchpad -Dversion=6-SNAPSHOT -Dclassifier=bundlelist -Dpackaging=xml -Dfile=/path/to/file

Alternatively, if you host your own repository you can deploy the file there: 
    mvn deploy:deploy-file -DgroupId=org.apache.sling -DartifactId=org.apache.sling.launchpad -Dversion=6-SNAPSHOT -Dclassifier=bundlelist -Dpackaging=xml -Dfile=/path/to/file -Durl=[url] -DrepositoryId=[id]


  org.apache.sling:org.apache.sling.launchpad:xml:6-SNAPSHOT

from the specified remote repositories:
  central (http://repo1.maven.org/maven2),
  Nexus (http://repository.apache.org/snapshots),
  scala-tools.org (http://scala-tools.org/repo-releases)



[INFO] ------------------------------------------------------------------------
[INFO] For more information, run Maven with the -e switch
[INFO] ------------------------------------------------------------------------
[INFO] Total time: 9 minutes 29 seconds
[INFO] Finished at: Mon Sep 19 17:52:26 UTC 2011
[INFO] Final Memory: 90M/151M
[INFO] ------------------------------------------------------------------------


Jenkins build is back to normal : sling-contrib-1.5 » Apache Sling Launchpad Contrib Testing #737

Posted by Apache Jenkins Server <je...@builds.apache.org>.
See <https://builds.apache.org/job/sling-contrib-1.5/org.apache.sling$org.apache.sling.launchpad.contrib-testing/737/changes>



Build failed in Jenkins: sling-contrib-1.5 » Apache Sling Launchpad Contrib Testing #736

Posted by Apache Jenkins Server <je...@builds.apache.org>.
See <https://builds.apache.org/job/sling-contrib-1.5/org.apache.sling$org.apache.sling.launchpad.contrib-testing/736/>

------------------------------------------
[INFO] ------------------------------------------------------------------------
[INFO] Building Apache Sling Launchpad Contrib Testing
[INFO]    task-segment: [clean, install]
[INFO] ------------------------------------------------------------------------
[INFO] [clean:clean {execution: default-clean}]
[INFO] Deleting file-set: <https://builds.apache.org/job/sling-contrib-1.5/org.apache.sling$org.apache.sling.launchpad.contrib-testing/ws/> (included: [derby.log, cachedir, sling], excluded: [])
[INFO] [enforcer:enforce {execution: enforce-java}]
[INFO] [launchpad:prepare-package {execution: prepare-package}]
Downloading: http://scala-tools.org/repo-releases/org/apache/sling/org.apache.sling.launchpad/6-SNAPSHOT/org.apache.sling.launchpad-6-SNAPSHOT-bundlelist.xml
[INFO] Unable to find resource 'org.apache.sling:org.apache.sling.launchpad:xml:bundlelist:6-SNAPSHOT' in repository scala-tools.org (http://scala-tools.org/repo-releases)
Downloading: http://repository.apache.org/snapshots/org/apache/sling/org.apache.sling.launchpad/6-SNAPSHOT/org.apache.sling.launchpad-6-SNAPSHOT-bundlelist.xml
[INFO] Unable to find resource 'org.apache.sling:org.apache.sling.launchpad:xml:bundlelist:6-SNAPSHOT' in repository apache.snapshots (http://repository.apache.org/snapshots)
[JENKINS] Archiving <https://builds.apache.org/job/sling-contrib-1.5/org.apache.sling$org.apache.sling.launchpad.contrib-testing/ws/pom.xml> to /home/hudson/hudson/jobs/sling-contrib-1.5/modules/org.apache.sling$org.apache.sling.launchpad.contrib-testing/builds/2011-10-06_20-57-58/archive/org.apache.sling/org.apache.sling.launchpad.contrib-testing/4-SNAPSHOT/org.apache.sling.launchpad.contrib-testing-4-SNAPSHOT.pom
[INFO] ------------------------------------------------------------------------
[ERROR] BUILD ERROR
[INFO] ------------------------------------------------------------------------
[INFO] Failed to resolve artifact.

GroupId: org.apache.sling
ArtifactId: org.apache.sling.launchpad
Version: 6-SNAPSHOT

Reason: Unable to download the artifact from any repository

Try downloading the file manually from the project website.

Then, install it using the command: 
    mvn install:install-file -DgroupId=org.apache.sling -DartifactId=org.apache.sling.launchpad -Dversion=6-SNAPSHOT -Dclassifier=bundlelist -Dpackaging=xml -Dfile=/path/to/file

Alternatively, if you host your own repository you can deploy the file there: 
    mvn deploy:deploy-file -DgroupId=org.apache.sling -DartifactId=org.apache.sling.launchpad -Dversion=6-SNAPSHOT -Dclassifier=bundlelist -Dpackaging=xml -Dfile=/path/to/file -Durl=[url] -DrepositoryId=[id]


  org.apache.sling:org.apache.sling.launchpad:xml:6-SNAPSHOT

from the specified remote repositories:
  central (http://repo1.maven.org/maven2),
  Nexus (http://repository.apache.org/snapshots),
  scala-tools.org (http://scala-tools.org/repo-releases)



[INFO] ------------------------------------------------------------------------
[INFO] For more information, run Maven with the -e switch
[INFO] ------------------------------------------------------------------------
[INFO] Total time: 12 minutes 
[INFO] Finished at: Thu Oct 06 21:10:25 UTC 2011
[INFO] Final Memory: 95M/146M
[INFO] ------------------------------------------------------------------------


Build failed in Jenkins: sling-contrib-1.5 » Apache Sling Launchpad Contrib Testing #735

Posted by Apache Jenkins Server <je...@builds.apache.org>.
See <https://builds.apache.org/job/sling-contrib-1.5/org.apache.sling$org.apache.sling.launchpad.contrib-testing/735/>

------------------------------------------
[INFO] ------------------------------------------------------------------------
[INFO] Building Apache Sling Launchpad Contrib Testing
[INFO]    task-segment: [clean, install]
[INFO] ------------------------------------------------------------------------
[INFO] [clean:clean {execution: default-clean}]
[INFO] Deleting file-set: <https://builds.apache.org/job/sling-contrib-1.5/org.apache.sling$org.apache.sling.launchpad.contrib-testing/ws/> (included: [derby.log, cachedir, sling], excluded: [])
[INFO] snapshot org.apache.sling:org.apache.sling.launchpad.base:2.3.1-SNAPSHOT: checking for updates from scala-tools.org
[INFO] snapshot org.apache.sling:org.apache.sling.launchpad.base:2.3.1-SNAPSHOT: checking for updates from apache.snapshots
Downloading: http://repository.apache.org/snapshots/org/apache/sling/org.apache.sling.launchpad.base/2.3.1-SNAPSHOT/org.apache.sling.launchpad.base-2.3.1-20111005.235405-270.pom
13K downloaded  (org.apache.sling.launchpad.base-2.3.1-20111005.235405-270.pom)
Downloading: http://repository.apache.org/snapshots/org/apache/sling/org.apache.sling.launchpad.base/2.3.1-SNAPSHOT/org.apache.sling.launchpad.base-2.3.1-20111005.235405-270-webapp.war
86K downloaded  (org.apache.sling.launchpad.base-2.3.1-20111005.235405-270-webapp.war)
[INFO] [enforcer:enforce {execution: enforce-java}]
[INFO] [launchpad:prepare-package {execution: prepare-package}]
[INFO] snapshot org.apache.sling:org.apache.sling.launchpad:6-SNAPSHOT: checking for updates from scala-tools.org
[INFO] snapshot org.apache.sling:org.apache.sling.launchpad:6-SNAPSHOT: checking for updates from apache.snapshots
Downloading: http://scala-tools.org/repo-releases/org/apache/sling/org.apache.sling.launchpad/6-SNAPSHOT/org.apache.sling.launchpad-6-SNAPSHOT-bundlelist.xml
[INFO] Unable to find resource 'org.apache.sling:org.apache.sling.launchpad:xml:bundlelist:6-SNAPSHOT' in repository scala-tools.org (http://scala-tools.org/repo-releases)
Downloading: http://repository.apache.org/snapshots/org/apache/sling/org.apache.sling.launchpad/6-SNAPSHOT/org.apache.sling.launchpad-6-SNAPSHOT-bundlelist.xml
[INFO] Unable to find resource 'org.apache.sling:org.apache.sling.launchpad:xml:bundlelist:6-SNAPSHOT' in repository apache.snapshots (http://repository.apache.org/snapshots)
[JENKINS] Archiving <https://builds.apache.org/job/sling-contrib-1.5/org.apache.sling$org.apache.sling.launchpad.contrib-testing/ws/pom.xml> to /home/hudson/hudson/jobs/sling-contrib-1.5/modules/org.apache.sling$org.apache.sling.launchpad.contrib-testing/builds/2011-10-06_00-58-46/archive/org.apache.sling/org.apache.sling.launchpad.contrib-testing/4-SNAPSHOT/org.apache.sling.launchpad.contrib-testing-4-SNAPSHOT.pom
[INFO] ------------------------------------------------------------------------
[ERROR] BUILD ERROR
[INFO] ------------------------------------------------------------------------
[INFO] Failed to resolve artifact.

GroupId: org.apache.sling
ArtifactId: org.apache.sling.launchpad
Version: 6-SNAPSHOT

Reason: Unable to download the artifact from any repository

Try downloading the file manually from the project website.

Then, install it using the command: 
    mvn install:install-file -DgroupId=org.apache.sling -DartifactId=org.apache.sling.launchpad -Dversion=6-SNAPSHOT -Dclassifier=bundlelist -Dpackaging=xml -Dfile=/path/to/file

Alternatively, if you host your own repository you can deploy the file there: 
    mvn deploy:deploy-file -DgroupId=org.apache.sling -DartifactId=org.apache.sling.launchpad -Dversion=6-SNAPSHOT -Dclassifier=bundlelist -Dpackaging=xml -Dfile=/path/to/file -Durl=[url] -DrepositoryId=[id]


  org.apache.sling:org.apache.sling.launchpad:xml:6-SNAPSHOT

from the specified remote repositories:
  central (http://repo1.maven.org/maven2),
  Nexus (http://repository.apache.org/snapshots),
  scala-tools.org (http://scala-tools.org/repo-releases)



[INFO] ------------------------------------------------------------------------
[INFO] For more information, run Maven with the -e switch
[INFO] ------------------------------------------------------------------------
[INFO] Total time: 10 minutes 29 seconds
[INFO] Finished at: Thu Oct 06 01:09:41 UTC 2011
[INFO] Final Memory: 90M/148M
[INFO] ------------------------------------------------------------------------


Build failed in Jenkins: sling-contrib-1.5 » Apache Sling Launchpad Contrib Testing #734

Posted by Apache Jenkins Server <je...@builds.apache.org>.
See <https://builds.apache.org/job/sling-contrib-1.5/org.apache.sling$org.apache.sling.launchpad.contrib-testing/734/>

------------------------------------------
[INFO] ------------------------------------------------------------------------
[INFO] Building Apache Sling Launchpad Contrib Testing
[INFO]    task-segment: [clean, install]
[INFO] ------------------------------------------------------------------------
[INFO] [clean:clean {execution: default-clean}]
[INFO] Deleting file-set: <https://builds.apache.org/job/sling-contrib-1.5/org.apache.sling$org.apache.sling.launchpad.contrib-testing/ws/> (included: [derby.log, cachedir, sling], excluded: [])
[INFO] snapshot org.apache.sling:org.apache.sling.launchpad.base:2.3.1-SNAPSHOT: checking for updates from scala-tools.org
[INFO] snapshot org.apache.sling:org.apache.sling.launchpad.base:2.3.1-SNAPSHOT: checking for updates from apache.snapshots
[INFO] [enforcer:enforce {execution: enforce-java}]
[INFO] [launchpad:prepare-package {execution: prepare-package}]
[INFO] snapshot org.apache.sling:org.apache.sling.launchpad:6-SNAPSHOT: checking for updates from scala-tools.org
[INFO] snapshot org.apache.sling:org.apache.sling.launchpad:6-SNAPSHOT: checking for updates from apache.snapshots
Downloading: http://scala-tools.org/repo-releases/org/apache/sling/org.apache.sling.launchpad/6-SNAPSHOT/org.apache.sling.launchpad-6-SNAPSHOT-bundlelist.xml
[INFO] Unable to find resource 'org.apache.sling:org.apache.sling.launchpad:xml:bundlelist:6-SNAPSHOT' in repository scala-tools.org (http://scala-tools.org/repo-releases)
Downloading: http://repository.apache.org/snapshots/org/apache/sling/org.apache.sling.launchpad/6-SNAPSHOT/org.apache.sling.launchpad-6-SNAPSHOT-bundlelist.xml
[INFO] Unable to find resource 'org.apache.sling:org.apache.sling.launchpad:xml:bundlelist:6-SNAPSHOT' in repository apache.snapshots (http://repository.apache.org/snapshots)
[JENKINS] Archiving <https://builds.apache.org/job/sling-contrib-1.5/org.apache.sling$org.apache.sling.launchpad.contrib-testing/ws/pom.xml> to /home/hudson/hudson/jobs/sling-contrib-1.5/modules/org.apache.sling$org.apache.sling.launchpad.contrib-testing/builds/2011-10-05_23-18-53/archive/org.apache.sling/org.apache.sling.launchpad.contrib-testing/4-SNAPSHOT/org.apache.sling.launchpad.contrib-testing-4-SNAPSHOT.pom
[INFO] ------------------------------------------------------------------------
[ERROR] BUILD ERROR
[INFO] ------------------------------------------------------------------------
[INFO] Failed to resolve artifact.

GroupId: org.apache.sling
ArtifactId: org.apache.sling.launchpad
Version: 6-SNAPSHOT

Reason: Unable to download the artifact from any repository

Try downloading the file manually from the project website.

Then, install it using the command: 
    mvn install:install-file -DgroupId=org.apache.sling -DartifactId=org.apache.sling.launchpad -Dversion=6-SNAPSHOT -Dclassifier=bundlelist -Dpackaging=xml -Dfile=/path/to/file

Alternatively, if you host your own repository you can deploy the file there: 
    mvn deploy:deploy-file -DgroupId=org.apache.sling -DartifactId=org.apache.sling.launchpad -Dversion=6-SNAPSHOT -Dclassifier=bundlelist -Dpackaging=xml -Dfile=/path/to/file -Durl=[url] -DrepositoryId=[id]


  org.apache.sling:org.apache.sling.launchpad:xml:6-SNAPSHOT

from the specified remote repositories:
  central (http://repo1.maven.org/maven2),
  Nexus (http://repository.apache.org/snapshots),
  scala-tools.org (http://scala-tools.org/repo-releases)



[INFO] ------------------------------------------------------------------------
[INFO] For more information, run Maven with the -e switch
[INFO] ------------------------------------------------------------------------
[INFO] Total time: 9 minutes 56 seconds
[INFO] Finished at: Wed Oct 05 23:29:18 UTC 2011
[INFO] Final Memory: 96M/155M
[INFO] ------------------------------------------------------------------------


Build failed in Jenkins: sling-contrib-1.5 » Apache Sling Launchpad Contrib Testing #733

Posted by Apache Jenkins Server <je...@builds.apache.org>.
See <https://builds.apache.org/job/sling-contrib-1.5/org.apache.sling$org.apache.sling.launchpad.contrib-testing/733/>

------------------------------------------
[INFO] ------------------------------------------------------------------------
[INFO] Building Apache Sling Launchpad Contrib Testing
[INFO]    task-segment: [clean, install]
[INFO] ------------------------------------------------------------------------
[INFO] [clean:clean {execution: default-clean}]
[INFO] Deleting file-set: <https://builds.apache.org/job/sling-contrib-1.5/org.apache.sling$org.apache.sling.launchpad.contrib-testing/ws/> (included: [derby.log, cachedir, sling], excluded: [])
[INFO] snapshot org.apache.sling:org.apache.sling.launchpad.base:2.3.1-SNAPSHOT: checking for updates from scala-tools.org
[INFO] snapshot org.apache.sling:org.apache.sling.launchpad.base:2.3.1-SNAPSHOT: checking for updates from apache.snapshots
Downloading: http://repository.apache.org/snapshots/org/apache/sling/org.apache.sling.launchpad.base/2.3.1-SNAPSHOT/org.apache.sling.launchpad.base-2.3.1-20111002.170614-267.pom
13K downloaded  (org.apache.sling.launchpad.base-2.3.1-20111002.170614-267.pom)
Downloading: http://repository.apache.org/snapshots/org/apache/sling/org.apache.sling.launchpad.base/2.3.1-SNAPSHOT/org.apache.sling.launchpad.base-2.3.1-20111002.170614-267-webapp.war
86K downloaded  (org.apache.sling.launchpad.base-2.3.1-20111002.170614-267-webapp.war)
[INFO] [enforcer:enforce {execution: enforce-java}]
[INFO] [launchpad:prepare-package {execution: prepare-package}]
[INFO] snapshot org.apache.sling:org.apache.sling.launchpad:6-SNAPSHOT: checking for updates from scala-tools.org
[INFO] snapshot org.apache.sling:org.apache.sling.launchpad:6-SNAPSHOT: checking for updates from apache.snapshots
Downloading: http://scala-tools.org/repo-releases/org/apache/sling/org.apache.sling.launchpad/6-SNAPSHOT/org.apache.sling.launchpad-6-SNAPSHOT-bundlelist.xml
[INFO] Unable to find resource 'org.apache.sling:org.apache.sling.launchpad:xml:bundlelist:6-SNAPSHOT' in repository scala-tools.org (http://scala-tools.org/repo-releases)
Downloading: http://repository.apache.org/snapshots/org/apache/sling/org.apache.sling.launchpad/6-SNAPSHOT/org.apache.sling.launchpad-6-SNAPSHOT-bundlelist.xml
[INFO] Unable to find resource 'org.apache.sling:org.apache.sling.launchpad:xml:bundlelist:6-SNAPSHOT' in repository apache.snapshots (http://repository.apache.org/snapshots)
[JENKINS] Archiving <https://builds.apache.org/job/sling-contrib-1.5/org.apache.sling$org.apache.sling.launchpad.contrib-testing/ws/pom.xml> to /home/hudson/hudson/jobs/sling-contrib-1.5/modules/org.apache.sling$org.apache.sling.launchpad.contrib-testing/builds/2011-10-02_17-43-38/archive/org.apache.sling/org.apache.sling.launchpad.contrib-testing/4-SNAPSHOT/org.apache.sling.launchpad.contrib-testing-4-SNAPSHOT.pom
[INFO] ------------------------------------------------------------------------
[ERROR] BUILD ERROR
[INFO] ------------------------------------------------------------------------
[INFO] Failed to resolve artifact.

GroupId: org.apache.sling
ArtifactId: org.apache.sling.launchpad
Version: 6-SNAPSHOT

Reason: Unable to download the artifact from any repository

Try downloading the file manually from the project website.

Then, install it using the command: 
    mvn install:install-file -DgroupId=org.apache.sling -DartifactId=org.apache.sling.launchpad -Dversion=6-SNAPSHOT -Dclassifier=bundlelist -Dpackaging=xml -Dfile=/path/to/file

Alternatively, if you host your own repository you can deploy the file there: 
    mvn deploy:deploy-file -DgroupId=org.apache.sling -DartifactId=org.apache.sling.launchpad -Dversion=6-SNAPSHOT -Dclassifier=bundlelist -Dpackaging=xml -Dfile=/path/to/file -Durl=[url] -DrepositoryId=[id]


  org.apache.sling:org.apache.sling.launchpad:xml:6-SNAPSHOT

from the specified remote repositories:
  central (http://repo1.maven.org/maven2),
  Nexus (http://repository.apache.org/snapshots),
  scala-tools.org (http://scala-tools.org/repo-releases)



[INFO] ------------------------------------------------------------------------
[INFO] For more information, run Maven with the -e switch
[INFO] ------------------------------------------------------------------------
[INFO] Total time: 9 minutes 7 seconds
[INFO] Finished at: Sun Oct 02 17:53:12 UTC 2011
[INFO] Final Memory: 96M/150M
[INFO] ------------------------------------------------------------------------


Build failed in Jenkins: sling-contrib-1.5 » Apache Sling Launchpad Contrib Testing #732

Posted by Apache Jenkins Server <je...@builds.apache.org>.
See <https://builds.apache.org/job/sling-contrib-1.5/org.apache.sling$org.apache.sling.launchpad.contrib-testing/732/>

------------------------------------------
[INFO] ------------------------------------------------------------------------
[INFO] Building Apache Sling Launchpad Contrib Testing
[INFO]    task-segment: [clean, install]
[INFO] ------------------------------------------------------------------------
[INFO] [clean:clean {execution: default-clean}]
[INFO] Deleting file-set: <https://builds.apache.org/job/sling-contrib-1.5/org.apache.sling$org.apache.sling.launchpad.contrib-testing/ws/> (included: [derby.log, cachedir, sling], excluded: [])
[INFO] [enforcer:enforce {execution: enforce-java}]
[INFO] [launchpad:prepare-package {execution: prepare-package}]
Downloading: http://scala-tools.org/repo-releases/org/apache/sling/org.apache.sling.launchpad/6-SNAPSHOT/org.apache.sling.launchpad-6-SNAPSHOT-bundlelist.xml
[INFO] Unable to find resource 'org.apache.sling:org.apache.sling.launchpad:xml:bundlelist:6-SNAPSHOT' in repository scala-tools.org (http://scala-tools.org/repo-releases)
Downloading: http://repository.apache.org/snapshots/org/apache/sling/org.apache.sling.launchpad/6-SNAPSHOT/org.apache.sling.launchpad-6-SNAPSHOT-bundlelist.xml
[INFO] Unable to find resource 'org.apache.sling:org.apache.sling.launchpad:xml:bundlelist:6-SNAPSHOT' in repository apache.snapshots (http://repository.apache.org/snapshots)
[JENKINS] Archiving <https://builds.apache.org/job/sling-contrib-1.5/org.apache.sling$org.apache.sling.launchpad.contrib-testing/ws/pom.xml> to /home/hudson/hudson/jobs/sling-contrib-1.5/modules/org.apache.sling$org.apache.sling.launchpad.contrib-testing/builds/2011-09-28_15-51-16/archive/org.apache.sling/org.apache.sling.launchpad.contrib-testing/4-SNAPSHOT/org.apache.sling.launchpad.contrib-testing-4-SNAPSHOT.pom
[INFO] ------------------------------------------------------------------------
[ERROR] BUILD ERROR
[INFO] ------------------------------------------------------------------------
[INFO] Failed to resolve artifact.

GroupId: org.apache.sling
ArtifactId: org.apache.sling.launchpad
Version: 6-SNAPSHOT

Reason: Unable to download the artifact from any repository

Try downloading the file manually from the project website.

Then, install it using the command: 
    mvn install:install-file -DgroupId=org.apache.sling -DartifactId=org.apache.sling.launchpad -Dversion=6-SNAPSHOT -Dclassifier=bundlelist -Dpackaging=xml -Dfile=/path/to/file

Alternatively, if you host your own repository you can deploy the file there: 
    mvn deploy:deploy-file -DgroupId=org.apache.sling -DartifactId=org.apache.sling.launchpad -Dversion=6-SNAPSHOT -Dclassifier=bundlelist -Dpackaging=xml -Dfile=/path/to/file -Durl=[url] -DrepositoryId=[id]


  org.apache.sling:org.apache.sling.launchpad:xml:6-SNAPSHOT

from the specified remote repositories:
  central (http://repo1.maven.org/maven2),
  Nexus (http://repository.apache.org/snapshots),
  scala-tools.org (http://scala-tools.org/repo-releases)



[INFO] ------------------------------------------------------------------------
[INFO] For more information, run Maven with the -e switch
[INFO] ------------------------------------------------------------------------
[INFO] Total time: 9 minutes 13 seconds
[INFO] Finished at: Wed Sep 28 16:00:55 UTC 2011
[INFO] Final Memory: 91M/153M
[INFO] ------------------------------------------------------------------------


Build failed in Jenkins: sling-contrib-1.5 » Apache Sling Launchpad Contrib Testing #731

Posted by Apache Jenkins Server <je...@builds.apache.org>.
See <https://builds.apache.org/job/sling-contrib-1.5/org.apache.sling$org.apache.sling.launchpad.contrib-testing/731/>

------------------------------------------
[INFO] ------------------------------------------------------------------------
[INFO] Building Apache Sling Launchpad Contrib Testing
[INFO]    task-segment: [clean, install]
[INFO] ------------------------------------------------------------------------
[INFO] [clean:clean {execution: default-clean}]
[INFO] Deleting file-set: <https://builds.apache.org/job/sling-contrib-1.5/org.apache.sling$org.apache.sling.launchpad.contrib-testing/ws/> (included: [derby.log, cachedir, sling], excluded: [])
[INFO] snapshot org.apache.sling:org.apache.sling.launchpad.base:2.3.1-SNAPSHOT: checking for updates from scala-tools.org
[INFO] snapshot org.apache.sling:org.apache.sling.launchpad.base:2.3.1-SNAPSHOT: checking for updates from apache.snapshots
Downloading: http://repository.apache.org/snapshots/org/apache/sling/org.apache.sling.launchpad.base/2.3.1-SNAPSHOT/org.apache.sling.launchpad.base-2.3.1-20110928.082021-264.pom
13K downloaded  (org.apache.sling.launchpad.base-2.3.1-20110928.082021-264.pom)
Downloading: http://repository.apache.org/snapshots/org/apache/sling/org.apache.sling.launchpad.base/2.3.1-SNAPSHOT/org.apache.sling.launchpad.base-2.3.1-20110928.082021-264-webapp.war
86K downloaded  (org.apache.sling.launchpad.base-2.3.1-20110928.082021-264-webapp.war)
[INFO] [enforcer:enforce {execution: enforce-java}]
[INFO] [launchpad:prepare-package {execution: prepare-package}]
[INFO] snapshot org.apache.sling:org.apache.sling.launchpad:6-SNAPSHOT: checking for updates from scala-tools.org
[INFO] snapshot org.apache.sling:org.apache.sling.launchpad:6-SNAPSHOT: checking for updates from apache.snapshots
Downloading: http://scala-tools.org/repo-releases/org/apache/sling/org.apache.sling.launchpad/6-SNAPSHOT/org.apache.sling.launchpad-6-SNAPSHOT-bundlelist.xml
[INFO] Unable to find resource 'org.apache.sling:org.apache.sling.launchpad:xml:bundlelist:6-SNAPSHOT' in repository scala-tools.org (http://scala-tools.org/repo-releases)
Downloading: http://repository.apache.org/snapshots/org/apache/sling/org.apache.sling.launchpad/6-SNAPSHOT/org.apache.sling.launchpad-6-SNAPSHOT-bundlelist.xml
[INFO] Unable to find resource 'org.apache.sling:org.apache.sling.launchpad:xml:bundlelist:6-SNAPSHOT' in repository apache.snapshots (http://repository.apache.org/snapshots)
[JENKINS] Archiving <https://builds.apache.org/job/sling-contrib-1.5/org.apache.sling$org.apache.sling.launchpad.contrib-testing/ws/pom.xml> to /home/hudson/hudson/jobs/sling-contrib-1.5/modules/org.apache.sling$org.apache.sling.launchpad.contrib-testing/builds/2011-09-28_08-56-51/archive/org.apache.sling/org.apache.sling.launchpad.contrib-testing/4-SNAPSHOT/org.apache.sling.launchpad.contrib-testing-4-SNAPSHOT.pom
[INFO] ------------------------------------------------------------------------
[ERROR] BUILD ERROR
[INFO] ------------------------------------------------------------------------
[INFO] Failed to resolve artifact.

GroupId: org.apache.sling
ArtifactId: org.apache.sling.launchpad
Version: 6-SNAPSHOT

Reason: Unable to download the artifact from any repository

Try downloading the file manually from the project website.

Then, install it using the command: 
    mvn install:install-file -DgroupId=org.apache.sling -DartifactId=org.apache.sling.launchpad -Dversion=6-SNAPSHOT -Dclassifier=bundlelist -Dpackaging=xml -Dfile=/path/to/file

Alternatively, if you host your own repository you can deploy the file there: 
    mvn deploy:deploy-file -DgroupId=org.apache.sling -DartifactId=org.apache.sling.launchpad -Dversion=6-SNAPSHOT -Dclassifier=bundlelist -Dpackaging=xml -Dfile=/path/to/file -Durl=[url] -DrepositoryId=[id]


  org.apache.sling:org.apache.sling.launchpad:xml:6-SNAPSHOT

from the specified remote repositories:
  central (http://repo1.maven.org/maven2),
  Nexus (http://repository.apache.org/snapshots),
  scala-tools.org (http://scala-tools.org/repo-releases)



[INFO] ------------------------------------------------------------------------
[INFO] For more information, run Maven with the -e switch
[INFO] ------------------------------------------------------------------------
[INFO] Total time: 9 minutes 26 seconds
[INFO] Finished at: Wed Sep 28 09:06:46 UTC 2011
[INFO] Final Memory: 95M/149M
[INFO] ------------------------------------------------------------------------


Build failed in Jenkins: sling-contrib-1.5 » Apache Sling Launchpad Contrib Testing #730

Posted by Apache Jenkins Server <je...@builds.apache.org>.
See <https://builds.apache.org/job/sling-contrib-1.5/org.apache.sling$org.apache.sling.launchpad.contrib-testing/730/>

------------------------------------------
[INFO] ------------------------------------------------------------------------
[INFO] Building Apache Sling Launchpad Contrib Testing
[INFO]    task-segment: [clean, install]
[INFO] ------------------------------------------------------------------------
[INFO] [clean:clean {execution: default-clean}]
[INFO] Deleting file-set: <https://builds.apache.org/job/sling-contrib-1.5/org.apache.sling$org.apache.sling.launchpad.contrib-testing/ws/> (included: [derby.log, cachedir, sling], excluded: [])
[INFO] snapshot org.apache.sling:org.apache.sling.launchpad.base:2.3.1-SNAPSHOT: checking for updates from scala-tools.org
[INFO] snapshot org.apache.sling:org.apache.sling.launchpad.base:2.3.1-SNAPSHOT: checking for updates from apache.snapshots
[INFO] [enforcer:enforce {execution: enforce-java}]
[INFO] [launchpad:prepare-package {execution: prepare-package}]
[INFO] snapshot org.apache.sling:org.apache.sling.launchpad:6-SNAPSHOT: checking for updates from scala-tools.org
[INFO] snapshot org.apache.sling:org.apache.sling.launchpad:6-SNAPSHOT: checking for updates from apache.snapshots
Downloading: http://scala-tools.org/repo-releases/org/apache/sling/org.apache.sling.launchpad/6-SNAPSHOT/org.apache.sling.launchpad-6-SNAPSHOT-bundlelist.xml
[INFO] Unable to find resource 'org.apache.sling:org.apache.sling.launchpad:xml:bundlelist:6-SNAPSHOT' in repository scala-tools.org (http://scala-tools.org/repo-releases)
Downloading: http://repository.apache.org/snapshots/org/apache/sling/org.apache.sling.launchpad/6-SNAPSHOT/org.apache.sling.launchpad-6-SNAPSHOT-bundlelist.xml
[INFO] Unable to find resource 'org.apache.sling:org.apache.sling.launchpad:xml:bundlelist:6-SNAPSHOT' in repository apache.snapshots (http://repository.apache.org/snapshots)
[JENKINS] Archiving <https://builds.apache.org/job/sling-contrib-1.5/org.apache.sling$org.apache.sling.launchpad.contrib-testing/ws/pom.xml> to /home/hudson/hudson/jobs/sling-contrib-1.5/modules/org.apache.sling$org.apache.sling.launchpad.contrib-testing/builds/2011-09-26_19-06-37/archive/org.apache.sling/org.apache.sling.launchpad.contrib-testing/4-SNAPSHOT/org.apache.sling.launchpad.contrib-testing-4-SNAPSHOT.pom
[INFO] ------------------------------------------------------------------------
[ERROR] BUILD ERROR
[INFO] ------------------------------------------------------------------------
[INFO] Failed to resolve artifact.

GroupId: org.apache.sling
ArtifactId: org.apache.sling.launchpad
Version: 6-SNAPSHOT

Reason: Unable to download the artifact from any repository

Try downloading the file manually from the project website.

Then, install it using the command: 
    mvn install:install-file -DgroupId=org.apache.sling -DartifactId=org.apache.sling.launchpad -Dversion=6-SNAPSHOT -Dclassifier=bundlelist -Dpackaging=xml -Dfile=/path/to/file

Alternatively, if you host your own repository you can deploy the file there: 
    mvn deploy:deploy-file -DgroupId=org.apache.sling -DartifactId=org.apache.sling.launchpad -Dversion=6-SNAPSHOT -Dclassifier=bundlelist -Dpackaging=xml -Dfile=/path/to/file -Durl=[url] -DrepositoryId=[id]


  org.apache.sling:org.apache.sling.launchpad:xml:6-SNAPSHOT

from the specified remote repositories:
  central (http://repo1.maven.org/maven2),
  Nexus (http://repository.apache.org/snapshots),
  scala-tools.org (http://scala-tools.org/repo-releases)



[INFO] ------------------------------------------------------------------------
[INFO] For more information, run Maven with the -e switch
[INFO] ------------------------------------------------------------------------
[INFO] Total time: 16 minutes 14 seconds
[INFO] Finished at: Mon Sep 26 19:26:19 UTC 2011
[INFO] Final Memory: 96M/149M
[INFO] ------------------------------------------------------------------------


Build failed in Jenkins: sling-contrib-1.5 » Apache Sling Launchpad Contrib Testing #729

Posted by Apache Jenkins Server <je...@builds.apache.org>.
See <https://builds.apache.org/job/sling-contrib-1.5/org.apache.sling$org.apache.sling.launchpad.contrib-testing/729/>

------------------------------------------
[INFO] ------------------------------------------------------------------------
[INFO] Building Apache Sling Launchpad Contrib Testing
[INFO]    task-segment: [clean, install]
[INFO] ------------------------------------------------------------------------
[INFO] [clean:clean {execution: default-clean}]
[INFO] Deleting file-set: <https://builds.apache.org/job/sling-contrib-1.5/org.apache.sling$org.apache.sling.launchpad.contrib-testing/ws/> (included: [derby.log, cachedir, sling], excluded: [])
[INFO] [enforcer:enforce {execution: enforce-java}]
[INFO] [launchpad:prepare-package {execution: prepare-package}]
Downloading: http://scala-tools.org/repo-releases/org/apache/sling/org.apache.sling.launchpad/6-SNAPSHOT/org.apache.sling.launchpad-6-SNAPSHOT-bundlelist.xml
[INFO] Unable to find resource 'org.apache.sling:org.apache.sling.launchpad:xml:bundlelist:6-SNAPSHOT' in repository scala-tools.org (http://scala-tools.org/repo-releases)
Downloading: http://repository.apache.org/snapshots/org/apache/sling/org.apache.sling.launchpad/6-SNAPSHOT/org.apache.sling.launchpad-6-SNAPSHOT-bundlelist.xml
[INFO] Unable to find resource 'org.apache.sling:org.apache.sling.launchpad:xml:bundlelist:6-SNAPSHOT' in repository apache.snapshots (http://repository.apache.org/snapshots)
[JENKINS] Archiving <https://builds.apache.org/job/sling-contrib-1.5/org.apache.sling$org.apache.sling.launchpad.contrib-testing/ws/pom.xml> to /home/hudson/hudson/jobs/sling-contrib-1.5/modules/org.apache.sling$org.apache.sling.launchpad.contrib-testing/builds/2011-09-22_23-42-43/archive/org.apache.sling/org.apache.sling.launchpad.contrib-testing/4-SNAPSHOT/org.apache.sling.launchpad.contrib-testing-4-SNAPSHOT.pom
[INFO] ------------------------------------------------------------------------
[ERROR] BUILD ERROR
[INFO] ------------------------------------------------------------------------
[INFO] Failed to resolve artifact.

GroupId: org.apache.sling
ArtifactId: org.apache.sling.launchpad
Version: 6-SNAPSHOT

Reason: Unable to download the artifact from any repository

Try downloading the file manually from the project website.

Then, install it using the command: 
    mvn install:install-file -DgroupId=org.apache.sling -DartifactId=org.apache.sling.launchpad -Dversion=6-SNAPSHOT -Dclassifier=bundlelist -Dpackaging=xml -Dfile=/path/to/file

Alternatively, if you host your own repository you can deploy the file there: 
    mvn deploy:deploy-file -DgroupId=org.apache.sling -DartifactId=org.apache.sling.launchpad -Dversion=6-SNAPSHOT -Dclassifier=bundlelist -Dpackaging=xml -Dfile=/path/to/file -Durl=[url] -DrepositoryId=[id]


  org.apache.sling:org.apache.sling.launchpad:xml:6-SNAPSHOT

from the specified remote repositories:
  central (http://repo1.maven.org/maven2),
  Nexus (http://repository.apache.org/snapshots),
  scala-tools.org (http://scala-tools.org/repo-releases)



[INFO] ------------------------------------------------------------------------
[INFO] For more information, run Maven with the -e switch
[INFO] ------------------------------------------------------------------------
[INFO] Total time: 9 minutes 25 seconds
[INFO] Finished at: Thu Sep 22 23:52:35 UTC 2011
[INFO] Final Memory: 96M/158M
[INFO] ------------------------------------------------------------------------


Build failed in Jenkins: sling-contrib-1.5 » Apache Sling Launchpad Contrib Testing #728

Posted by Apache Jenkins Server <je...@builds.apache.org>.
See <https://builds.apache.org/job/sling-contrib-1.5/org.apache.sling$org.apache.sling.launchpad.contrib-testing/728/>

------------------------------------------
[INFO] ------------------------------------------------------------------------
[INFO] Building Apache Sling Launchpad Contrib Testing
[INFO]    task-segment: [clean, install]
[INFO] ------------------------------------------------------------------------
[INFO] [clean:clean {execution: default-clean}]
[INFO] Deleting file-set: <https://builds.apache.org/job/sling-contrib-1.5/org.apache.sling$org.apache.sling.launchpad.contrib-testing/ws/> (included: [derby.log, cachedir, sling], excluded: [])
[INFO] snapshot org.apache.sling:org.apache.sling.launchpad.base:2.3.1-SNAPSHOT: checking for updates from scala-tools.org
[INFO] snapshot org.apache.sling:org.apache.sling.launchpad.base:2.3.1-SNAPSHOT: checking for updates from apache.snapshots
Downloading: http://repository.apache.org/snapshots/org/apache/sling/org.apache.sling.launchpad.base/2.3.1-SNAPSHOT/org.apache.sling.launchpad.base-2.3.1-20110922.160831-253.pom
13K downloaded  (org.apache.sling.launchpad.base-2.3.1-20110922.160831-253.pom)
Downloading: http://repository.apache.org/snapshots/org/apache/sling/org.apache.sling.launchpad.base/2.3.1-SNAPSHOT/org.apache.sling.launchpad.base-2.3.1-20110922.160831-253-webapp.war
86K downloaded  (org.apache.sling.launchpad.base-2.3.1-20110922.160831-253-webapp.war)
[INFO] [enforcer:enforce {execution: enforce-java}]
[INFO] [launchpad:prepare-package {execution: prepare-package}]
[INFO] snapshot org.apache.sling:org.apache.sling.launchpad:6-SNAPSHOT: checking for updates from scala-tools.org
[INFO] snapshot org.apache.sling:org.apache.sling.launchpad:6-SNAPSHOT: checking for updates from apache.snapshots
Downloading: http://scala-tools.org/repo-releases/org/apache/sling/org.apache.sling.launchpad/6-SNAPSHOT/org.apache.sling.launchpad-6-SNAPSHOT-bundlelist.xml
[INFO] Unable to find resource 'org.apache.sling:org.apache.sling.launchpad:xml:bundlelist:6-SNAPSHOT' in repository scala-tools.org (http://scala-tools.org/repo-releases)
Downloading: http://repository.apache.org/snapshots/org/apache/sling/org.apache.sling.launchpad/6-SNAPSHOT/org.apache.sling.launchpad-6-SNAPSHOT-bundlelist.xml
[INFO] Unable to find resource 'org.apache.sling:org.apache.sling.launchpad:xml:bundlelist:6-SNAPSHOT' in repository apache.snapshots (http://repository.apache.org/snapshots)
[JENKINS] Archiving <https://builds.apache.org/job/sling-contrib-1.5/org.apache.sling$org.apache.sling.launchpad.contrib-testing/ws/pom.xml> to /home/hudson/hudson/jobs/sling-contrib-1.5/modules/org.apache.sling$org.apache.sling.launchpad.contrib-testing/builds/2011-09-22_16-42-58/archive/org.apache.sling/org.apache.sling.launchpad.contrib-testing/4-SNAPSHOT/org.apache.sling.launchpad.contrib-testing-4-SNAPSHOT.pom
[INFO] ------------------------------------------------------------------------
[ERROR] BUILD ERROR
[INFO] ------------------------------------------------------------------------
[INFO] Failed to resolve artifact.

GroupId: org.apache.sling
ArtifactId: org.apache.sling.launchpad
Version: 6-SNAPSHOT

Reason: Unable to download the artifact from any repository

Try downloading the file manually from the project website.

Then, install it using the command: 
    mvn install:install-file -DgroupId=org.apache.sling -DartifactId=org.apache.sling.launchpad -Dversion=6-SNAPSHOT -Dclassifier=bundlelist -Dpackaging=xml -Dfile=/path/to/file

Alternatively, if you host your own repository you can deploy the file there: 
    mvn deploy:deploy-file -DgroupId=org.apache.sling -DartifactId=org.apache.sling.launchpad -Dversion=6-SNAPSHOT -Dclassifier=bundlelist -Dpackaging=xml -Dfile=/path/to/file -Durl=[url] -DrepositoryId=[id]


  org.apache.sling:org.apache.sling.launchpad:xml:6-SNAPSHOT

from the specified remote repositories:
  central (http://repo1.maven.org/maven2),
  Nexus (http://repository.apache.org/snapshots),
  scala-tools.org (http://scala-tools.org/repo-releases)



[INFO] ------------------------------------------------------------------------
[INFO] For more information, run Maven with the -e switch
[INFO] ------------------------------------------------------------------------
[INFO] Total time: 9 minutes 22 seconds
[INFO] Finished at: Thu Sep 22 16:52:47 UTC 2011
[INFO] Final Memory: 90M/155M
[INFO] ------------------------------------------------------------------------


Build failed in Jenkins: sling-contrib-1.5 » Apache Sling Launchpad Contrib Testing #727

Posted by Apache Jenkins Server <je...@builds.apache.org>.
See <https://builds.apache.org/job/sling-contrib-1.5/org.apache.sling$org.apache.sling.launchpad.contrib-testing/727/>

------------------------------------------
[INFO] ------------------------------------------------------------------------
[INFO] Building Apache Sling Launchpad Contrib Testing
[INFO]    task-segment: [clean, install]
[INFO] ------------------------------------------------------------------------
[INFO] [clean:clean {execution: default-clean}]
[INFO] Deleting file-set: <https://builds.apache.org/job/sling-contrib-1.5/org.apache.sling$org.apache.sling.launchpad.contrib-testing/ws/> (included: [derby.log, cachedir, sling], excluded: [])
[INFO] snapshot org.apache.sling:org.apache.sling.launchpad.base:2.3.1-SNAPSHOT: checking for updates from scala-tools.org
[INFO] snapshot org.apache.sling:org.apache.sling.launchpad.base:2.3.1-SNAPSHOT: checking for updates from apache.snapshots
[INFO] [enforcer:enforce {execution: enforce-java}]
[INFO] [launchpad:prepare-package {execution: prepare-package}]
[INFO] snapshot org.apache.sling:org.apache.sling.launchpad:6-SNAPSHOT: checking for updates from scala-tools.org
[INFO] snapshot org.apache.sling:org.apache.sling.launchpad:6-SNAPSHOT: checking for updates from apache.snapshots
Downloading: http://scala-tools.org/repo-releases/org/apache/sling/org.apache.sling.launchpad/6-SNAPSHOT/org.apache.sling.launchpad-6-SNAPSHOT-bundlelist.xml
[INFO] Unable to find resource 'org.apache.sling:org.apache.sling.launchpad:xml:bundlelist:6-SNAPSHOT' in repository scala-tools.org (http://scala-tools.org/repo-releases)
Downloading: http://repository.apache.org/snapshots/org/apache/sling/org.apache.sling.launchpad/6-SNAPSHOT/org.apache.sling.launchpad-6-SNAPSHOT-bundlelist.xml
[INFO] Unable to find resource 'org.apache.sling:org.apache.sling.launchpad:xml:bundlelist:6-SNAPSHOT' in repository apache.snapshots (http://repository.apache.org/snapshots)
[JENKINS] Archiving <https://builds.apache.org/job/sling-contrib-1.5/org.apache.sling$org.apache.sling.launchpad.contrib-testing/ws/pom.xml> to /home/hudson/hudson/jobs/sling-contrib-1.5/modules/org.apache.sling$org.apache.sling.launchpad.contrib-testing/builds/2011-09-21_14-54-07/archive/org.apache.sling/org.apache.sling.launchpad.contrib-testing/4-SNAPSHOT/org.apache.sling.launchpad.contrib-testing-4-SNAPSHOT.pom
[INFO] ------------------------------------------------------------------------
[ERROR] BUILD ERROR
[INFO] ------------------------------------------------------------------------
[INFO] Failed to resolve artifact.

GroupId: org.apache.sling
ArtifactId: org.apache.sling.launchpad
Version: 6-SNAPSHOT

Reason: Unable to download the artifact from any repository

Try downloading the file manually from the project website.

Then, install it using the command: 
    mvn install:install-file -DgroupId=org.apache.sling -DartifactId=org.apache.sling.launchpad -Dversion=6-SNAPSHOT -Dclassifier=bundlelist -Dpackaging=xml -Dfile=/path/to/file

Alternatively, if you host your own repository you can deploy the file there: 
    mvn deploy:deploy-file -DgroupId=org.apache.sling -DartifactId=org.apache.sling.launchpad -Dversion=6-SNAPSHOT -Dclassifier=bundlelist -Dpackaging=xml -Dfile=/path/to/file -Durl=[url] -DrepositoryId=[id]


  org.apache.sling:org.apache.sling.launchpad:xml:6-SNAPSHOT

from the specified remote repositories:
  central (http://repo1.maven.org/maven2),
  Nexus (http://repository.apache.org/snapshots),
  scala-tools.org (http://scala-tools.org/repo-releases)



[INFO] ------------------------------------------------------------------------
[INFO] For more information, run Maven with the -e switch
[INFO] ------------------------------------------------------------------------
[INFO] Total time: 9 minutes 24 seconds
[INFO] Finished at: Wed Sep 21 15:03:57 UTC 2011
[INFO] Final Memory: 93M/144M
[INFO] ------------------------------------------------------------------------