You are viewing a plain text version of this content. The canonical link for it is here.
Posted to issues@tajo.apache.org by Apache Jenkins Server <je...@builds.apache.org> on 2015/04/17 09:02:19 UTC
Build failed in Jenkins: Tajo-master-CODEGEN-build #309
See <https://builds.apache.org/job/Tajo-master-CODEGEN-build/309/changes>
Changes:
[blrunner] TAJO-1442: Improve Hive Compatibility. (missing file)
------------------------------------------
[...truncated 344865 lines...]
TestMathFunctions.testRoundWithSpecifiedPrecision:452->ExprTestBase.testSimpleEval:176->ExprTestBase.testEval:196->ExprTestBase.testEval:284 » AbstractMethod
TestMathFunctions.testAbs:334->ExprTestBase.testSimpleEval:176->ExprTestBase.testEval:196->ExprTestBase.testEval:284 » AbstractMethod
TestMathFunctions.testCos:134->ExprTestBase.testSimpleEval:176->ExprTestBase.testEval:196->ExprTestBase.testEval:284 » AbstractMethod
TestMathFunctions.testDiv:247->ExprTestBase.testSimpleEval:176->ExprTestBase.testEval:196->ExprTestBase.testEval:284 » AbstractMethod
TestMathFunctions.testExp:313->ExprTestBase.testSimpleEval:176->ExprTestBase.testEval:196->ExprTestBase.testEval:284 » AbstractMethod
TestMathFunctions.testMod:231->ExprTestBase.testSimpleEval:176->ExprTestBase.testEval:196->ExprTestBase.testEval:284 » AbstractMethod
TestMathFunctions.testPow:397->ExprTestBase.testSimpleEval:176->ExprTestBase.testEval:196->ExprTestBase.testEval:284 » AbstractMethod
TestMathFunctions.testSin:117->ExprTestBase.testSimpleEval:176->ExprTestBase.testEval:196->ExprTestBase.testEval:284 » AbstractMethod
TestMathFunctions.testTan:150->ExprTestBase.testSimpleEval:176->ExprTestBase.testEval:196->ExprTestBase.testEval:284 » AbstractMethod
TestMathFunctions.testAtan2:214->ExprTestBase.testSimpleEval:176->ExprTestBase.testEval:196->ExprTestBase.testEval:284 » AbstractMethod
TestMathFunctions.testFloor:61->ExprTestBase.testSimpleEval:176->ExprTestBase.testEval:196->ExprTestBase.testEval:284 » AbstractMethod
TestMathFunctions.testRound:32->ExprTestBase.testSimpleEval:176->ExprTestBase.testEval:196->ExprTestBase.testEval:284 » AbstractMethod
TestMathFunctions.testAcos:182->ExprTestBase.testSimpleEval:176->ExprTestBase.testEval:196->ExprTestBase.testEval:284 » AbstractMethod
TestMathFunctions.testAsin:166->ExprTestBase.testSimpleEval:176->ExprTestBase.testEval:196->ExprTestBase.testEval:284 » AbstractMethod
TestMathFunctions.testAtan:198->ExprTestBase.testSimpleEval:176->ExprTestBase.testEval:196->ExprTestBase.testEval:284 » AbstractMethod
TestMathFunctions.testCbrt:355->ExprTestBase.testSimpleEval:176->ExprTestBase.testEval:196->ExprTestBase.testEval:284 » AbstractMethod
TestMathFunctions.testCeil:79->ExprTestBase.testSimpleEval:176->ExprTestBase.testEval:196->ExprTestBase.testEval:284 » AbstractMethod
TestMathFunctions.testSign:263->ExprTestBase.testSimpleEval:176->ExprTestBase.testEval:196->ExprTestBase.testEval:284 » AbstractMethod
TestMathFunctions.testSqrt:288->ExprTestBase.testSimpleEval:176->ExprTestBase.testEval:196->ExprTestBase.testEval:284 » AbstractMethod
TestMathFunctions.testPi:438->ExprTestBase.testSimpleEval:176->ExprTestBase.testEval:196->ExprTestBase.testEval:284 » AbstractMethod
TestMathFunctions.testCeiling:98->ExprTestBase.testSimpleEval:176->ExprTestBase.testEval:196->ExprTestBase.testEval:284 » AbstractMethod
TestMathFunctions.testRadians:418->ExprTestBase.testSimpleEval:176->ExprTestBase.testEval:196->ExprTestBase.testEval:284 » AbstractMethod
TestMathFunctions.testDegrees:377->ExprTestBase.testSimpleEval:176->ExprTestBase.testEval:196->ExprTestBase.testEval:284 » AbstractMethod
TestJsonFunctions.testJsonExtractPathText:32->ExprTestBase.testSimpleEval:176->ExprTestBase.testEval:196->ExprTestBase.testEval:284 » AbstractMethod
TestDateTimeFunctions.testDatePart:242->ExprTestBase.testEval:196->ExprTestBase.testEval:282 » Compilation
TestDateTimeFunctions.testExtract:125->ExprTestBase.testEval:196->ExprTestBase.testEval:282 » Compilation
TestDateTimeFunctions.testAddDays:398->ExprTestBase.testSimpleEval:176->ExprTestBase.testEval:196->ExprTestBase.testEval:284 » AbstractMethod
TestDateTimeFunctions.testToTimestamp:48->ExprTestBase.testSimpleEval:176->ExprTestBase.testEval:196->ExprTestBase.testEval:284 » AbstractMethod
TestDateTimeFunctions.testDateTimeNow:438->ExprTestBase.testSimpleEval:180->ExprTestBase.testEval:203->ExprTestBase.testEval:284 » AbstractMethod
TestDateTimeFunctions.testUtcUsecTo:349->ExprTestBase.testSimpleEval:176->ExprTestBase.testEval:196->ExprTestBase.testEval:284 » AbstractMethod
TestDateTimeFunctions.testTimeValueKeyword:467->ExprTestBase.testSimpleEval:180->ExprTestBase.testEval:203->ExprTestBase.testEval:284 » AbstractMethod
TestDateTimeFunctions.testAddMonths:367->ExprTestBase.testSimpleEval:176->ExprTestBase.testEval:196->ExprTestBase.testEval:284 » AbstractMethod
TestDateTimeFunctions.testToChar:109->ExprTestBase.testSimpleEval:176->ExprTestBase.testEval:196->ExprTestBase.testEval:284 » AbstractMethod
TestDateTimeFunctions.testToDate:358->ExprTestBase.testSimpleEval:176->ExprTestBase.testEval:196->ExprTestBase.testEval:284 » AbstractMethod
TestStringOperatorsAndFunctions.testRegexReplace:127->ExprTestBase.testSimpleEval:176->ExprTestBase.testEval:196->ExprTestBase.testEval:284 » AbstractMethod
TestStringOperatorsAndFunctions.testOctetLength:343->ExprTestBase.testSimpleEval:176->ExprTestBase.testEval:196->ExprTestBase.testEval:284 » AbstractMethod
TestStringOperatorsAndFunctions.testBin:329->ExprTestBase.testSimpleEval:176->ExprTestBase.testEval:196->ExprTestBase.testEval:284 » AbstractMethod
TestStringOperatorsAndFunctions.testChr:514->ExprTestBase.testSimpleEval:176->ExprTestBase.testEval:196->ExprTestBase.testEval:284 » AbstractMethod
TestStringOperatorsAndFunctions.testHex:314->ExprTestBase.testSimpleEval:176->ExprTestBase.testEval:196->ExprTestBase.testEval:284 » AbstractMethod
TestStringOperatorsAndFunctions.testMd5:287->ExprTestBase.testSimpleEval:176->ExprTestBase.testEval:196->ExprTestBase.testEval:284 » AbstractMethod
TestStringOperatorsAndFunctions.testAscii:501->ExprTestBase.testSimpleEval:176->ExprTestBase.testEval:196->ExprTestBase.testEval:284 » AbstractMethod
TestStringOperatorsAndFunctions.testLTrim:68->ExprTestBase.testSimpleEval:176->ExprTestBase.testEval:196->ExprTestBase.testEval:284 » AbstractMethod
TestStringOperatorsAndFunctions.testLower:250->ExprTestBase.testSimpleEval:176->ExprTestBase.testEval:196->ExprTestBase.testEval:284 » AbstractMethod
TestStringOperatorsAndFunctions.testRTrim:89->ExprTestBase.testSimpleEval:176->ExprTestBase.testEval:196->ExprTestBase.testEval:284 » AbstractMethod
TestStringOperatorsAndFunctions.testRight:181->ExprTestBase.testSimpleEval:176->ExprTestBase.testEval:196->ExprTestBase.testEval:284 » AbstractMethod
TestStringOperatorsAndFunctions.testUpper:237->ExprTestBase.testSimpleEval:176->ExprTestBase.testEval:196->ExprTestBase.testEval:284 » AbstractMethod
TestStringOperatorsAndFunctions.testLeft:152->ExprTestBase.testSimpleEval:176->ExprTestBase.testEval:196->ExprTestBase.testEval:284 » AbstractMethod
TestStringOperatorsAndFunctions.testLpad:528->ExprTestBase.testSimpleEval:176->ExprTestBase.testEval:196->ExprTestBase.testEval:284 » AbstractMethod
TestStringOperatorsAndFunctions.testRpad:538->ExprTestBase.testSimpleEval:176->ExprTestBase.testEval:196->ExprTestBase.testEval:284 » AbstractMethod
TestStringOperatorsAndFunctions.testTrim:110->ExprTestBase.testSimpleEval:176->ExprTestBase.testEval:196->ExprTestBase.testEval:284 » AbstractMethod
TestStringOperatorsAndFunctions.testConcat_ws:610->ExprTestBase.testSimpleEval:176->ExprTestBase.testEval:196->ExprTestBase.testEval:284 » AbstractMethod
TestStringOperatorsAndFunctions.testCharLength:263->ExprTestBase.testSimpleEval:176->ExprTestBase.testEval:196->ExprTestBase.testEval:284 » AbstractMethod
TestStringOperatorsAndFunctions.testBitLength:451->ExprTestBase.testSimpleEval:176->ExprTestBase.testEval:196->ExprTestBase.testEval:284 » AbstractMethod
TestStringOperatorsAndFunctions.testConcatenateOnExpressions:48->ExprTestBase.testSimpleEval:176->ExprTestBase.testEval:196->ExprTestBase.testEval:284 » AbstractMethod
TestStringOperatorsAndFunctions.testFunctionCallIngoreCases:56->ExprTestBase.testSimpleEval:176->ExprTestBase.testEval:196->ExprTestBase.testEval:284 » AbstractMethod
TestStringOperatorsAndFunctions.testQuote_ident:548->ExprTestBase.testSimpleEval:176->ExprTestBase.testEval:196->ExprTestBase.testEval:284 » AbstractMethod
TestStringOperatorsAndFunctions.testReverse:210->ExprTestBase.testSimpleEval:176->ExprTestBase.testEval:196->ExprTestBase.testEval:284 » AbstractMethod
TestStringOperatorsAndFunctions.testSplitPart:357->ExprTestBase.testSimpleEval:176->ExprTestBase.testEval:196->ExprTestBase.testEval:284 » AbstractMethod
TestStringOperatorsAndFunctions.testFindInSet:579->ExprTestBase.testSimpleEval:176->ExprTestBase.testEval:196->ExprTestBase.testEval:284 » AbstractMethod
TestStringOperatorsAndFunctions.testConcat:601->ExprTestBase.testSimpleEval:176->ExprTestBase.testEval:196->ExprTestBase.testEval:284 » AbstractMethod
TestStringOperatorsAndFunctions.testDecode:566->ExprTestBase.testSimpleEval:176->ExprTestBase.testEval:196->ExprTestBase.testEval:284 » AbstractMethod
TestStringOperatorsAndFunctions.testDigest:300->ExprTestBase.testSimpleEval:176->ExprTestBase.testEval:196->ExprTestBase.testEval:284 » AbstractMethod
TestStringOperatorsAndFunctions.testEncode:554->ExprTestBase.testSimpleEval:176->ExprTestBase.testEval:196->ExprTestBase.testEval:284 » AbstractMethod
TestStringOperatorsAndFunctions.testLength:275->ExprTestBase.testSimpleEval:176->ExprTestBase.testEval:196->ExprTestBase.testEval:284 » AbstractMethod
TestStringOperatorsAndFunctions.testLocate:403->ExprTestBase.testSimpleEval:176->ExprTestBase.testEval:196->ExprTestBase.testEval:284 » AbstractMethod
TestStringOperatorsAndFunctions.testInitcap:495->ExprTestBase.testSimpleEval:176->ExprTestBase.testEval:196->ExprTestBase.testEval:284 » AbstractMethod
TestStringOperatorsAndFunctions.testRepeat:223->ExprTestBase.testSimpleEval:176->ExprTestBase.testEval:196->ExprTestBase.testEval:284 » AbstractMethod
TestStringOperatorsAndFunctions.testStrpos:463->ExprTestBase.testSimpleEval:176->ExprTestBase.testEval:196->ExprTestBase.testEval:284 » AbstractMethod
TestStringOperatorsAndFunctions.testSubstr:376->ExprTestBase.testSimpleEval:176->ExprTestBase.testEval:196->ExprTestBase.testEval:284 » AbstractMethod
TestStringOperatorsAndFunctions.testConcatenateOnLiteral:35->ExprTestBase.testSimpleEval:176->ExprTestBase.testEval:196->ExprTestBase.testEval:284 » AbstractMethod
TestStringOperatorsAndFunctions.testStrposb:479->ExprTestBase.testSimpleEval:176->ExprTestBase.testEval:196->ExprTestBase.testEval:284 » AbstractMethod
TestJoinBroadcast.testMultiplePartitionedBroadcastDataFileWithZeroLength:770 » Service
TestInsertQuery.testInsertOverwriteWithUnion:727->QueryTestCaseBase.executeFile:424 » Service
TestInsertQuery.testInsertOverwriteWithUnionDifferentAlias:755->QueryTestCaseBase.executeFile:424 » Service
TestInsertQuery.testInsertOverwriteWithDatabase:615->QueryTestCaseBase.executeFile:424 » Service
TestInsertQuery.testInsertInto:69->QueryTestCaseBase.executeFile:424 » Service
TestInsertQuery.testInsertOverwriteSmallerColumns:304->QueryTestCaseBase.executeFile:424 » Service
TestInsertQuery.testInsertOverwrite:49->QueryTestCaseBase.executeFile:424 » Service
TestInsertQuery.testInsertOverwriteIntoParquet:546->QueryTestCaseBase.executeString:323 » Service
TestSelectQuery.testDatabaseRef:406->QueryTestCaseBase.executeFile:424 » Service
TestGroupByQuery.testGroupByWithNullData6:627->QueryTestCaseBase.executeString:323 » Service
TestGroupByQuery.testGroupByWithNullData7:639->QueryTestCaseBase.executeString:323 » Service
TestGroupByQuery.testGroupByWithNullData8:651->QueryTestCaseBase.executeString:323 » Service
TestGroupByQuery.testGroupByWithNullData9:663->QueryTestCaseBase.executeString:323 » Service
TestGroupByQuery.testDistinctAggregationCasebyCase11:435 » Service java.sql.SQ...
TestGroupByQuery.testGroupByWithNullData5:615->QueryTestCaseBase.executeString:323 » Service
TestGroupByQuery.testGroupByWithNullData6:627->QueryTestCaseBase.executeString:323 » Service
TestGroupByQuery.testGroupByWithNullData7:639->QueryTestCaseBase.executeString:323 » Service
TestGroupByQuery.testGroupByWithNullData8:651->QueryTestCaseBase.executeString:323 » Service
TestGroupByQuery.testGroupByWithNullData9:663->QueryTestCaseBase.executeString:323 » Service
TestGroupByQuery.testDistinctAggregationCaseByCase3:497 » Service java.sql.SQL...
TestGroupByQuery.testDistinctAggregationCaseByCase4:526 » Service java.sql.SQL...
TestGroupByQuery.testNumShufflePartition:724 » Service java.sql.SQLException: ...
TestGroupByQuery.testDistinctAggregationCasebyCase11:435 » Service java.sql.SQ...
TestJoinQuery.testLeftOuterJoinWithEmptySubquery1:479 » Service java.sql.SQLEx...
TestJoinQuery.testLeftOuterJoinWithEmptySubquery2:521 » Service java.sql.SQLEx...
TestJoinQuery.testRightOuterJoinPredicationCaseByCase1:886->createOuterJoinTestTable:1010 » Service
TestJoinQuery.testRightOuterJoinPredicationCaseByCase2:916->createOuterJoinTestTable:1010 » Service
TestJoinQuery.testRightOuterJoinPredicationCaseByCase3:944->createOuterJoinTestTable:1010 » Service
TestJoinQuery.testLeftOuterJoinPredicationCaseByCase1:652->createOuterJoinTestTable:1010 » Service
TestJoinQuery.testLeftOuterJoinPredicationCaseByCase2:680->createOuterJoinTestTable:1010 » Service
TestJoinQuery.testLeftOuterJoinPredicationCaseByCase3:741->createOuterJoinTestTable:1010 » Service
TestJoinQuery.testLeftOuterJoinPredicationCaseByCase4:771->createOuterJoinTestTable:1010 » Service
TestJoinQuery.testLeftOuterJoinPredicationCaseByCase5:801->createOuterJoinTestTable:1010 » Service
TestJoinQuery.testLeftOuterJoinPredicationCaseByCase6:831->createOuterJoinTestTable:1010 » Service
TestJoinQuery.testLeftOuterWithEmptyTable:860->createOuterJoinTestTable:1010 » Service
TestJoinQuery.testFullOuterJoinPredicationCaseByCase1:971->createOuterJoinTestTable:1010 » Service
TestJoinQuery.testJoinOnMultipleDatabases:564->QueryTestCaseBase.executeString:323 » Service
TestJoinQuery.testJoinOnMultipleDatabasesWithJson:607->QueryTestCaseBase.executeString:323 » Service
TestJoinQuery.testLeftOuterJoinPredicationCaseByCase2_1:709->createOuterJoinTestTable:1010 » Service
TestJoinQuery.testLeftOuterJoinWithEmptySubquery1:479 » Service java.sql.SQLEx...
TestJoinQuery.testLeftOuterJoinWithEmptySubquery2:521 » Service java.sql.SQLEx...
TestJoinQuery.testRightOuterJoinPredicationCaseByCase1:886->createOuterJoinTestTable:1010 » Service
TestJoinQuery.testRightOuterJoinPredicationCaseByCase2:916->createOuterJoinTestTable:1010 » Service
TestJoinQuery.testRightOuterJoinPredicationCaseByCase3:944->createOuterJoinTestTable:1010 » Service
TestJoinQuery.testLeftOuterJoinPredicationCaseByCase1:652->createOuterJoinTestTable:1010 » Service
TestJoinQuery.testLeftOuterJoinPredicationCaseByCase2:680->createOuterJoinTestTable:1010 » Service
TestJoinQuery.testLeftOuterJoinPredicationCaseByCase3:741->createOuterJoinTestTable:1010 » Service
TestJoinQuery.testLeftOuterJoinPredicationCaseByCase4:771->createOuterJoinTestTable:1010 » Service
TestJoinQuery.testLeftOuterJoinPredicationCaseByCase5:801->createOuterJoinTestTable:1010 » Service
TestJoinQuery.testLeftOuterJoinPredicationCaseByCase6:831->createOuterJoinTestTable:1010 » Service
TestJoinQuery.testLeftOuterWithEmptyTable:860->createOuterJoinTestTable:1010 » Service
TestJoinQuery.testFullOuterJoinPredicationCaseByCase1:971->createOuterJoinTestTable:1010 » Service
TestJoinQuery.testJoinOnMultipleDatabases:564->QueryTestCaseBase.executeString:323 » Service
TestJoinQuery.testJoinOnMultipleDatabasesWithJson:607->QueryTestCaseBase.executeString:323 » Service
TestJoinQuery.testLeftOuterJoinPredicationCaseByCase2_1:709->createOuterJoinTestTable:1010 » Service
TestJoinQuery.testLeftOuterJoinWithEmptySubquery1:479 » Service java.sql.SQLEx...
TestJoinQuery.testLeftOuterJoinWithEmptySubquery2:521 » Service java.sql.SQLEx...
TestJoinQuery.testRightOuterJoinPredicationCaseByCase1:886->createOuterJoinTestTable:1010 » Service
TestJoinQuery.testRightOuterJoinPredicationCaseByCase2:916->createOuterJoinTestTable:1010 » Service
TestJoinQuery.testRightOuterJoinPredicationCaseByCase3:944->createOuterJoinTestTable:1010 » Service
TestJoinQuery.testLeftOuterJoinPredicationCaseByCase1:652->createOuterJoinTestTable:1010 » Service
TestJoinQuery.testLeftOuterJoinPredicationCaseByCase2:680->createOuterJoinTestTable:1010 » Service
TestJoinQuery.testLeftOuterJoinPredicationCaseByCase3:741->createOuterJoinTestTable:1010 » Service
TestJoinQuery.testLeftOuterJoinPredicationCaseByCase4:771->createOuterJoinTestTable:1010 » Service
TestJoinQuery.testLeftOuterJoinPredicationCaseByCase5:801->createOuterJoinTestTable:1010 » Service
TestJoinQuery.testLeftOuterJoinPredicationCaseByCase6:831->createOuterJoinTestTable:1010 » Service
TestJoinQuery.testLeftOuterWithEmptyTable:860->createOuterJoinTestTable:1010 » Service
TestJoinQuery.testFullOuterJoinPredicationCaseByCase1:971->createOuterJoinTestTable:1010 » Service
TestJoinQuery.testJoinOnMultipleDatabases:564->QueryTestCaseBase.executeString:323 » Service
TestJoinQuery.testJoinOnMultipleDatabasesWithJson:607->QueryTestCaseBase.executeString:323 » Service
TestJoinQuery.testLeftOuterJoinPredicationCaseByCase2_1:709->createOuterJoinTestTable:1010 » Service
TestJoinQuery.testLeftOuterJoinWithEmptySubquery1:479 » Service java.sql.SQLEx...
TestJoinQuery.testLeftOuterJoinWithEmptySubquery2:521 » Service java.sql.SQLEx...
TestJoinQuery.testRightOuterJoinPredicationCaseByCase1:886->createOuterJoinTestTable:1010 » Service
TestJoinQuery.testRightOuterJoinPredicationCaseByCase2:916->createOuterJoinTestTable:1010 » Service
TestJoinQuery.testRightOuterJoinPredicationCaseByCase3:944->createOuterJoinTestTable:1010 » Service
TestJoinQuery.testLeftOuterJoinPredicationCaseByCase1:652->createOuterJoinTestTable:1010 » Service
TestJoinQuery.testLeftOuterJoinPredicationCaseByCase2:680->createOuterJoinTestTable:1010 » Service
TestJoinQuery.testLeftOuterJoinPredicationCaseByCase3:741->createOuterJoinTestTable:1010 » Service
TestJoinQuery.testLeftOuterJoinPredicationCaseByCase4:771->createOuterJoinTestTable:1010 » Service
TestJoinQuery.testLeftOuterJoinPredicationCaseByCase5:801->createOuterJoinTestTable:1010 » Service
TestJoinQuery.testLeftOuterJoinPredicationCaseByCase6:831->createOuterJoinTestTable:1010 » Service
TestJoinQuery.testLeftOuterWithEmptyTable:860->createOuterJoinTestTable:1010 » Service
TestJoinQuery.testFullOuterJoinPredicationCaseByCase1:971->createOuterJoinTestTable:1010 » Service
TestJoinQuery.testJoinOnMultipleDatabases:564->QueryTestCaseBase.executeString:323 » Service
TestJoinQuery.testJoinOnMultipleDatabasesWithJson:607->QueryTestCaseBase.executeString:323 » Service
TestJoinQuery.testLeftOuterJoinPredicationCaseByCase2_1:709->createOuterJoinTestTable:1010 » Service
TestCaseByCases.testTAJO1224Case1:179->QueryTestCaseBase.executeQuery:333->QueryTestCaseBase.executeFile:424 » Service
TestHBaseTable.testJoin:601->QueryTestCaseBase.executeString:323 » Service HBa...
TestHBaseTable.testInsertIntoLocation:1256->QueryTestCaseBase.executeString:323 » Service
TestHBaseTable.testNonForwardQuery:561->QueryTestCaseBase.executeString:323 » Service
TestHBaseTable.testInsertInto:643->QueryTestCaseBase.executeString:323 » Service
TestHBaseTable.testInsertIntoDifferentType:1068->QueryTestCaseBase.executeString:323 » Service
TestHBaseTable.testInsertIntoMultiRegionWithSplitFile:802->QueryTestCaseBase.executeString:323 » Service
TestHBaseTable.testInsertIntoMultiRegion:685->QueryTestCaseBase.executeString:323 » Service
TestHBaseTable.testInsertIntoMultiRegionMultiRowFields:860->QueryTestCaseBase.executeString:323 » Service
TestHBaseTable.testInsertIntoMultiRegion2:743->QueryTestCaseBase.executeString:323 » Service
TestHBaseTable.testInsertIntoUsingPut:1207->QueryTestCaseBase.executeString:323 » Service
TestHBaseTable.testCreateHBaseTable:112->QueryTestCaseBase.executeString:323 » Service
TestHBaseTable.testInsertIntoRowField:1105->QueryTestCaseBase.executeString:323 » Service
TestCTASQuery.testCtasWithGroupby:149->QueryTestCaseBase.executeQuery:333->QueryTestCaseBase.executeFile:424 » Service
TestCTASQuery.testCtasWithTextFile:231->QueryTestCaseBase.executeQuery:333->QueryTestCaseBase.executeFile:424 » Service
TestCTASQuery.testCtasWithLimit:169->QueryTestCaseBase.executeQuery:333->QueryTestCaseBase.executeFile:424 » Service
TestCTASQuery.testCtasWithUnion:179->QueryTestCaseBase.executeQuery:333->QueryTestCaseBase.executeFile:424 » Service
TestCTASQuery.testCtasWithOptions:245->QueryTestCaseBase.executeQuery:333->QueryTestCaseBase.executeFile:424 » Service
TestCTASQuery.testCtasWithStoreType:217->QueryTestCaseBase.executeQuery:333->QueryTestCaseBase.executeFile:424 » Service
TestCTASQuery.testCtasWithOrderby:159->QueryTestCaseBase.executeQuery:333->QueryTestCaseBase.executeFile:424 » Service
TestCTASQuery.testCtasWithMultipleUnions:189->QueryTestCaseBase.executeQuery:333->QueryTestCaseBase.executeFile:424 » Service
TestTruncateTable.testTruncateTable:64->QueryTestCaseBase.executeString:323 » Service
TestEvalCodeGenerator.testGetField:57->ExprTestBase.testEval:196->ExprTestBase.testEval:284 » AbstractMethod
TestEvalCodeGenerator.testComparison:112->ExprTestBase.testSimpleEval:176->ExprTestBase.testEval:196->ExprTestBase.testEval:284 » AbstractMethod
TestEvalCodeGenerator.testArithmetic:48->ExprTestBase.testEval:196->ExprTestBase.testEval:284 » AbstractMethod
TestEvalCodeGenerator.testAndOr:270->ExprTestBase.testSimpleEval:176->ExprTestBase.testEval:196->ExprTestBase.testEval:284 » AbstractMethod
TestEvalCodeGenerator.testUnary:246->ExprTestBase.testEval:196->ExprTestBase.testEval:284 » AbstractMethod
TestEvalCodeGenerator.testBetweenSymmetric:201->ExprTestBase.testEval:196->ExprTestBase.testEval:284 » AbstractMethod
TestEvalCodeGenerator.testStringConcat:302->ExprTestBase.testSimpleEval:176->ExprTestBase.testEval:196->ExprTestBase.testEval:284 » AbstractMethod
TestEvalCodeGenerator.testBetweenAsymmetric:167->ExprTestBase.testEval:196->ExprTestBase.testEval:284 » AbstractMethod
TestEvalCodeGenerator.testNullHandling:81->ExprTestBase.testEval:196->ExprTestBase.testEval:284 » AbstractMethod
TestEvalCodeGenerator.testFunction:293->ExprTestBase.testEval:196->ExprTestBase.testEval:284 » AbstractMethod
TestTajoClient.testDropCurrentDatabase:163 » Service org.apache.tajo.rpc.TajoS...
TestTajoClient.testGetQueryStatusAndResultAfterFinish:668 » SQL com.google.pro...
TestTajoClient.testGetQueryInfoAndHistory:748 » test timed out after 30000 mi...
TestTajoClient.testNullCharSessionInCTAS:697 » Service java.sql.SQLException: ...
Tests run: 1444, Failures: 655, Errors: 250, Skipped: 0
[INFO] ------------------------------------------------------------------------
[INFO] Reactor Summary:
[INFO]
[INFO] Tajo Main ......................................... SUCCESS [ 1.971 s]
[INFO] Tajo Project POM .................................. SUCCESS [ 1.271 s]
[INFO] Tajo Maven Plugins ................................ SUCCESS [ 3.309 s]
[INFO] Tajo Common ....................................... SUCCESS [ 23.240 s]
[INFO] Tajo Algebra ...................................... SUCCESS [ 1.448 s]
[INFO] Tajo Catalog Common ............................... SUCCESS [ 7.223 s]
[INFO] Tajo Plan ......................................... SUCCESS [ 6.264 s]
[INFO] Tajo Rpc Common ................................... SUCCESS [ 0.420 s]
[INFO] Tajo Protocol Buffer Rpc .......................... SUCCESS [ 34.409 s]
[INFO] Tajo Catalog Client ............................... SUCCESS [ 1.051 s]
[INFO] Tajo Catalog Server ............................... SUCCESS [ 9.593 s]
[INFO] Tajo Storage Common ............................... SUCCESS [ 11.374 s]
[INFO] Tajo HDFS Storage ................................. SUCCESS [ 54.106 s]
[INFO] Tajo HBase Storage ................................ SUCCESS [ 3.195 s]
[INFO] Tajo PullServer ................................... SUCCESS [ 1.091 s]
[INFO] Tajo Client ....................................... SUCCESS [ 3.419 s]
[INFO] Tajo CLI tools .................................... SUCCESS [ 0.741 s]
[INFO] Tajo JDBC Driver .................................. SUCCESS [ 2.900 s]
[INFO] ASM (thirdparty) .................................. SUCCESS [ 0.566 s]
[INFO] Tajo RESTful Container ............................ SUCCESS [ 3.333 s]
[INFO] Tajo Core ......................................... FAILURE [16:04 min]
[INFO] Tajo RPC .......................................... SKIPPED
[INFO] Tajo Catalog Drivers Hive ......................... SKIPPED
[INFO] Tajo Catalog Drivers .............................. SKIPPED
[INFO] Tajo Catalog ...................................... SKIPPED
[INFO] Tajo Storage ...................................... SKIPPED
[INFO] Tajo Distribution ................................. SKIPPED
[INFO] ------------------------------------------------------------------------
[INFO] BUILD FAILURE
[INFO] ------------------------------------------------------------------------
[INFO] Total time: 18:56 min
[INFO] Finished at: 2015-04-17T07:02:18+00:00
[INFO] Final Memory: 92M/870M
[INFO] ------------------------------------------------------------------------
[ERROR] Failed to execute goal org.apache.maven.plugins:maven-surefire-plugin:2.17:test (default-test) on project tajo-core: There are test failures.
[ERROR]
[ERROR] Please refer to <https://builds.apache.org/job/Tajo-master-CODEGEN-build/ws/tajo-core/target/surefire-reports> for the individual test results.
[ERROR] -> [Help 1]
[ERROR]
[ERROR] To see the full stack trace of the errors, re-run Maven with the -e switch.
[ERROR] Re-run Maven using the -X switch to enable full debug logging.
[ERROR]
[ERROR] For more information about the errors and possible solutions, please read the following articles:
[ERROR] [Help 1] http://cwiki.apache.org/confluence/display/MAVEN/MojoFailureException
[ERROR]
[ERROR] After correcting the problems, you can resume the build with the command
[ERROR] mvn <goals> -rf :tajo-core
Build step 'Execute shell' marked build as failure
Updating TAJO-1442
Build failed in Jenkins: Tajo-master-CODEGEN-build #315
Posted by Apache Jenkins Server <je...@builds.apache.org>.
See <https://builds.apache.org/job/Tajo-master-CODEGEN-build/315/changes>
Changes:
[jhkim] TAJO-1560: HashShuffle report should be ignored when a succeed tasks are not included. (jinho)
------------------------------------------
[...truncated 382975 lines...]
TestConditionalExpressions.testCoalesceBoolean:206->ExprTestBase.testSimpleEval:182->ExprTestBase.testEval:202->ExprTestBase.testEval:292 » AbstractMethod
TestMathFunctions.testRoundWithSpecifiedPrecision:452->ExprTestBase.testSimpleEval:182->ExprTestBase.testEval:202->ExprTestBase.testEval:292 » AbstractMethod
TestMathFunctions.testAbs:334->ExprTestBase.testSimpleEval:182->ExprTestBase.testEval:202->ExprTestBase.testEval:292 » AbstractMethod
TestMathFunctions.testCos:134->ExprTestBase.testSimpleEval:182->ExprTestBase.testEval:202->ExprTestBase.testEval:292 » AbstractMethod
TestMathFunctions.testDiv:247->ExprTestBase.testSimpleEval:182->ExprTestBase.testEval:202->ExprTestBase.testEval:292 » AbstractMethod
TestMathFunctions.testExp:313->ExprTestBase.testSimpleEval:182->ExprTestBase.testEval:202->ExprTestBase.testEval:292 » AbstractMethod
TestMathFunctions.testMod:231->ExprTestBase.testSimpleEval:182->ExprTestBase.testEval:202->ExprTestBase.testEval:292 » AbstractMethod
TestMathFunctions.testPow:397->ExprTestBase.testSimpleEval:182->ExprTestBase.testEval:202->ExprTestBase.testEval:292 » AbstractMethod
TestMathFunctions.testSin:117->ExprTestBase.testSimpleEval:182->ExprTestBase.testEval:202->ExprTestBase.testEval:292 » AbstractMethod
TestMathFunctions.testTan:150->ExprTestBase.testSimpleEval:182->ExprTestBase.testEval:202->ExprTestBase.testEval:292 » AbstractMethod
TestMathFunctions.testAtan2:214->ExprTestBase.testSimpleEval:182->ExprTestBase.testEval:202->ExprTestBase.testEval:292 » AbstractMethod
TestMathFunctions.testFloor:61->ExprTestBase.testSimpleEval:182->ExprTestBase.testEval:202->ExprTestBase.testEval:292 » AbstractMethod
TestMathFunctions.testRound:32->ExprTestBase.testSimpleEval:182->ExprTestBase.testEval:202->ExprTestBase.testEval:292 » AbstractMethod
TestMathFunctions.testAcos:182->ExprTestBase.testSimpleEval:182->ExprTestBase.testEval:202->ExprTestBase.testEval:292 » AbstractMethod
TestMathFunctions.testAsin:166->ExprTestBase.testSimpleEval:182->ExprTestBase.testEval:202->ExprTestBase.testEval:292 » AbstractMethod
TestMathFunctions.testAtan:198->ExprTestBase.testSimpleEval:182->ExprTestBase.testEval:202->ExprTestBase.testEval:292 » AbstractMethod
TestMathFunctions.testCbrt:355->ExprTestBase.testSimpleEval:182->ExprTestBase.testEval:202->ExprTestBase.testEval:292 » AbstractMethod
TestMathFunctions.testCeil:79->ExprTestBase.testSimpleEval:182->ExprTestBase.testEval:202->ExprTestBase.testEval:292 » AbstractMethod
TestMathFunctions.testSign:263->ExprTestBase.testSimpleEval:182->ExprTestBase.testEval:202->ExprTestBase.testEval:292 » AbstractMethod
TestMathFunctions.testSqrt:288->ExprTestBase.testSimpleEval:182->ExprTestBase.testEval:202->ExprTestBase.testEval:292 » AbstractMethod
TestMathFunctions.testPi:438->ExprTestBase.testSimpleEval:182->ExprTestBase.testEval:202->ExprTestBase.testEval:292 » AbstractMethod
TestMathFunctions.testCeiling:98->ExprTestBase.testSimpleEval:182->ExprTestBase.testEval:202->ExprTestBase.testEval:292 » AbstractMethod
TestMathFunctions.testRadians:418->ExprTestBase.testSimpleEval:182->ExprTestBase.testEval:202->ExprTestBase.testEval:292 » AbstractMethod
TestMathFunctions.testDegrees:377->ExprTestBase.testSimpleEval:182->ExprTestBase.testEval:202->ExprTestBase.testEval:292 » AbstractMethod
TestJsonFunctions.testJsonExtractPathText:32->ExprTestBase.testSimpleEval:182->ExprTestBase.testEval:202->ExprTestBase.testEval:292 » AbstractMethod
TestDateTimeFunctions.testDatePart:242->ExprTestBase.testEval:202->ExprTestBase.testEval:290 » Compilation
TestDateTimeFunctions.testExtract:125->ExprTestBase.testEval:202->ExprTestBase.testEval:290 » Compilation
TestDateTimeFunctions.testAddDays:398->ExprTestBase.testSimpleEval:182->ExprTestBase.testEval:202->ExprTestBase.testEval:292 » AbstractMethod
TestDateTimeFunctions.testToTimestamp:48->ExprTestBase.testSimpleEval:182->ExprTestBase.testEval:202->ExprTestBase.testEval:292 » AbstractMethod
TestDateTimeFunctions.testDateTimeNow:438->ExprTestBase.testSimpleEval:186->ExprTestBase.testEval:209->ExprTestBase.testEval:292 » AbstractMethod
TestDateTimeFunctions.testUtcUsecTo:349->ExprTestBase.testSimpleEval:182->ExprTestBase.testEval:202->ExprTestBase.testEval:292 » AbstractMethod
TestDateTimeFunctions.testTimeValueKeyword:467->ExprTestBase.testSimpleEval:186->ExprTestBase.testEval:209->ExprTestBase.testEval:292 » AbstractMethod
TestDateTimeFunctions.testAddMonths:367->ExprTestBase.testSimpleEval:182->ExprTestBase.testEval:202->ExprTestBase.testEval:292 » AbstractMethod
TestDateTimeFunctions.testToChar:109->ExprTestBase.testSimpleEval:182->ExprTestBase.testEval:202->ExprTestBase.testEval:292 » AbstractMethod
TestDateTimeFunctions.testToDate:358->ExprTestBase.testSimpleEval:182->ExprTestBase.testEval:202->ExprTestBase.testEval:292 » AbstractMethod
TestStringOperatorsAndFunctions.testRegexReplace:127->ExprTestBase.testSimpleEval:182->ExprTestBase.testEval:202->ExprTestBase.testEval:292 » AbstractMethod
TestStringOperatorsAndFunctions.testOctetLength:343->ExprTestBase.testSimpleEval:182->ExprTestBase.testEval:202->ExprTestBase.testEval:292 » AbstractMethod
TestStringOperatorsAndFunctions.testBin:329->ExprTestBase.testSimpleEval:182->ExprTestBase.testEval:202->ExprTestBase.testEval:292 » AbstractMethod
TestStringOperatorsAndFunctions.testChr:514->ExprTestBase.testSimpleEval:182->ExprTestBase.testEval:202->ExprTestBase.testEval:292 » AbstractMethod
TestStringOperatorsAndFunctions.testHex:314->ExprTestBase.testSimpleEval:182->ExprTestBase.testEval:202->ExprTestBase.testEval:292 » AbstractMethod
TestStringOperatorsAndFunctions.testMd5:287->ExprTestBase.testSimpleEval:182->ExprTestBase.testEval:202->ExprTestBase.testEval:292 » AbstractMethod
TestStringOperatorsAndFunctions.testAscii:501->ExprTestBase.testSimpleEval:182->ExprTestBase.testEval:202->ExprTestBase.testEval:292 » AbstractMethod
TestStringOperatorsAndFunctions.testLTrim:68->ExprTestBase.testSimpleEval:182->ExprTestBase.testEval:202->ExprTestBase.testEval:292 » AbstractMethod
TestStringOperatorsAndFunctions.testLower:250->ExprTestBase.testSimpleEval:182->ExprTestBase.testEval:202->ExprTestBase.testEval:292 » AbstractMethod
TestStringOperatorsAndFunctions.testRTrim:89->ExprTestBase.testSimpleEval:182->ExprTestBase.testEval:202->ExprTestBase.testEval:292 » AbstractMethod
TestStringOperatorsAndFunctions.testRight:181->ExprTestBase.testSimpleEval:182->ExprTestBase.testEval:202->ExprTestBase.testEval:292 » AbstractMethod
TestStringOperatorsAndFunctions.testUpper:237->ExprTestBase.testSimpleEval:182->ExprTestBase.testEval:202->ExprTestBase.testEval:292 » AbstractMethod
TestStringOperatorsAndFunctions.testLeft:152->ExprTestBase.testSimpleEval:182->ExprTestBase.testEval:202->ExprTestBase.testEval:292 » AbstractMethod
TestStringOperatorsAndFunctions.testLpad:528->ExprTestBase.testSimpleEval:182->ExprTestBase.testEval:202->ExprTestBase.testEval:292 » AbstractMethod
TestStringOperatorsAndFunctions.testRpad:538->ExprTestBase.testSimpleEval:182->ExprTestBase.testEval:202->ExprTestBase.testEval:292 » AbstractMethod
TestStringOperatorsAndFunctions.testTrim:110->ExprTestBase.testSimpleEval:182->ExprTestBase.testEval:202->ExprTestBase.testEval:292 » AbstractMethod
TestStringOperatorsAndFunctions.testConcat_ws:610->ExprTestBase.testSimpleEval:182->ExprTestBase.testEval:202->ExprTestBase.testEval:292 » AbstractMethod
TestStringOperatorsAndFunctions.testCharLength:263->ExprTestBase.testSimpleEval:182->ExprTestBase.testEval:202->ExprTestBase.testEval:292 » AbstractMethod
TestStringOperatorsAndFunctions.testBitLength:451->ExprTestBase.testSimpleEval:182->ExprTestBase.testEval:202->ExprTestBase.testEval:292 » AbstractMethod
TestStringOperatorsAndFunctions.testConcatenateOnExpressions:48->ExprTestBase.testSimpleEval:182->ExprTestBase.testEval:202->ExprTestBase.testEval:292 » AbstractMethod
TestStringOperatorsAndFunctions.testFunctionCallIngoreCases:56->ExprTestBase.testSimpleEval:182->ExprTestBase.testEval:202->ExprTestBase.testEval:292 » AbstractMethod
TestStringOperatorsAndFunctions.testQuote_ident:548->ExprTestBase.testSimpleEval:182->ExprTestBase.testEval:202->ExprTestBase.testEval:292 » AbstractMethod
TestStringOperatorsAndFunctions.testReverse:210->ExprTestBase.testSimpleEval:182->ExprTestBase.testEval:202->ExprTestBase.testEval:292 » AbstractMethod
TestStringOperatorsAndFunctions.testSplitPart:357->ExprTestBase.testSimpleEval:182->ExprTestBase.testEval:202->ExprTestBase.testEval:292 » AbstractMethod
TestStringOperatorsAndFunctions.testFindInSet:579->ExprTestBase.testSimpleEval:182->ExprTestBase.testEval:202->ExprTestBase.testEval:292 » AbstractMethod
TestStringOperatorsAndFunctions.testConcat:601->ExprTestBase.testSimpleEval:182->ExprTestBase.testEval:202->ExprTestBase.testEval:292 » AbstractMethod
TestStringOperatorsAndFunctions.testDecode:566->ExprTestBase.testSimpleEval:182->ExprTestBase.testEval:202->ExprTestBase.testEval:292 » AbstractMethod
TestStringOperatorsAndFunctions.testDigest:300->ExprTestBase.testSimpleEval:182->ExprTestBase.testEval:202->ExprTestBase.testEval:292 » AbstractMethod
TestStringOperatorsAndFunctions.testEncode:554->ExprTestBase.testSimpleEval:182->ExprTestBase.testEval:202->ExprTestBase.testEval:292 » AbstractMethod
TestStringOperatorsAndFunctions.testLength:275->ExprTestBase.testSimpleEval:182->ExprTestBase.testEval:202->ExprTestBase.testEval:292 » AbstractMethod
TestStringOperatorsAndFunctions.testLocate:403->ExprTestBase.testSimpleEval:182->ExprTestBase.testEval:202->ExprTestBase.testEval:292 » AbstractMethod
TestStringOperatorsAndFunctions.testInitcap:495->ExprTestBase.testSimpleEval:182->ExprTestBase.testEval:202->ExprTestBase.testEval:292 » AbstractMethod
TestStringOperatorsAndFunctions.testRepeat:223->ExprTestBase.testSimpleEval:182->ExprTestBase.testEval:202->ExprTestBase.testEval:292 » AbstractMethod
TestStringOperatorsAndFunctions.testStrpos:463->ExprTestBase.testSimpleEval:182->ExprTestBase.testEval:202->ExprTestBase.testEval:292 » AbstractMethod
TestStringOperatorsAndFunctions.testSubstr:376->ExprTestBase.testSimpleEval:182->ExprTestBase.testEval:202->ExprTestBase.testEval:292 » AbstractMethod
TestStringOperatorsAndFunctions.testConcatenateOnLiteral:35->ExprTestBase.testSimpleEval:182->ExprTestBase.testEval:202->ExprTestBase.testEval:292 » AbstractMethod
TestStringOperatorsAndFunctions.testStrposb:479->ExprTestBase.testSimpleEval:182->ExprTestBase.testEval:202->ExprTestBase.testEval:292 » AbstractMethod
TestJoinBroadcast.testMultiplePartitionedBroadcastDataFileWithZeroLength:770 » Service
TestInsertQuery.testInsertOverwriteWithUnion:727->QueryTestCaseBase.executeFile:424 » Service
TestInsertQuery.testInsertOverwriteWithUnionDifferentAlias:755->QueryTestCaseBase.executeFile:424 » Service
TestInsertQuery.testInsertOverwriteWithDatabase:615->QueryTestCaseBase.executeFile:424 » Service
TestInsertQuery.testInsertInto:69->QueryTestCaseBase.executeFile:424 » Service
TestInsertQuery.testInsertOverwriteSmallerColumns:304->QueryTestCaseBase.executeFile:424 » Service
TestInsertQuery.testInsertOverwrite:49->QueryTestCaseBase.executeFile:424 » Service
TestInsertQuery.testInsertOverwriteIntoParquet:546->QueryTestCaseBase.executeString:323 » Service
TestSelectQuery.testDatabaseRef:406->QueryTestCaseBase.executeFile:424 » Service
TestGroupByQuery.testGroupByWithNullData6:627->QueryTestCaseBase.executeString:323 » Service
TestGroupByQuery.testGroupByWithNullData7:639->QueryTestCaseBase.executeString:323 » Service
TestGroupByQuery.testGroupByWithNullData8:651->QueryTestCaseBase.executeString:323 » Service
TestGroupByQuery.testGroupByWithNullData9:663->QueryTestCaseBase.executeString:323 » Service
TestGroupByQuery.testDistinctAggregationCasebyCase11:435 » Service java.sql.SQ...
TestGroupByQuery.testGroupByWithNullData5:615->QueryTestCaseBase.executeString:323 » Service
TestGroupByQuery.testGroupByWithNullData6:627->QueryTestCaseBase.executeString:323 » Service
TestGroupByQuery.testGroupByWithNullData7:639->QueryTestCaseBase.executeString:323 » Service
TestGroupByQuery.testGroupByWithNullData8:651->QueryTestCaseBase.executeString:323 » Service
TestGroupByQuery.testGroupByWithNullData9:663->QueryTestCaseBase.executeString:323 » Service
TestGroupByQuery.testDistinctAggregationCaseByCase3:497 » Service java.sql.SQL...
TestGroupByQuery.testDistinctAggregationCaseByCase4:526 » Service java.sql.SQL...
TestGroupByQuery.testNumShufflePartition:724 » Service java.sql.SQLException: ...
TestGroupByQuery.testDistinctAggregationCasebyCase11:435 » Service java.sql.SQ...
TestJoinQuery.testLeftOuterJoinWithEmptySubquery1:479 » Service java.sql.SQLEx...
TestJoinQuery.testLeftOuterJoinWithEmptySubquery2:521 » Service java.sql.SQLEx...
TestJoinQuery.testRightOuterJoinPredicationCaseByCase1:886->createOuterJoinTestTable:1010 » Service
TestJoinQuery.testRightOuterJoinPredicationCaseByCase2:916->createOuterJoinTestTable:1010 » Service
TestJoinQuery.testRightOuterJoinPredicationCaseByCase3:944->createOuterJoinTestTable:1010 » Service
TestJoinQuery.testLeftOuterJoinPredicationCaseByCase1:652->createOuterJoinTestTable:1010 » Service
TestJoinQuery.testLeftOuterJoinPredicationCaseByCase2:680->createOuterJoinTestTable:1010 » Service
TestJoinQuery.testLeftOuterJoinPredicationCaseByCase3:741->createOuterJoinTestTable:1010 » Service
TestJoinQuery.testLeftOuterJoinPredicationCaseByCase4:771->createOuterJoinTestTable:1010 » Service
TestJoinQuery.testLeftOuterJoinPredicationCaseByCase5:801->createOuterJoinTestTable:1010 » Service
TestJoinQuery.testLeftOuterJoinPredicationCaseByCase6:831->createOuterJoinTestTable:1010 » Service
TestJoinQuery.testLeftOuterWithEmptyTable:860->createOuterJoinTestTable:1010 » Service
TestJoinQuery.testFullOuterJoinPredicationCaseByCase1:971->createOuterJoinTestTable:1010 » Service
TestJoinQuery.testJoinOnMultipleDatabases:564->QueryTestCaseBase.executeString:323 » Service
TestJoinQuery.testJoinOnMultipleDatabasesWithJson:607->QueryTestCaseBase.executeString:323 » Service
TestJoinQuery.testLeftOuterJoinPredicationCaseByCase2_1:709->createOuterJoinTestTable:1010 » Service
TestJoinQuery.testLeftOuterJoinWithEmptySubquery1:479 » Service java.sql.SQLEx...
TestJoinQuery.testLeftOuterJoinWithEmptySubquery2:521 » Service java.sql.SQLEx...
TestJoinQuery.testRightOuterJoinPredicationCaseByCase1:886->createOuterJoinTestTable:1010 » Service
TestJoinQuery.testRightOuterJoinPredicationCaseByCase2:916->createOuterJoinTestTable:1010 » Service
TestJoinQuery.testRightOuterJoinPredicationCaseByCase3:944->createOuterJoinTestTable:1010 » Service
TestJoinQuery.testLeftOuterJoinPredicationCaseByCase1:652->createOuterJoinTestTable:1010 » Service
TestJoinQuery.testLeftOuterJoinPredicationCaseByCase2:680->createOuterJoinTestTable:1010 » Service
TestJoinQuery.testLeftOuterJoinPredicationCaseByCase3:741->createOuterJoinTestTable:1010 » Service
TestJoinQuery.testLeftOuterJoinPredicationCaseByCase4:771->createOuterJoinTestTable:1010 » Service
TestJoinQuery.testLeftOuterJoinPredicationCaseByCase5:801->createOuterJoinTestTable:1010 » Service
TestJoinQuery.testLeftOuterJoinPredicationCaseByCase6:831->createOuterJoinTestTable:1010 » Service
TestJoinQuery.testLeftOuterWithEmptyTable:860->createOuterJoinTestTable:1010 » Service
TestJoinQuery.testFullOuterJoinPredicationCaseByCase1:971->createOuterJoinTestTable:1010 » Service
TestJoinQuery.testJoinOnMultipleDatabases:564->QueryTestCaseBase.executeString:323 » Service
TestJoinQuery.testJoinOnMultipleDatabasesWithJson:607->QueryTestCaseBase.executeString:323 » Service
TestJoinQuery.testLeftOuterJoinPredicationCaseByCase2_1:709->createOuterJoinTestTable:1010 » Service
TestJoinQuery.testLeftOuterJoinWithEmptySubquery1:479 » Service java.sql.SQLEx...
TestJoinQuery.testLeftOuterJoinWithEmptySubquery2:521 » Service java.sql.SQLEx...
TestJoinQuery.testRightOuterJoinPredicationCaseByCase1:886->createOuterJoinTestTable:1010 » Service
TestJoinQuery.testRightOuterJoinPredicationCaseByCase2:916->createOuterJoinTestTable:1010 » Service
TestJoinQuery.testRightOuterJoinPredicationCaseByCase3:944->createOuterJoinTestTable:1010 » Service
TestJoinQuery.testLeftOuterJoinPredicationCaseByCase1:652->createOuterJoinTestTable:1010 » Service
TestJoinQuery.testLeftOuterJoinPredicationCaseByCase2:680->createOuterJoinTestTable:1010 » Service
TestJoinQuery.testLeftOuterJoinPredicationCaseByCase3:741->createOuterJoinTestTable:1010 » Service
TestJoinQuery.testLeftOuterJoinPredicationCaseByCase4:771->createOuterJoinTestTable:1010 » Service
TestJoinQuery.testLeftOuterJoinPredicationCaseByCase5:801->createOuterJoinTestTable:1010 » Service
TestJoinQuery.testLeftOuterJoinPredicationCaseByCase6:831->createOuterJoinTestTable:1010 » Service
TestJoinQuery.testLeftOuterWithEmptyTable:860->createOuterJoinTestTable:1010 » Service
TestJoinQuery.testFullOuterJoinPredicationCaseByCase1:971->createOuterJoinTestTable:1010 » Service
TestJoinQuery.testJoinOnMultipleDatabases:564->QueryTestCaseBase.executeString:323 » Service
TestJoinQuery.testJoinOnMultipleDatabasesWithJson:607->QueryTestCaseBase.executeString:323 » Service
TestJoinQuery.testLeftOuterJoinPredicationCaseByCase2_1:709->createOuterJoinTestTable:1010 » Service
TestJoinQuery.testLeftOuterJoinWithEmptySubquery1:479 » Service java.sql.SQLEx...
TestJoinQuery.testLeftOuterJoinWithEmptySubquery2:521 » Service java.sql.SQLEx...
TestJoinQuery.testRightOuterJoinPredicationCaseByCase1:886->createOuterJoinTestTable:1010 » Service
TestJoinQuery.testRightOuterJoinPredicationCaseByCase2:916->createOuterJoinTestTable:1010 » Service
TestJoinQuery.testRightOuterJoinPredicationCaseByCase3:944->createOuterJoinTestTable:1010 » Service
TestJoinQuery.testLeftOuterJoinPredicationCaseByCase1:652->createOuterJoinTestTable:1010 » Service
TestJoinQuery.testLeftOuterJoinPredicationCaseByCase2:680->createOuterJoinTestTable:1010 » Service
TestJoinQuery.testLeftOuterJoinPredicationCaseByCase3:741->createOuterJoinTestTable:1010 » Service
TestJoinQuery.testLeftOuterJoinPredicationCaseByCase4:771->createOuterJoinTestTable:1010 » Service
TestJoinQuery.testLeftOuterJoinPredicationCaseByCase5:801->createOuterJoinTestTable:1010 » Service
TestJoinQuery.testLeftOuterJoinPredicationCaseByCase6:831->createOuterJoinTestTable:1010 » Service
TestJoinQuery.testLeftOuterWithEmptyTable:860->createOuterJoinTestTable:1010 » Service
TestJoinQuery.testFullOuterJoinPredicationCaseByCase1:971->createOuterJoinTestTable:1010 » Service
TestJoinQuery.testJoinOnMultipleDatabases:564->QueryTestCaseBase.executeString:323 » Service
TestJoinQuery.testJoinOnMultipleDatabasesWithJson:607->QueryTestCaseBase.executeString:323 » Service
TestJoinQuery.testLeftOuterJoinPredicationCaseByCase2_1:709->createOuterJoinTestTable:1010 » Service
TestCaseByCases.testTAJO1224Case1:179->QueryTestCaseBase.executeQuery:333->QueryTestCaseBase.executeFile:424 » Service
TestHBaseTable.testJoin:601->QueryTestCaseBase.executeString:323 » Service HBa...
TestHBaseTable.testInsertIntoLocation:1256->QueryTestCaseBase.executeString:323 » Service
TestHBaseTable.testNonForwardQuery:561->QueryTestCaseBase.executeString:323 » Service
TestHBaseTable.testInsertInto:643->QueryTestCaseBase.executeString:323 » Service
TestHBaseTable.testInsertIntoDifferentType:1068->QueryTestCaseBase.executeString:323 » Service
TestHBaseTable.testInsertIntoMultiRegionWithSplitFile:802->QueryTestCaseBase.executeString:323 » Service
TestHBaseTable.testInsertIntoMultiRegion:685->QueryTestCaseBase.executeString:323 » Service
TestHBaseTable.testInsertIntoMultiRegionMultiRowFields:860->QueryTestCaseBase.executeString:323 » Service
TestHBaseTable.testInsertIntoMultiRegion2:743->QueryTestCaseBase.executeString:323 » Service
TestHBaseTable.testInsertIntoUsingPut:1207->QueryTestCaseBase.executeString:323 » Service
TestHBaseTable.testCreateHBaseTable:112->QueryTestCaseBase.executeString:323 » Service
TestHBaseTable.testInsertIntoRowField:1105->QueryTestCaseBase.executeString:323 » Service
TestCTASQuery.testCtasWithGroupby:149->QueryTestCaseBase.executeQuery:333->QueryTestCaseBase.executeFile:424 » Service
TestCTASQuery.testCtasWithTextFile:231->QueryTestCaseBase.executeQuery:333->QueryTestCaseBase.executeFile:424 » Service
TestCTASQuery.testCtasWithLimit:169->QueryTestCaseBase.executeQuery:333->QueryTestCaseBase.executeFile:424 » Service
TestCTASQuery.testCtasWithUnion:179->QueryTestCaseBase.executeQuery:333->QueryTestCaseBase.executeFile:424 » Service
TestCTASQuery.testCtasWithOptions:245->QueryTestCaseBase.executeQuery:333->QueryTestCaseBase.executeFile:424 » Service
TestCTASQuery.testCtasWithStoreType:217->QueryTestCaseBase.executeQuery:333->QueryTestCaseBase.executeFile:424 » Service
TestCTASQuery.testCtasWithOrderby:159->QueryTestCaseBase.executeQuery:333->QueryTestCaseBase.executeFile:424 » Service
TestCTASQuery.testCtasWithMultipleUnions:189->QueryTestCaseBase.executeQuery:333->QueryTestCaseBase.executeFile:424 » Service
TestTruncateTable.testTruncateTable:64->QueryTestCaseBase.executeString:323 » Service
TestEvalCodeGenerator.testGetField:57->ExprTestBase.testEval:202->ExprTestBase.testEval:292 » AbstractMethod
TestEvalCodeGenerator.testComparison:112->ExprTestBase.testSimpleEval:182->ExprTestBase.testEval:202->ExprTestBase.testEval:292 » AbstractMethod
TestEvalCodeGenerator.testArithmetic:48->ExprTestBase.testEval:202->ExprTestBase.testEval:292 » AbstractMethod
TestEvalCodeGenerator.testAndOr:270->ExprTestBase.testSimpleEval:182->ExprTestBase.testEval:202->ExprTestBase.testEval:292 » AbstractMethod
TestEvalCodeGenerator.testUnary:246->ExprTestBase.testEval:202->ExprTestBase.testEval:292 » AbstractMethod
TestEvalCodeGenerator.testBetweenSymmetric:201->ExprTestBase.testEval:202->ExprTestBase.testEval:292 » AbstractMethod
TestEvalCodeGenerator.testStringConcat:302->ExprTestBase.testSimpleEval:182->ExprTestBase.testEval:202->ExprTestBase.testEval:292 » AbstractMethod
TestEvalCodeGenerator.testBetweenAsymmetric:167->ExprTestBase.testEval:202->ExprTestBase.testEval:292 » AbstractMethod
TestEvalCodeGenerator.testNullHandling:81->ExprTestBase.testEval:202->ExprTestBase.testEval:292 » AbstractMethod
TestEvalCodeGenerator.testFunction:293->ExprTestBase.testEval:202->ExprTestBase.testEval:292 » AbstractMethod
TestTajoClient.testGetQueryStatusAndResultAfterFinish:668 » SQL com.google.pro...
TestTajoClient.testGetQueryInfoAndHistory:748 » test timed out after 30000 mi...
TestTajoClient.testNullCharSessionInCTAS:697 » Service java.sql.SQLException: ...
Tests run: 1457, Failures: 667, Errors: 251, Skipped: 0
[INFO] ------------------------------------------------------------------------
[INFO] Reactor Summary:
[INFO]
[INFO] Tajo Main ......................................... SUCCESS [ 1.575 s]
[INFO] Tajo Project POM .................................. SUCCESS [ 1.145 s]
[INFO] Tajo Maven Plugins ................................ SUCCESS [ 2.995 s]
[INFO] Tajo Common ....................................... SUCCESS [ 22.852 s]
[INFO] Tajo Algebra ...................................... SUCCESS [ 1.332 s]
[INFO] Tajo Catalog Common ............................... SUCCESS [ 6.958 s]
[INFO] Tajo Plan ......................................... SUCCESS [ 5.957 s]
[INFO] Tajo Rpc Common ................................... SUCCESS [ 0.413 s]
[INFO] Tajo Protocol Buffer Rpc .......................... SUCCESS [ 37.220 s]
[INFO] Tajo Catalog Client ............................... SUCCESS [ 1.026 s]
[INFO] Tajo Catalog Server ............................... SUCCESS [ 9.975 s]
[INFO] Tajo Storage Common ............................... SUCCESS [ 10.880 s]
[INFO] Tajo HDFS Storage ................................. SUCCESS [ 53.964 s]
[INFO] Tajo HBase Storage ................................ SUCCESS [ 3.034 s]
[INFO] Tajo PullServer ................................... SUCCESS [ 0.926 s]
[INFO] Tajo Client ....................................... SUCCESS [ 3.071 s]
[INFO] Tajo CLI tools .................................... SUCCESS [ 0.680 s]
[INFO] Tajo JDBC Driver .................................. SUCCESS [ 2.938 s]
[INFO] ASM (thirdparty) .................................. SUCCESS [ 0.560 s]
[INFO] Tajo RESTful Container ............................ SUCCESS [ 3.306 s]
[INFO] Tajo Core ......................................... FAILURE [15:36 min]
[INFO] Tajo RPC .......................................... SKIPPED
[INFO] Tajo Catalog Drivers Hive ......................... SKIPPED
[INFO] Tajo Catalog Drivers .............................. SKIPPED
[INFO] Tajo Catalog ...................................... SKIPPED
[INFO] Tajo Storage ...................................... SKIPPED
[INFO] Tajo Distribution ................................. SKIPPED
[INFO] ------------------------------------------------------------------------
[INFO] BUILD FAILURE
[INFO] ------------------------------------------------------------------------
[INFO] Total time: 18:27 min
[INFO] Finished at: 2015-04-19T10:06:45+00:00
[INFO] Final Memory: 96M/1012M
[INFO] ------------------------------------------------------------------------
[ERROR] Failed to execute goal org.apache.maven.plugins:maven-surefire-plugin:2.17:test (default-test) on project tajo-core: There are test failures.
[ERROR]
[ERROR] Please refer to <https://builds.apache.org/job/Tajo-master-CODEGEN-build/ws/tajo-core/target/surefire-reports> for the individual test results.
[ERROR] -> [Help 1]
[ERROR]
[ERROR] To see the full stack trace of the errors, re-run Maven with the -e switch.
[ERROR] Re-run Maven using the -X switch to enable full debug logging.
[ERROR]
[ERROR] For more information about the errors and possible solutions, please read the following articles:
[ERROR] [Help 1] http://cwiki.apache.org/confluence/display/MAVEN/MojoFailureException
[ERROR]
[ERROR] After correcting the problems, you can resume the build with the command
[ERROR] mvn <goals> -rf :tajo-core
Build step 'Execute shell' marked build as failure
Updating TAJO-1560
Build failed in Jenkins: Tajo-master-CODEGEN-build #314
Posted by Apache Jenkins Server <je...@builds.apache.org>.
See <https://builds.apache.org/job/Tajo-master-CODEGEN-build/314/changes>
Changes:
[jhkim] TAJO-1567: Update old license in some pom.xml files.
------------------------------------------
[...truncated 387218 lines...]
TestConditionalExpressions.testCoalesceBoolean:206->ExprTestBase.testSimpleEval:182->ExprTestBase.testEval:202->ExprTestBase.testEval:292 » AbstractMethod
TestMathFunctions.testRoundWithSpecifiedPrecision:452->ExprTestBase.testSimpleEval:182->ExprTestBase.testEval:202->ExprTestBase.testEval:292 » AbstractMethod
TestMathFunctions.testAbs:334->ExprTestBase.testSimpleEval:182->ExprTestBase.testEval:202->ExprTestBase.testEval:292 » AbstractMethod
TestMathFunctions.testCos:134->ExprTestBase.testSimpleEval:182->ExprTestBase.testEval:202->ExprTestBase.testEval:292 » AbstractMethod
TestMathFunctions.testDiv:247->ExprTestBase.testSimpleEval:182->ExprTestBase.testEval:202->ExprTestBase.testEval:292 » AbstractMethod
TestMathFunctions.testExp:313->ExprTestBase.testSimpleEval:182->ExprTestBase.testEval:202->ExprTestBase.testEval:292 » AbstractMethod
TestMathFunctions.testMod:231->ExprTestBase.testSimpleEval:182->ExprTestBase.testEval:202->ExprTestBase.testEval:292 » AbstractMethod
TestMathFunctions.testPow:397->ExprTestBase.testSimpleEval:182->ExprTestBase.testEval:202->ExprTestBase.testEval:292 » AbstractMethod
TestMathFunctions.testSin:117->ExprTestBase.testSimpleEval:182->ExprTestBase.testEval:202->ExprTestBase.testEval:292 » AbstractMethod
TestMathFunctions.testTan:150->ExprTestBase.testSimpleEval:182->ExprTestBase.testEval:202->ExprTestBase.testEval:292 » AbstractMethod
TestMathFunctions.testAtan2:214->ExprTestBase.testSimpleEval:182->ExprTestBase.testEval:202->ExprTestBase.testEval:292 » AbstractMethod
TestMathFunctions.testFloor:61->ExprTestBase.testSimpleEval:182->ExprTestBase.testEval:202->ExprTestBase.testEval:292 » AbstractMethod
TestMathFunctions.testRound:32->ExprTestBase.testSimpleEval:182->ExprTestBase.testEval:202->ExprTestBase.testEval:292 » AbstractMethod
TestMathFunctions.testAcos:182->ExprTestBase.testSimpleEval:182->ExprTestBase.testEval:202->ExprTestBase.testEval:292 » AbstractMethod
TestMathFunctions.testAsin:166->ExprTestBase.testSimpleEval:182->ExprTestBase.testEval:202->ExprTestBase.testEval:292 » AbstractMethod
TestMathFunctions.testAtan:198->ExprTestBase.testSimpleEval:182->ExprTestBase.testEval:202->ExprTestBase.testEval:292 » AbstractMethod
TestMathFunctions.testCbrt:355->ExprTestBase.testSimpleEval:182->ExprTestBase.testEval:202->ExprTestBase.testEval:292 » AbstractMethod
TestMathFunctions.testCeil:79->ExprTestBase.testSimpleEval:182->ExprTestBase.testEval:202->ExprTestBase.testEval:292 » AbstractMethod
TestMathFunctions.testSign:263->ExprTestBase.testSimpleEval:182->ExprTestBase.testEval:202->ExprTestBase.testEval:292 » AbstractMethod
TestMathFunctions.testSqrt:288->ExprTestBase.testSimpleEval:182->ExprTestBase.testEval:202->ExprTestBase.testEval:292 » AbstractMethod
TestMathFunctions.testPi:438->ExprTestBase.testSimpleEval:182->ExprTestBase.testEval:202->ExprTestBase.testEval:292 » AbstractMethod
TestMathFunctions.testCeiling:98->ExprTestBase.testSimpleEval:182->ExprTestBase.testEval:202->ExprTestBase.testEval:292 » AbstractMethod
TestMathFunctions.testRadians:418->ExprTestBase.testSimpleEval:182->ExprTestBase.testEval:202->ExprTestBase.testEval:292 » AbstractMethod
TestMathFunctions.testDegrees:377->ExprTestBase.testSimpleEval:182->ExprTestBase.testEval:202->ExprTestBase.testEval:292 » AbstractMethod
TestJsonFunctions.testJsonExtractPathText:32->ExprTestBase.testSimpleEval:182->ExprTestBase.testEval:202->ExprTestBase.testEval:292 » AbstractMethod
TestDateTimeFunctions.testDatePart:242->ExprTestBase.testEval:202->ExprTestBase.testEval:290 » Compilation
TestDateTimeFunctions.testExtract:125->ExprTestBase.testEval:202->ExprTestBase.testEval:290 » Compilation
TestDateTimeFunctions.testAddDays:398->ExprTestBase.testSimpleEval:182->ExprTestBase.testEval:202->ExprTestBase.testEval:292 » AbstractMethod
TestDateTimeFunctions.testToTimestamp:48->ExprTestBase.testSimpleEval:182->ExprTestBase.testEval:202->ExprTestBase.testEval:292 » AbstractMethod
TestDateTimeFunctions.testDateTimeNow:438->ExprTestBase.testSimpleEval:186->ExprTestBase.testEval:209->ExprTestBase.testEval:292 » AbstractMethod
TestDateTimeFunctions.testUtcUsecTo:349->ExprTestBase.testSimpleEval:182->ExprTestBase.testEval:202->ExprTestBase.testEval:292 » AbstractMethod
TestDateTimeFunctions.testTimeValueKeyword:467->ExprTestBase.testSimpleEval:186->ExprTestBase.testEval:209->ExprTestBase.testEval:292 » AbstractMethod
TestDateTimeFunctions.testAddMonths:367->ExprTestBase.testSimpleEval:182->ExprTestBase.testEval:202->ExprTestBase.testEval:292 » AbstractMethod
TestDateTimeFunctions.testToChar:109->ExprTestBase.testSimpleEval:182->ExprTestBase.testEval:202->ExprTestBase.testEval:292 » AbstractMethod
TestDateTimeFunctions.testToDate:358->ExprTestBase.testSimpleEval:182->ExprTestBase.testEval:202->ExprTestBase.testEval:292 » AbstractMethod
TestStringOperatorsAndFunctions.testRegexReplace:127->ExprTestBase.testSimpleEval:182->ExprTestBase.testEval:202->ExprTestBase.testEval:292 » AbstractMethod
TestStringOperatorsAndFunctions.testOctetLength:343->ExprTestBase.testSimpleEval:182->ExprTestBase.testEval:202->ExprTestBase.testEval:292 » AbstractMethod
TestStringOperatorsAndFunctions.testBin:329->ExprTestBase.testSimpleEval:182->ExprTestBase.testEval:202->ExprTestBase.testEval:292 » AbstractMethod
TestStringOperatorsAndFunctions.testChr:514->ExprTestBase.testSimpleEval:182->ExprTestBase.testEval:202->ExprTestBase.testEval:292 » AbstractMethod
TestStringOperatorsAndFunctions.testHex:314->ExprTestBase.testSimpleEval:182->ExprTestBase.testEval:202->ExprTestBase.testEval:292 » AbstractMethod
TestStringOperatorsAndFunctions.testMd5:287->ExprTestBase.testSimpleEval:182->ExprTestBase.testEval:202->ExprTestBase.testEval:292 » AbstractMethod
TestStringOperatorsAndFunctions.testAscii:501->ExprTestBase.testSimpleEval:182->ExprTestBase.testEval:202->ExprTestBase.testEval:292 » AbstractMethod
TestStringOperatorsAndFunctions.testLTrim:68->ExprTestBase.testSimpleEval:182->ExprTestBase.testEval:202->ExprTestBase.testEval:292 » AbstractMethod
TestStringOperatorsAndFunctions.testLower:250->ExprTestBase.testSimpleEval:182->ExprTestBase.testEval:202->ExprTestBase.testEval:292 » AbstractMethod
TestStringOperatorsAndFunctions.testRTrim:89->ExprTestBase.testSimpleEval:182->ExprTestBase.testEval:202->ExprTestBase.testEval:292 » AbstractMethod
TestStringOperatorsAndFunctions.testRight:181->ExprTestBase.testSimpleEval:182->ExprTestBase.testEval:202->ExprTestBase.testEval:292 » AbstractMethod
TestStringOperatorsAndFunctions.testUpper:237->ExprTestBase.testSimpleEval:182->ExprTestBase.testEval:202->ExprTestBase.testEval:292 » AbstractMethod
TestStringOperatorsAndFunctions.testLeft:152->ExprTestBase.testSimpleEval:182->ExprTestBase.testEval:202->ExprTestBase.testEval:292 » AbstractMethod
TestStringOperatorsAndFunctions.testLpad:528->ExprTestBase.testSimpleEval:182->ExprTestBase.testEval:202->ExprTestBase.testEval:292 » AbstractMethod
TestStringOperatorsAndFunctions.testRpad:538->ExprTestBase.testSimpleEval:182->ExprTestBase.testEval:202->ExprTestBase.testEval:292 » AbstractMethod
TestStringOperatorsAndFunctions.testTrim:110->ExprTestBase.testSimpleEval:182->ExprTestBase.testEval:202->ExprTestBase.testEval:292 » AbstractMethod
TestStringOperatorsAndFunctions.testConcat_ws:610->ExprTestBase.testSimpleEval:182->ExprTestBase.testEval:202->ExprTestBase.testEval:292 » AbstractMethod
TestStringOperatorsAndFunctions.testCharLength:263->ExprTestBase.testSimpleEval:182->ExprTestBase.testEval:202->ExprTestBase.testEval:292 » AbstractMethod
TestStringOperatorsAndFunctions.testBitLength:451->ExprTestBase.testSimpleEval:182->ExprTestBase.testEval:202->ExprTestBase.testEval:292 » AbstractMethod
TestStringOperatorsAndFunctions.testConcatenateOnExpressions:48->ExprTestBase.testSimpleEval:182->ExprTestBase.testEval:202->ExprTestBase.testEval:292 » AbstractMethod
TestStringOperatorsAndFunctions.testFunctionCallIngoreCases:56->ExprTestBase.testSimpleEval:182->ExprTestBase.testEval:202->ExprTestBase.testEval:292 » AbstractMethod
TestStringOperatorsAndFunctions.testQuote_ident:548->ExprTestBase.testSimpleEval:182->ExprTestBase.testEval:202->ExprTestBase.testEval:292 » AbstractMethod
TestStringOperatorsAndFunctions.testReverse:210->ExprTestBase.testSimpleEval:182->ExprTestBase.testEval:202->ExprTestBase.testEval:292 » AbstractMethod
TestStringOperatorsAndFunctions.testSplitPart:357->ExprTestBase.testSimpleEval:182->ExprTestBase.testEval:202->ExprTestBase.testEval:292 » AbstractMethod
TestStringOperatorsAndFunctions.testFindInSet:579->ExprTestBase.testSimpleEval:182->ExprTestBase.testEval:202->ExprTestBase.testEval:292 » AbstractMethod
TestStringOperatorsAndFunctions.testConcat:601->ExprTestBase.testSimpleEval:182->ExprTestBase.testEval:202->ExprTestBase.testEval:292 » AbstractMethod
TestStringOperatorsAndFunctions.testDecode:566->ExprTestBase.testSimpleEval:182->ExprTestBase.testEval:202->ExprTestBase.testEval:292 » AbstractMethod
TestStringOperatorsAndFunctions.testDigest:300->ExprTestBase.testSimpleEval:182->ExprTestBase.testEval:202->ExprTestBase.testEval:292 » AbstractMethod
TestStringOperatorsAndFunctions.testEncode:554->ExprTestBase.testSimpleEval:182->ExprTestBase.testEval:202->ExprTestBase.testEval:292 » AbstractMethod
TestStringOperatorsAndFunctions.testLength:275->ExprTestBase.testSimpleEval:182->ExprTestBase.testEval:202->ExprTestBase.testEval:292 » AbstractMethod
TestStringOperatorsAndFunctions.testLocate:403->ExprTestBase.testSimpleEval:182->ExprTestBase.testEval:202->ExprTestBase.testEval:292 » AbstractMethod
TestStringOperatorsAndFunctions.testInitcap:495->ExprTestBase.testSimpleEval:182->ExprTestBase.testEval:202->ExprTestBase.testEval:292 » AbstractMethod
TestStringOperatorsAndFunctions.testRepeat:223->ExprTestBase.testSimpleEval:182->ExprTestBase.testEval:202->ExprTestBase.testEval:292 » AbstractMethod
TestStringOperatorsAndFunctions.testStrpos:463->ExprTestBase.testSimpleEval:182->ExprTestBase.testEval:202->ExprTestBase.testEval:292 » AbstractMethod
TestStringOperatorsAndFunctions.testSubstr:376->ExprTestBase.testSimpleEval:182->ExprTestBase.testEval:202->ExprTestBase.testEval:292 » AbstractMethod
TestStringOperatorsAndFunctions.testConcatenateOnLiteral:35->ExprTestBase.testSimpleEval:182->ExprTestBase.testEval:202->ExprTestBase.testEval:292 » AbstractMethod
TestStringOperatorsAndFunctions.testStrposb:479->ExprTestBase.testSimpleEval:182->ExprTestBase.testEval:202->ExprTestBase.testEval:292 » AbstractMethod
TestJoinBroadcast.testMultiplePartitionedBroadcastDataFileWithZeroLength:770 » Service
TestInsertQuery.testInsertOverwriteWithUnion:727->QueryTestCaseBase.executeFile:424 » Service
TestInsertQuery.testInsertOverwriteWithUnionDifferentAlias:755->QueryTestCaseBase.executeFile:424 » Service
TestInsertQuery.testInsertOverwriteWithDatabase:615->QueryTestCaseBase.executeFile:424 » Service
TestInsertQuery.testInsertInto:69->QueryTestCaseBase.executeFile:424 » Service
TestInsertQuery.testInsertOverwriteSmallerColumns:304->QueryTestCaseBase.executeFile:424 » Service
TestInsertQuery.testInsertOverwrite:49->QueryTestCaseBase.executeFile:424 » Service
TestInsertQuery.testInsertOverwriteIntoParquet:546->QueryTestCaseBase.executeString:323 » Service
TestSelectQuery.testDatabaseRef:406->QueryTestCaseBase.executeFile:424 » Service
TestGroupByQuery.testGroupByWithNullData6:627->QueryTestCaseBase.executeString:323 » Service
TestGroupByQuery.testGroupByWithNullData7:639->QueryTestCaseBase.executeString:323 » Service
TestGroupByQuery.testGroupByWithNullData8:651->QueryTestCaseBase.executeString:323 » Service
TestGroupByQuery.testGroupByWithNullData9:663->QueryTestCaseBase.executeString:323 » Service
TestGroupByQuery.testDistinctAggregationCasebyCase11:435 » Service java.sql.SQ...
TestGroupByQuery.testGroupByWithNullData5:615->QueryTestCaseBase.executeString:323 » Service
TestGroupByQuery.testGroupByWithNullData6:627->QueryTestCaseBase.executeString:323 » Service
TestGroupByQuery.testGroupByWithNullData7:639->QueryTestCaseBase.executeString:323 » Service
TestGroupByQuery.testGroupByWithNullData8:651->QueryTestCaseBase.executeString:323 » Service
TestGroupByQuery.testGroupByWithNullData9:663->QueryTestCaseBase.executeString:323 » Service
TestGroupByQuery.testDistinctAggregationCaseByCase3:497 » Service java.sql.SQL...
TestGroupByQuery.testDistinctAggregationCaseByCase4:526 » Service java.sql.SQL...
TestGroupByQuery.testNumShufflePartition:724 » Service java.sql.SQLException: ...
TestGroupByQuery.testDistinctAggregationCasebyCase11:435 » Service java.sql.SQ...
TestJoinQuery.testLeftOuterJoinWithEmptySubquery1:479 » Service java.sql.SQLEx...
TestJoinQuery.testLeftOuterJoinWithEmptySubquery2:521 » Service java.sql.SQLEx...
TestJoinQuery.testRightOuterJoinPredicationCaseByCase1:886->createOuterJoinTestTable:1010 » Service
TestJoinQuery.testRightOuterJoinPredicationCaseByCase2:916->createOuterJoinTestTable:1010 » Service
TestJoinQuery.testRightOuterJoinPredicationCaseByCase3:944->createOuterJoinTestTable:1010 » Service
TestJoinQuery.testLeftOuterJoinPredicationCaseByCase1:652->createOuterJoinTestTable:1010 » Service
TestJoinQuery.testLeftOuterJoinPredicationCaseByCase2:680->createOuterJoinTestTable:1010 » Service
TestJoinQuery.testLeftOuterJoinPredicationCaseByCase3:741->createOuterJoinTestTable:1010 » Service
TestJoinQuery.testLeftOuterJoinPredicationCaseByCase4:771->createOuterJoinTestTable:1010 » Service
TestJoinQuery.testLeftOuterJoinPredicationCaseByCase5:801->createOuterJoinTestTable:1010 » Service
TestJoinQuery.testLeftOuterJoinPredicationCaseByCase6:831->createOuterJoinTestTable:1010 » Service
TestJoinQuery.testLeftOuterWithEmptyTable:860->createOuterJoinTestTable:1010 » Service
TestJoinQuery.testFullOuterJoinPredicationCaseByCase1:971->createOuterJoinTestTable:1010 » Service
TestJoinQuery.testJoinOnMultipleDatabases:564->QueryTestCaseBase.executeString:323 » Service
TestJoinQuery.testJoinOnMultipleDatabasesWithJson:607->QueryTestCaseBase.executeString:323 » Service
TestJoinQuery.testLeftOuterJoinPredicationCaseByCase2_1:709->createOuterJoinTestTable:1010 » Service
TestJoinQuery.testLeftOuterJoinWithEmptySubquery1:479 » Service java.sql.SQLEx...
TestJoinQuery.testLeftOuterJoinWithEmptySubquery2:521 » Service java.sql.SQLEx...
TestJoinQuery.testRightOuterJoinPredicationCaseByCase1:886->createOuterJoinTestTable:1010 » Service
TestJoinQuery.testRightOuterJoinPredicationCaseByCase2:916->createOuterJoinTestTable:1010 » Service
TestJoinQuery.testRightOuterJoinPredicationCaseByCase3:944->createOuterJoinTestTable:1010 » Service
TestJoinQuery.testLeftOuterJoinPredicationCaseByCase1:652->createOuterJoinTestTable:1010 » Service
TestJoinQuery.testLeftOuterJoinPredicationCaseByCase2:680->createOuterJoinTestTable:1010 » Service
TestJoinQuery.testLeftOuterJoinPredicationCaseByCase3:741->createOuterJoinTestTable:1010 » Service
TestJoinQuery.testLeftOuterJoinPredicationCaseByCase4:771->createOuterJoinTestTable:1010 » Service
TestJoinQuery.testLeftOuterJoinPredicationCaseByCase5:801->createOuterJoinTestTable:1010 » Service
TestJoinQuery.testLeftOuterJoinPredicationCaseByCase6:831->createOuterJoinTestTable:1010 » Service
TestJoinQuery.testLeftOuterWithEmptyTable:860->createOuterJoinTestTable:1010 » Service
TestJoinQuery.testFullOuterJoinPredicationCaseByCase1:971->createOuterJoinTestTable:1010 » Service
TestJoinQuery.testJoinOnMultipleDatabases:564->QueryTestCaseBase.executeString:323 » Service
TestJoinQuery.testJoinOnMultipleDatabasesWithJson:607->QueryTestCaseBase.executeString:323 » Service
TestJoinQuery.testLeftOuterJoinPredicationCaseByCase2_1:709->createOuterJoinTestTable:1010 » Service
TestJoinQuery.testLeftOuterJoinWithEmptySubquery1:479 » Service java.sql.SQLEx...
TestJoinQuery.testLeftOuterJoinWithEmptySubquery2:521 » Service java.sql.SQLEx...
TestJoinQuery.testRightOuterJoinPredicationCaseByCase1:886->createOuterJoinTestTable:1010 » Service
TestJoinQuery.testRightOuterJoinPredicationCaseByCase2:916->createOuterJoinTestTable:1010 » Service
TestJoinQuery.testRightOuterJoinPredicationCaseByCase3:944->createOuterJoinTestTable:1010 » Service
TestJoinQuery.testLeftOuterJoinPredicationCaseByCase1:652->createOuterJoinTestTable:1010 » Service
TestJoinQuery.testLeftOuterJoinPredicationCaseByCase2:680->createOuterJoinTestTable:1010 » Service
TestJoinQuery.testLeftOuterJoinPredicationCaseByCase3:741->createOuterJoinTestTable:1010 » Service
TestJoinQuery.testLeftOuterJoinPredicationCaseByCase4:771->createOuterJoinTestTable:1010 » Service
TestJoinQuery.testLeftOuterJoinPredicationCaseByCase5:801->createOuterJoinTestTable:1010 » Service
TestJoinQuery.testLeftOuterJoinPredicationCaseByCase6:831->createOuterJoinTestTable:1010 » Service
TestJoinQuery.testLeftOuterWithEmptyTable:860->createOuterJoinTestTable:1010 » Service
TestJoinQuery.testFullOuterJoinPredicationCaseByCase1:971->createOuterJoinTestTable:1010 » Service
TestJoinQuery.testJoinOnMultipleDatabases:564->QueryTestCaseBase.executeString:323 » Service
TestJoinQuery.testJoinOnMultipleDatabasesWithJson:607->QueryTestCaseBase.executeString:323 » Service
TestJoinQuery.testLeftOuterJoinPredicationCaseByCase2_1:709->createOuterJoinTestTable:1010 » Service
TestJoinQuery.testLeftOuterJoinWithEmptySubquery1:479 » Service java.sql.SQLEx...
TestJoinQuery.testLeftOuterJoinWithEmptySubquery2:521 » Service java.sql.SQLEx...
TestJoinQuery.testRightOuterJoinPredicationCaseByCase1:886->createOuterJoinTestTable:1010 » Service
TestJoinQuery.testRightOuterJoinPredicationCaseByCase2:916->createOuterJoinTestTable:1010 » Service
TestJoinQuery.testRightOuterJoinPredicationCaseByCase3:944->createOuterJoinTestTable:1010 » Service
TestJoinQuery.testLeftOuterJoinPredicationCaseByCase1:652->createOuterJoinTestTable:1010 » Service
TestJoinQuery.testLeftOuterJoinPredicationCaseByCase2:680->createOuterJoinTestTable:1010 » Service
TestJoinQuery.testLeftOuterJoinPredicationCaseByCase3:741->createOuterJoinTestTable:1010 » Service
TestJoinQuery.testLeftOuterJoinPredicationCaseByCase4:771->createOuterJoinTestTable:1010 » Service
TestJoinQuery.testLeftOuterJoinPredicationCaseByCase5:801->createOuterJoinTestTable:1010 » Service
TestJoinQuery.testLeftOuterJoinPredicationCaseByCase6:831->createOuterJoinTestTable:1010 » Service
TestJoinQuery.testLeftOuterWithEmptyTable:860->createOuterJoinTestTable:1010 » Service
TestJoinQuery.testFullOuterJoinPredicationCaseByCase1:971->createOuterJoinTestTable:1010 » Service
TestJoinQuery.testJoinOnMultipleDatabases:564->QueryTestCaseBase.executeString:323 » Service
TestJoinQuery.testJoinOnMultipleDatabasesWithJson:607->QueryTestCaseBase.executeString:323 » Service
TestJoinQuery.testLeftOuterJoinPredicationCaseByCase2_1:709->createOuterJoinTestTable:1010 » Service
TestCaseByCases.testTAJO1224Case1:179->QueryTestCaseBase.executeQuery:333->QueryTestCaseBase.executeFile:424 » Service
TestHBaseTable.testJoin:601->QueryTestCaseBase.executeString:323 » Service HBa...
TestHBaseTable.testInsertIntoLocation:1256->QueryTestCaseBase.executeString:323 » Service
TestHBaseTable.testNonForwardQuery:561->QueryTestCaseBase.executeString:323 » Service
TestHBaseTable.testInsertInto:643->QueryTestCaseBase.executeString:323 » Service
TestHBaseTable.testInsertIntoDifferentType:1068->QueryTestCaseBase.executeString:323 » Service
TestHBaseTable.testInsertIntoMultiRegionWithSplitFile:802->QueryTestCaseBase.executeString:323 » Service
TestHBaseTable.testInsertIntoMultiRegion:685->QueryTestCaseBase.executeString:323 » Service
TestHBaseTable.testInsertIntoMultiRegionMultiRowFields:860->QueryTestCaseBase.executeString:323 » Service
TestHBaseTable.testInsertIntoMultiRegion2:743->QueryTestCaseBase.executeString:323 » Service
TestHBaseTable.testInsertIntoUsingPut:1207->QueryTestCaseBase.executeString:323 » Service
TestHBaseTable.testCreateHBaseTable:112->QueryTestCaseBase.executeString:323 » Service
TestHBaseTable.testInsertIntoRowField:1105->QueryTestCaseBase.executeString:323 » Service
TestCTASQuery.testCtasWithGroupby:149->QueryTestCaseBase.executeQuery:333->QueryTestCaseBase.executeFile:424 » Service
TestCTASQuery.testCtasWithTextFile:231->QueryTestCaseBase.executeQuery:333->QueryTestCaseBase.executeFile:424 » Service
TestCTASQuery.testCtasWithLimit:169->QueryTestCaseBase.executeQuery:333->QueryTestCaseBase.executeFile:424 » Service
TestCTASQuery.testCtasWithUnion:179->QueryTestCaseBase.executeQuery:333->QueryTestCaseBase.executeFile:424 » Service
TestCTASQuery.testCtasWithOptions:245->QueryTestCaseBase.executeQuery:333->QueryTestCaseBase.executeFile:424 » Service
TestCTASQuery.testCtasWithStoreType:217->QueryTestCaseBase.executeQuery:333->QueryTestCaseBase.executeFile:424 » Service
TestCTASQuery.testCtasWithOrderby:159->QueryTestCaseBase.executeQuery:333->QueryTestCaseBase.executeFile:424 » Service
TestCTASQuery.testCtasWithMultipleUnions:189->QueryTestCaseBase.executeQuery:333->QueryTestCaseBase.executeFile:424 » Service
TestTruncateTable.testTruncateTable:64->QueryTestCaseBase.executeString:323 » Service
TestEvalCodeGenerator.testGetField:57->ExprTestBase.testEval:202->ExprTestBase.testEval:292 » AbstractMethod
TestEvalCodeGenerator.testComparison:112->ExprTestBase.testSimpleEval:182->ExprTestBase.testEval:202->ExprTestBase.testEval:292 » AbstractMethod
TestEvalCodeGenerator.testArithmetic:48->ExprTestBase.testEval:202->ExprTestBase.testEval:292 » AbstractMethod
TestEvalCodeGenerator.testAndOr:270->ExprTestBase.testSimpleEval:182->ExprTestBase.testEval:202->ExprTestBase.testEval:292 » AbstractMethod
TestEvalCodeGenerator.testUnary:246->ExprTestBase.testEval:202->ExprTestBase.testEval:292 » AbstractMethod
TestEvalCodeGenerator.testBetweenSymmetric:201->ExprTestBase.testEval:202->ExprTestBase.testEval:292 » AbstractMethod
TestEvalCodeGenerator.testStringConcat:302->ExprTestBase.testSimpleEval:182->ExprTestBase.testEval:202->ExprTestBase.testEval:292 » AbstractMethod
TestEvalCodeGenerator.testBetweenAsymmetric:167->ExprTestBase.testEval:202->ExprTestBase.testEval:292 » AbstractMethod
TestEvalCodeGenerator.testNullHandling:81->ExprTestBase.testEval:202->ExprTestBase.testEval:292 » AbstractMethod
TestEvalCodeGenerator.testFunction:293->ExprTestBase.testEval:202->ExprTestBase.testEval:292 » AbstractMethod
TestTajoClient.testGetQueryStatusAndResultAfterFinish:668 » SQL com.google.pro...
TestTajoClient.testGetQueryInfoAndHistory:748 » test timed out after 30000 mi...
TestTajoClient.testNullCharSessionInCTAS:697 » Service java.sql.SQLException: ...
Tests run: 1457, Failures: 666, Errors: 251, Skipped: 0
[INFO] ------------------------------------------------------------------------
[INFO] Reactor Summary:
[INFO]
[INFO] Tajo Main ......................................... SUCCESS [ 1.626 s]
[INFO] Tajo Project POM .................................. SUCCESS [ 1.193 s]
[INFO] Tajo Maven Plugins ................................ SUCCESS [ 3.345 s]
[INFO] Tajo Common ....................................... SUCCESS [ 23.815 s]
[INFO] Tajo Algebra ...................................... SUCCESS [ 1.371 s]
[INFO] Tajo Catalog Common ............................... SUCCESS [ 7.195 s]
[INFO] Tajo Plan ......................................... SUCCESS [ 6.004 s]
[INFO] Tajo Rpc Common ................................... SUCCESS [ 0.445 s]
[INFO] Tajo Protocol Buffer Rpc .......................... SUCCESS [ 37.551 s]
[INFO] Tajo Catalog Client ............................... SUCCESS [ 1.036 s]
[INFO] Tajo Catalog Server ............................... SUCCESS [ 9.775 s]
[INFO] Tajo Storage Common ............................... SUCCESS [ 11.193 s]
[INFO] Tajo HDFS Storage ................................. SUCCESS [ 55.085 s]
[INFO] Tajo HBase Storage ................................ SUCCESS [ 3.016 s]
[INFO] Tajo PullServer ................................... SUCCESS [ 0.943 s]
[INFO] Tajo Client ....................................... SUCCESS [ 3.007 s]
[INFO] Tajo CLI tools .................................... SUCCESS [ 0.696 s]
[INFO] Tajo JDBC Driver .................................. SUCCESS [ 3.029 s]
[INFO] ASM (thirdparty) .................................. SUCCESS [ 0.595 s]
[INFO] Tajo RESTful Container ............................ SUCCESS [ 3.375 s]
[INFO] Tajo Core ......................................... FAILURE [16:42 min]
[INFO] Tajo RPC .......................................... SKIPPED
[INFO] Tajo Catalog Drivers Hive ......................... SKIPPED
[INFO] Tajo Catalog Drivers .............................. SKIPPED
[INFO] Tajo Catalog ...................................... SKIPPED
[INFO] Tajo Storage ...................................... SKIPPED
[INFO] Tajo Distribution ................................. SKIPPED
[INFO] ------------------------------------------------------------------------
[INFO] BUILD FAILURE
[INFO] ------------------------------------------------------------------------
[INFO] Total time: 19:37 min
[INFO] Finished at: 2015-04-19T09:04:55+00:00
[INFO] Final Memory: 97M/1011M
[INFO] ------------------------------------------------------------------------
[ERROR] Failed to execute goal org.apache.maven.plugins:maven-surefire-plugin:2.17:test (default-test) on project tajo-core: There are test failures.
[ERROR]
[ERROR] Please refer to <https://builds.apache.org/job/Tajo-master-CODEGEN-build/ws/tajo-core/target/surefire-reports> for the individual test results.
[ERROR] -> [Help 1]
[ERROR]
[ERROR] To see the full stack trace of the errors, re-run Maven with the -e switch.
[ERROR] Re-run Maven using the -X switch to enable full debug logging.
[ERROR]
[ERROR] For more information about the errors and possible solutions, please read the following articles:
[ERROR] [Help 1] http://cwiki.apache.org/confluence/display/MAVEN/MojoFailureException
[ERROR]
[ERROR] After correcting the problems, you can resume the build with the command
[ERROR] mvn <goals> -rf :tajo-core
Build step 'Execute shell' marked build as failure
Updating TAJO-1567
Build failed in Jenkins: Tajo-master-CODEGEN-build #313
Posted by Apache Jenkins Server <je...@builds.apache.org>.
See <https://builds.apache.org/job/Tajo-master-CODEGEN-build/313/changes>
Changes:
[jhkim] TAJO-1569: BlockingRpcClient can make other request fail. (jinho)
------------------------------------------
[...truncated 387207 lines...]
TestConditionalExpressions.testCoalesceBoolean:206->ExprTestBase.testSimpleEval:182->ExprTestBase.testEval:202->ExprTestBase.testEval:292 » AbstractMethod
TestMathFunctions.testRoundWithSpecifiedPrecision:452->ExprTestBase.testSimpleEval:182->ExprTestBase.testEval:202->ExprTestBase.testEval:292 » AbstractMethod
TestMathFunctions.testAbs:334->ExprTestBase.testSimpleEval:182->ExprTestBase.testEval:202->ExprTestBase.testEval:292 » AbstractMethod
TestMathFunctions.testCos:134->ExprTestBase.testSimpleEval:182->ExprTestBase.testEval:202->ExprTestBase.testEval:292 » AbstractMethod
TestMathFunctions.testDiv:247->ExprTestBase.testSimpleEval:182->ExprTestBase.testEval:202->ExprTestBase.testEval:292 » AbstractMethod
TestMathFunctions.testExp:313->ExprTestBase.testSimpleEval:182->ExprTestBase.testEval:202->ExprTestBase.testEval:292 » AbstractMethod
TestMathFunctions.testMod:231->ExprTestBase.testSimpleEval:182->ExprTestBase.testEval:202->ExprTestBase.testEval:292 » AbstractMethod
TestMathFunctions.testPow:397->ExprTestBase.testSimpleEval:182->ExprTestBase.testEval:202->ExprTestBase.testEval:292 » AbstractMethod
TestMathFunctions.testSin:117->ExprTestBase.testSimpleEval:182->ExprTestBase.testEval:202->ExprTestBase.testEval:292 » AbstractMethod
TestMathFunctions.testTan:150->ExprTestBase.testSimpleEval:182->ExprTestBase.testEval:202->ExprTestBase.testEval:292 » AbstractMethod
TestMathFunctions.testAtan2:214->ExprTestBase.testSimpleEval:182->ExprTestBase.testEval:202->ExprTestBase.testEval:292 » AbstractMethod
TestMathFunctions.testFloor:61->ExprTestBase.testSimpleEval:182->ExprTestBase.testEval:202->ExprTestBase.testEval:292 » AbstractMethod
TestMathFunctions.testRound:32->ExprTestBase.testSimpleEval:182->ExprTestBase.testEval:202->ExprTestBase.testEval:292 » AbstractMethod
TestMathFunctions.testAcos:182->ExprTestBase.testSimpleEval:182->ExprTestBase.testEval:202->ExprTestBase.testEval:292 » AbstractMethod
TestMathFunctions.testAsin:166->ExprTestBase.testSimpleEval:182->ExprTestBase.testEval:202->ExprTestBase.testEval:292 » AbstractMethod
TestMathFunctions.testAtan:198->ExprTestBase.testSimpleEval:182->ExprTestBase.testEval:202->ExprTestBase.testEval:292 » AbstractMethod
TestMathFunctions.testCbrt:355->ExprTestBase.testSimpleEval:182->ExprTestBase.testEval:202->ExprTestBase.testEval:292 » AbstractMethod
TestMathFunctions.testCeil:79->ExprTestBase.testSimpleEval:182->ExprTestBase.testEval:202->ExprTestBase.testEval:292 » AbstractMethod
TestMathFunctions.testSign:263->ExprTestBase.testSimpleEval:182->ExprTestBase.testEval:202->ExprTestBase.testEval:292 » AbstractMethod
TestMathFunctions.testSqrt:288->ExprTestBase.testSimpleEval:182->ExprTestBase.testEval:202->ExprTestBase.testEval:292 » AbstractMethod
TestMathFunctions.testPi:438->ExprTestBase.testSimpleEval:182->ExprTestBase.testEval:202->ExprTestBase.testEval:292 » AbstractMethod
TestMathFunctions.testCeiling:98->ExprTestBase.testSimpleEval:182->ExprTestBase.testEval:202->ExprTestBase.testEval:292 » AbstractMethod
TestMathFunctions.testRadians:418->ExprTestBase.testSimpleEval:182->ExprTestBase.testEval:202->ExprTestBase.testEval:292 » AbstractMethod
TestMathFunctions.testDegrees:377->ExprTestBase.testSimpleEval:182->ExprTestBase.testEval:202->ExprTestBase.testEval:292 » AbstractMethod
TestJsonFunctions.testJsonExtractPathText:32->ExprTestBase.testSimpleEval:182->ExprTestBase.testEval:202->ExprTestBase.testEval:292 » AbstractMethod
TestDateTimeFunctions.testDatePart:242->ExprTestBase.testEval:202->ExprTestBase.testEval:290 » Compilation
TestDateTimeFunctions.testExtract:125->ExprTestBase.testEval:202->ExprTestBase.testEval:290 » Compilation
TestDateTimeFunctions.testAddDays:398->ExprTestBase.testSimpleEval:182->ExprTestBase.testEval:202->ExprTestBase.testEval:292 » AbstractMethod
TestDateTimeFunctions.testToTimestamp:48->ExprTestBase.testSimpleEval:182->ExprTestBase.testEval:202->ExprTestBase.testEval:292 » AbstractMethod
TestDateTimeFunctions.testDateTimeNow:438->ExprTestBase.testSimpleEval:186->ExprTestBase.testEval:209->ExprTestBase.testEval:292 » AbstractMethod
TestDateTimeFunctions.testUtcUsecTo:349->ExprTestBase.testSimpleEval:182->ExprTestBase.testEval:202->ExprTestBase.testEval:292 » AbstractMethod
TestDateTimeFunctions.testTimeValueKeyword:467->ExprTestBase.testSimpleEval:186->ExprTestBase.testEval:209->ExprTestBase.testEval:292 » AbstractMethod
TestDateTimeFunctions.testAddMonths:367->ExprTestBase.testSimpleEval:182->ExprTestBase.testEval:202->ExprTestBase.testEval:292 » AbstractMethod
TestDateTimeFunctions.testToChar:109->ExprTestBase.testSimpleEval:182->ExprTestBase.testEval:202->ExprTestBase.testEval:292 » AbstractMethod
TestDateTimeFunctions.testToDate:358->ExprTestBase.testSimpleEval:182->ExprTestBase.testEval:202->ExprTestBase.testEval:292 » AbstractMethod
TestStringOperatorsAndFunctions.testRegexReplace:127->ExprTestBase.testSimpleEval:182->ExprTestBase.testEval:202->ExprTestBase.testEval:292 » AbstractMethod
TestStringOperatorsAndFunctions.testOctetLength:343->ExprTestBase.testSimpleEval:182->ExprTestBase.testEval:202->ExprTestBase.testEval:292 » AbstractMethod
TestStringOperatorsAndFunctions.testBin:329->ExprTestBase.testSimpleEval:182->ExprTestBase.testEval:202->ExprTestBase.testEval:292 » AbstractMethod
TestStringOperatorsAndFunctions.testChr:514->ExprTestBase.testSimpleEval:182->ExprTestBase.testEval:202->ExprTestBase.testEval:292 » AbstractMethod
TestStringOperatorsAndFunctions.testHex:314->ExprTestBase.testSimpleEval:182->ExprTestBase.testEval:202->ExprTestBase.testEval:292 » AbstractMethod
TestStringOperatorsAndFunctions.testMd5:287->ExprTestBase.testSimpleEval:182->ExprTestBase.testEval:202->ExprTestBase.testEval:292 » AbstractMethod
TestStringOperatorsAndFunctions.testAscii:501->ExprTestBase.testSimpleEval:182->ExprTestBase.testEval:202->ExprTestBase.testEval:292 » AbstractMethod
TestStringOperatorsAndFunctions.testLTrim:68->ExprTestBase.testSimpleEval:182->ExprTestBase.testEval:202->ExprTestBase.testEval:292 » AbstractMethod
TestStringOperatorsAndFunctions.testLower:250->ExprTestBase.testSimpleEval:182->ExprTestBase.testEval:202->ExprTestBase.testEval:292 » AbstractMethod
TestStringOperatorsAndFunctions.testRTrim:89->ExprTestBase.testSimpleEval:182->ExprTestBase.testEval:202->ExprTestBase.testEval:292 » AbstractMethod
TestStringOperatorsAndFunctions.testRight:181->ExprTestBase.testSimpleEval:182->ExprTestBase.testEval:202->ExprTestBase.testEval:292 » AbstractMethod
TestStringOperatorsAndFunctions.testUpper:237->ExprTestBase.testSimpleEval:182->ExprTestBase.testEval:202->ExprTestBase.testEval:292 » AbstractMethod
TestStringOperatorsAndFunctions.testLeft:152->ExprTestBase.testSimpleEval:182->ExprTestBase.testEval:202->ExprTestBase.testEval:292 » AbstractMethod
TestStringOperatorsAndFunctions.testLpad:528->ExprTestBase.testSimpleEval:182->ExprTestBase.testEval:202->ExprTestBase.testEval:292 » AbstractMethod
TestStringOperatorsAndFunctions.testRpad:538->ExprTestBase.testSimpleEval:182->ExprTestBase.testEval:202->ExprTestBase.testEval:292 » AbstractMethod
TestStringOperatorsAndFunctions.testTrim:110->ExprTestBase.testSimpleEval:182->ExprTestBase.testEval:202->ExprTestBase.testEval:292 » AbstractMethod
TestStringOperatorsAndFunctions.testConcat_ws:610->ExprTestBase.testSimpleEval:182->ExprTestBase.testEval:202->ExprTestBase.testEval:292 » AbstractMethod
TestStringOperatorsAndFunctions.testCharLength:263->ExprTestBase.testSimpleEval:182->ExprTestBase.testEval:202->ExprTestBase.testEval:292 » AbstractMethod
TestStringOperatorsAndFunctions.testBitLength:451->ExprTestBase.testSimpleEval:182->ExprTestBase.testEval:202->ExprTestBase.testEval:292 » AbstractMethod
TestStringOperatorsAndFunctions.testConcatenateOnExpressions:48->ExprTestBase.testSimpleEval:182->ExprTestBase.testEval:202->ExprTestBase.testEval:292 » AbstractMethod
TestStringOperatorsAndFunctions.testFunctionCallIngoreCases:56->ExprTestBase.testSimpleEval:182->ExprTestBase.testEval:202->ExprTestBase.testEval:292 » AbstractMethod
TestStringOperatorsAndFunctions.testQuote_ident:548->ExprTestBase.testSimpleEval:182->ExprTestBase.testEval:202->ExprTestBase.testEval:292 » AbstractMethod
TestStringOperatorsAndFunctions.testReverse:210->ExprTestBase.testSimpleEval:182->ExprTestBase.testEval:202->ExprTestBase.testEval:292 » AbstractMethod
TestStringOperatorsAndFunctions.testSplitPart:357->ExprTestBase.testSimpleEval:182->ExprTestBase.testEval:202->ExprTestBase.testEval:292 » AbstractMethod
TestStringOperatorsAndFunctions.testFindInSet:579->ExprTestBase.testSimpleEval:182->ExprTestBase.testEval:202->ExprTestBase.testEval:292 » AbstractMethod
TestStringOperatorsAndFunctions.testConcat:601->ExprTestBase.testSimpleEval:182->ExprTestBase.testEval:202->ExprTestBase.testEval:292 » AbstractMethod
TestStringOperatorsAndFunctions.testDecode:566->ExprTestBase.testSimpleEval:182->ExprTestBase.testEval:202->ExprTestBase.testEval:292 » AbstractMethod
TestStringOperatorsAndFunctions.testDigest:300->ExprTestBase.testSimpleEval:182->ExprTestBase.testEval:202->ExprTestBase.testEval:292 » AbstractMethod
TestStringOperatorsAndFunctions.testEncode:554->ExprTestBase.testSimpleEval:182->ExprTestBase.testEval:202->ExprTestBase.testEval:292 » AbstractMethod
TestStringOperatorsAndFunctions.testLength:275->ExprTestBase.testSimpleEval:182->ExprTestBase.testEval:202->ExprTestBase.testEval:292 » AbstractMethod
TestStringOperatorsAndFunctions.testLocate:403->ExprTestBase.testSimpleEval:182->ExprTestBase.testEval:202->ExprTestBase.testEval:292 » AbstractMethod
TestStringOperatorsAndFunctions.testInitcap:495->ExprTestBase.testSimpleEval:182->ExprTestBase.testEval:202->ExprTestBase.testEval:292 » AbstractMethod
TestStringOperatorsAndFunctions.testRepeat:223->ExprTestBase.testSimpleEval:182->ExprTestBase.testEval:202->ExprTestBase.testEval:292 » AbstractMethod
TestStringOperatorsAndFunctions.testStrpos:463->ExprTestBase.testSimpleEval:182->ExprTestBase.testEval:202->ExprTestBase.testEval:292 » AbstractMethod
TestStringOperatorsAndFunctions.testSubstr:376->ExprTestBase.testSimpleEval:182->ExprTestBase.testEval:202->ExprTestBase.testEval:292 » AbstractMethod
TestStringOperatorsAndFunctions.testConcatenateOnLiteral:35->ExprTestBase.testSimpleEval:182->ExprTestBase.testEval:202->ExprTestBase.testEval:292 » AbstractMethod
TestStringOperatorsAndFunctions.testStrposb:479->ExprTestBase.testSimpleEval:182->ExprTestBase.testEval:202->ExprTestBase.testEval:292 » AbstractMethod
TestJoinBroadcast.testMultiplePartitionedBroadcastDataFileWithZeroLength:770 » Service
TestInsertQuery.testInsertOverwriteWithUnion:727->QueryTestCaseBase.executeFile:424 » Service
TestInsertQuery.testInsertOverwriteWithUnionDifferentAlias:755->QueryTestCaseBase.executeFile:424 » Service
TestInsertQuery.testInsertOverwriteWithDatabase:615->QueryTestCaseBase.executeFile:424 » Service
TestInsertQuery.testInsertInto:69->QueryTestCaseBase.executeFile:424 » Service
TestInsertQuery.testInsertOverwriteSmallerColumns:304->QueryTestCaseBase.executeFile:424 » Service
TestInsertQuery.testInsertOverwrite:49->QueryTestCaseBase.executeFile:424 » Service
TestInsertQuery.testInsertOverwriteIntoParquet:546->QueryTestCaseBase.executeString:323 » Service
TestSelectQuery.testDatabaseRef:406->QueryTestCaseBase.executeFile:424 » Service
TestGroupByQuery.testGroupByWithNullData6:627->QueryTestCaseBase.executeString:323 » Service
TestGroupByQuery.testGroupByWithNullData7:639->QueryTestCaseBase.executeString:323 » Service
TestGroupByQuery.testGroupByWithNullData8:651->QueryTestCaseBase.executeString:323 » Service
TestGroupByQuery.testGroupByWithNullData9:663->QueryTestCaseBase.executeString:323 » Service
TestGroupByQuery.testDistinctAggregationCasebyCase11:435 » Service java.sql.SQ...
TestGroupByQuery.testGroupByWithNullData5:615->QueryTestCaseBase.executeString:323 » Service
TestGroupByQuery.testGroupByWithNullData6:627->QueryTestCaseBase.executeString:323 » Service
TestGroupByQuery.testGroupByWithNullData7:639->QueryTestCaseBase.executeString:323 » Service
TestGroupByQuery.testGroupByWithNullData8:651->QueryTestCaseBase.executeString:323 » Service
TestGroupByQuery.testGroupByWithNullData9:663->QueryTestCaseBase.executeString:323 » Service
TestGroupByQuery.testDistinctAggregationCaseByCase3:497 » Service java.sql.SQL...
TestGroupByQuery.testDistinctAggregationCaseByCase4:526 » Service java.sql.SQL...
TestGroupByQuery.testNumShufflePartition:724 » Service java.sql.SQLException: ...
TestGroupByQuery.testDistinctAggregationCasebyCase11:435 » Service java.sql.SQ...
TestJoinQuery.testLeftOuterJoinWithEmptySubquery1:479 » Service java.sql.SQLEx...
TestJoinQuery.testLeftOuterJoinWithEmptySubquery2:521 » Service java.sql.SQLEx...
TestJoinQuery.testRightOuterJoinPredicationCaseByCase1:886->createOuterJoinTestTable:1010 » Service
TestJoinQuery.testRightOuterJoinPredicationCaseByCase2:916->createOuterJoinTestTable:1010 » Service
TestJoinQuery.testRightOuterJoinPredicationCaseByCase3:944->createOuterJoinTestTable:1010 » Service
TestJoinQuery.testLeftOuterJoinPredicationCaseByCase1:652->createOuterJoinTestTable:1010 » Service
TestJoinQuery.testLeftOuterJoinPredicationCaseByCase2:680->createOuterJoinTestTable:1010 » Service
TestJoinQuery.testLeftOuterJoinPredicationCaseByCase3:741->createOuterJoinTestTable:1010 » Service
TestJoinQuery.testLeftOuterJoinPredicationCaseByCase4:771->createOuterJoinTestTable:1010 » Service
TestJoinQuery.testLeftOuterJoinPredicationCaseByCase5:801->createOuterJoinTestTable:1010 » Service
TestJoinQuery.testLeftOuterJoinPredicationCaseByCase6:831->createOuterJoinTestTable:1010 » Service
TestJoinQuery.testLeftOuterWithEmptyTable:860->createOuterJoinTestTable:1010 » Service
TestJoinQuery.testFullOuterJoinPredicationCaseByCase1:971->createOuterJoinTestTable:1010 » Service
TestJoinQuery.testJoinOnMultipleDatabases:564->QueryTestCaseBase.executeString:323 » Service
TestJoinQuery.testJoinOnMultipleDatabasesWithJson:607->QueryTestCaseBase.executeString:323 » Service
TestJoinQuery.testLeftOuterJoinPredicationCaseByCase2_1:709->createOuterJoinTestTable:1010 » Service
TestJoinQuery.testLeftOuterJoinWithEmptySubquery1:479 » Service java.sql.SQLEx...
TestJoinQuery.testLeftOuterJoinWithEmptySubquery2:521 » Service java.sql.SQLEx...
TestJoinQuery.testRightOuterJoinPredicationCaseByCase1:886->createOuterJoinTestTable:1010 » Service
TestJoinQuery.testRightOuterJoinPredicationCaseByCase2:916->createOuterJoinTestTable:1010 » Service
TestJoinQuery.testRightOuterJoinPredicationCaseByCase3:944->createOuterJoinTestTable:1010 » Service
TestJoinQuery.testLeftOuterJoinPredicationCaseByCase1:652->createOuterJoinTestTable:1010 » Service
TestJoinQuery.testLeftOuterJoinPredicationCaseByCase2:680->createOuterJoinTestTable:1010 » Service
TestJoinQuery.testLeftOuterJoinPredicationCaseByCase3:741->createOuterJoinTestTable:1010 » Service
TestJoinQuery.testLeftOuterJoinPredicationCaseByCase4:771->createOuterJoinTestTable:1010 » Service
TestJoinQuery.testLeftOuterJoinPredicationCaseByCase5:801->createOuterJoinTestTable:1010 » Service
TestJoinQuery.testLeftOuterJoinPredicationCaseByCase6:831->createOuterJoinTestTable:1010 » Service
TestJoinQuery.testLeftOuterWithEmptyTable:860->createOuterJoinTestTable:1010 » Service
TestJoinQuery.testFullOuterJoinPredicationCaseByCase1:971->createOuterJoinTestTable:1010 » Service
TestJoinQuery.testJoinOnMultipleDatabases:564->QueryTestCaseBase.executeString:323 » Service
TestJoinQuery.testJoinOnMultipleDatabasesWithJson:607->QueryTestCaseBase.executeString:323 » Service
TestJoinQuery.testLeftOuterJoinPredicationCaseByCase2_1:709->createOuterJoinTestTable:1010 » Service
TestJoinQuery.testLeftOuterJoinWithEmptySubquery1:479 » Service java.sql.SQLEx...
TestJoinQuery.testLeftOuterJoinWithEmptySubquery2:521 » Service java.sql.SQLEx...
TestJoinQuery.testRightOuterJoinPredicationCaseByCase1:886->createOuterJoinTestTable:1010 » Service
TestJoinQuery.testRightOuterJoinPredicationCaseByCase2:916->createOuterJoinTestTable:1010 » Service
TestJoinQuery.testRightOuterJoinPredicationCaseByCase3:944->createOuterJoinTestTable:1010 » Service
TestJoinQuery.testLeftOuterJoinPredicationCaseByCase1:652->createOuterJoinTestTable:1010 » Service
TestJoinQuery.testLeftOuterJoinPredicationCaseByCase2:680->createOuterJoinTestTable:1010 » Service
TestJoinQuery.testLeftOuterJoinPredicationCaseByCase3:741->createOuterJoinTestTable:1010 » Service
TestJoinQuery.testLeftOuterJoinPredicationCaseByCase4:771->createOuterJoinTestTable:1010 » Service
TestJoinQuery.testLeftOuterJoinPredicationCaseByCase5:801->createOuterJoinTestTable:1010 » Service
TestJoinQuery.testLeftOuterJoinPredicationCaseByCase6:831->createOuterJoinTestTable:1010 » Service
TestJoinQuery.testLeftOuterWithEmptyTable:860->createOuterJoinTestTable:1010 » Service
TestJoinQuery.testFullOuterJoinPredicationCaseByCase1:971->createOuterJoinTestTable:1010 » Service
TestJoinQuery.testJoinOnMultipleDatabases:564->QueryTestCaseBase.executeString:323 » Service
TestJoinQuery.testJoinOnMultipleDatabasesWithJson:607->QueryTestCaseBase.executeString:323 » Service
TestJoinQuery.testLeftOuterJoinPredicationCaseByCase2_1:709->createOuterJoinTestTable:1010 » Service
TestJoinQuery.testLeftOuterJoinWithEmptySubquery1:479 » Service java.sql.SQLEx...
TestJoinQuery.testLeftOuterJoinWithEmptySubquery2:521 » Service java.sql.SQLEx...
TestJoinQuery.testRightOuterJoinPredicationCaseByCase1:886->createOuterJoinTestTable:1010 » Service
TestJoinQuery.testRightOuterJoinPredicationCaseByCase2:916->createOuterJoinTestTable:1010 » Service
TestJoinQuery.testRightOuterJoinPredicationCaseByCase3:944->createOuterJoinTestTable:1010 » Service
TestJoinQuery.testLeftOuterJoinPredicationCaseByCase1:652->createOuterJoinTestTable:1010 » Service
TestJoinQuery.testLeftOuterJoinPredicationCaseByCase2:680->createOuterJoinTestTable:1010 » Service
TestJoinQuery.testLeftOuterJoinPredicationCaseByCase3:741->createOuterJoinTestTable:1010 » Service
TestJoinQuery.testLeftOuterJoinPredicationCaseByCase4:771->createOuterJoinTestTable:1010 » Service
TestJoinQuery.testLeftOuterJoinPredicationCaseByCase5:801->createOuterJoinTestTable:1010 » Service
TestJoinQuery.testLeftOuterJoinPredicationCaseByCase6:831->createOuterJoinTestTable:1010 » Service
TestJoinQuery.testLeftOuterWithEmptyTable:860->createOuterJoinTestTable:1010 » Service
TestJoinQuery.testFullOuterJoinPredicationCaseByCase1:971->createOuterJoinTestTable:1010 » Service
TestJoinQuery.testJoinOnMultipleDatabases:564->QueryTestCaseBase.executeString:323 » Service
TestJoinQuery.testJoinOnMultipleDatabasesWithJson:607->QueryTestCaseBase.executeString:323 » Service
TestJoinQuery.testLeftOuterJoinPredicationCaseByCase2_1:709->createOuterJoinTestTable:1010 » Service
TestCaseByCases.testTAJO1224Case1:179->QueryTestCaseBase.executeQuery:333->QueryTestCaseBase.executeFile:424 » Service
TestHBaseTable.testJoin:601->QueryTestCaseBase.executeString:323 » Service HBa...
TestHBaseTable.testInsertIntoLocation:1256->QueryTestCaseBase.executeString:323 » Service
TestHBaseTable.testNonForwardQuery:561->QueryTestCaseBase.executeString:323 » Service
TestHBaseTable.testInsertInto:643->QueryTestCaseBase.executeString:323 » Service
TestHBaseTable.testInsertIntoDifferentType:1068->QueryTestCaseBase.executeString:323 » Service
TestHBaseTable.testInsertIntoMultiRegionWithSplitFile:802->QueryTestCaseBase.executeString:323 » Service
TestHBaseTable.testInsertIntoMultiRegion:685->QueryTestCaseBase.executeString:323 » Service
TestHBaseTable.testInsertIntoMultiRegionMultiRowFields:860->QueryTestCaseBase.executeString:323 » Service
TestHBaseTable.testInsertIntoMultiRegion2:743->QueryTestCaseBase.executeString:323 » Service
TestHBaseTable.testInsertIntoUsingPut:1207->QueryTestCaseBase.executeString:323 » Service
TestHBaseTable.testCreateHBaseTable:112->QueryTestCaseBase.executeString:323 » Service
TestHBaseTable.testInsertIntoRowField:1105->QueryTestCaseBase.executeString:323 » Service
TestCTASQuery.testCtasWithGroupby:149->QueryTestCaseBase.executeQuery:333->QueryTestCaseBase.executeFile:424 » Service
TestCTASQuery.testCtasWithTextFile:231->QueryTestCaseBase.executeQuery:333->QueryTestCaseBase.executeFile:424 » Service
TestCTASQuery.testCtasWithLimit:169->QueryTestCaseBase.executeQuery:333->QueryTestCaseBase.executeFile:424 » Service
TestCTASQuery.testCtasWithUnion:179->QueryTestCaseBase.executeQuery:333->QueryTestCaseBase.executeFile:424 » Service
TestCTASQuery.testCtasWithOptions:245->QueryTestCaseBase.executeQuery:333->QueryTestCaseBase.executeFile:424 » Service
TestCTASQuery.testCtasWithStoreType:217->QueryTestCaseBase.executeQuery:333->QueryTestCaseBase.executeFile:424 » Service
TestCTASQuery.testCtasWithOrderby:159->QueryTestCaseBase.executeQuery:333->QueryTestCaseBase.executeFile:424 » Service
TestCTASQuery.testCtasWithMultipleUnions:189->QueryTestCaseBase.executeQuery:333->QueryTestCaseBase.executeFile:424 » Service
TestTruncateTable.testTruncateTable:64->QueryTestCaseBase.executeString:323 » Service
TestEvalCodeGenerator.testGetField:57->ExprTestBase.testEval:202->ExprTestBase.testEval:292 » AbstractMethod
TestEvalCodeGenerator.testComparison:112->ExprTestBase.testSimpleEval:182->ExprTestBase.testEval:202->ExprTestBase.testEval:292 » AbstractMethod
TestEvalCodeGenerator.testArithmetic:48->ExprTestBase.testEval:202->ExprTestBase.testEval:292 » AbstractMethod
TestEvalCodeGenerator.testAndOr:270->ExprTestBase.testSimpleEval:182->ExprTestBase.testEval:202->ExprTestBase.testEval:292 » AbstractMethod
TestEvalCodeGenerator.testUnary:246->ExprTestBase.testEval:202->ExprTestBase.testEval:292 » AbstractMethod
TestEvalCodeGenerator.testBetweenSymmetric:201->ExprTestBase.testEval:202->ExprTestBase.testEval:292 » AbstractMethod
TestEvalCodeGenerator.testStringConcat:302->ExprTestBase.testSimpleEval:182->ExprTestBase.testEval:202->ExprTestBase.testEval:292 » AbstractMethod
TestEvalCodeGenerator.testBetweenAsymmetric:167->ExprTestBase.testEval:202->ExprTestBase.testEval:292 » AbstractMethod
TestEvalCodeGenerator.testNullHandling:81->ExprTestBase.testEval:202->ExprTestBase.testEval:292 » AbstractMethod
TestEvalCodeGenerator.testFunction:293->ExprTestBase.testEval:202->ExprTestBase.testEval:292 » AbstractMethod
TestTajoClient.testGetQueryStatusAndResultAfterFinish:668 » SQL com.google.pro...
TestTajoClient.testGetQueryInfoAndHistory:748 » test timed out after 30000 mi...
TestTajoClient.testNullCharSessionInCTAS:697 » Service java.sql.SQLException: ...
Tests run: 1457, Failures: 667, Errors: 251, Skipped: 0
[INFO] ------------------------------------------------------------------------
[INFO] Reactor Summary:
[INFO]
[INFO] Tajo Main ......................................... SUCCESS [ 1.583 s]
[INFO] Tajo Project POM .................................. SUCCESS [ 1.328 s]
[INFO] Tajo Maven Plugins ................................ SUCCESS [ 2.886 s]
[INFO] Tajo Common ....................................... SUCCESS [ 23.903 s]
[INFO] Tajo Algebra ...................................... SUCCESS [ 1.284 s]
[INFO] Tajo Catalog Common ............................... SUCCESS [ 6.645 s]
[INFO] Tajo Plan ......................................... SUCCESS [ 5.779 s]
[INFO] Tajo Rpc Common ................................... SUCCESS [ 0.400 s]
[INFO] Tajo Protocol Buffer Rpc .......................... SUCCESS [ 37.510 s]
[INFO] Tajo Catalog Client ............................... SUCCESS [ 1.037 s]
[INFO] Tajo Catalog Server ............................... SUCCESS [ 9.770 s]
[INFO] Tajo Storage Common ............................... SUCCESS [ 11.258 s]
[INFO] Tajo HDFS Storage ................................. SUCCESS [ 53.819 s]
[INFO] Tajo HBase Storage ................................ SUCCESS [ 3.145 s]
[INFO] Tajo PullServer ................................... SUCCESS [ 0.996 s]
[INFO] Tajo Client ....................................... SUCCESS [ 2.954 s]
[INFO] Tajo CLI tools .................................... SUCCESS [ 0.709 s]
[INFO] Tajo JDBC Driver .................................. SUCCESS [ 2.895 s]
[INFO] ASM (thirdparty) .................................. SUCCESS [ 0.526 s]
[INFO] Tajo RESTful Container ............................ SUCCESS [ 3.374 s]
[INFO] Tajo Core ......................................... FAILURE [16:23 min]
[INFO] Tajo RPC .......................................... SKIPPED
[INFO] Tajo Catalog Drivers Hive ......................... SKIPPED
[INFO] Tajo Catalog Drivers .............................. SKIPPED
[INFO] Tajo Catalog ...................................... SKIPPED
[INFO] Tajo Storage ...................................... SKIPPED
[INFO] Tajo Distribution ................................. SKIPPED
[INFO] ------------------------------------------------------------------------
[INFO] BUILD FAILURE
[INFO] ------------------------------------------------------------------------
[INFO] Total time: 19:16 min
[INFO] Finished at: 2015-04-18T08:33:27+00:00
[INFO] Final Memory: 97M/1077M
[INFO] ------------------------------------------------------------------------
[ERROR] Failed to execute goal org.apache.maven.plugins:maven-surefire-plugin:2.17:test (default-test) on project tajo-core: There are test failures.
[ERROR]
[ERROR] Please refer to <https://builds.apache.org/job/Tajo-master-CODEGEN-build/ws/tajo-core/target/surefire-reports> for the individual test results.
[ERROR] -> [Help 1]
[ERROR]
[ERROR] To see the full stack trace of the errors, re-run Maven with the -e switch.
[ERROR] Re-run Maven using the -X switch to enable full debug logging.
[ERROR]
[ERROR] For more information about the errors and possible solutions, please read the following articles:
[ERROR] [Help 1] http://cwiki.apache.org/confluence/display/MAVEN/MojoFailureException
[ERROR]
[ERROR] After correcting the problems, you can resume the build with the command
[ERROR] mvn <goals> -rf :tajo-core
Build step 'Execute shell' marked build as failure
Updating TAJO-1569
Build failed in Jenkins: Tajo-master-CODEGEN-build #312
Posted by Apache Jenkins Server <je...@builds.apache.org>.
See <https://builds.apache.org/job/Tajo-master-CODEGEN-build/312/changes>
Changes:
[jhkim] TAJO-1564: TestFetcher fails occasionally. (jinho)
------------------------------------------
[...truncated 1390 lines...]
[INFO] --- maven-resources-plugin:2.2:resources (default-resources) @ tajo-storage-common ---
[INFO] Using default encoding to copy filtered resources.
[INFO]
[INFO] --- maven-compiler-plugin:2.5.1:compile (default-compile) @ tajo-storage-common ---
[INFO] Compiling 57 source files to <https://builds.apache.org/job/Tajo-master-CODEGEN-build/ws/tajo-storage/tajo-storage-common/target/classes>
[WARNING] <https://builds.apache.org/job/Tajo-master-CODEGEN-build/ws/tajo-storage/tajo-storage-common/src/main/java/org/apache/tajo/tuple/offheap/OffHeapMemory.java>:[28,15] sun.misc.Unsafe is Sun proprietary API and may be removed in a future release
[WARNING] <https://builds.apache.org/job/Tajo-master-CODEGEN-build/ws/tajo-storage/tajo-storage-common/src/main/java/org/apache/tajo/tuple/offheap/OffHeapMemory.java>:[29,17] sun.nio.ch.DirectBuffer is Sun proprietary API and may be removed in a future release
[WARNING] <https://builds.apache.org/job/Tajo-master-CODEGEN-build/ws/tajo-storage/tajo-storage-common/src/main/java/org/apache/tajo/tuple/offheap/OffHeapRowBlockReader.java>:[23,15] sun.misc.Unsafe is Sun proprietary API and may be removed in a future release
[WARNING] <https://builds.apache.org/job/Tajo-master-CODEGEN-build/ws/tajo-storage/tajo-storage-common/src/main/java/org/apache/tajo/tuple/offheap/UnSafeTuple.java>:[33,15] sun.misc.Unsafe is Sun proprietary API and may be removed in a future release
[WARNING] <https://builds.apache.org/job/Tajo-master-CODEGEN-build/ws/tajo-storage/tajo-storage-common/src/main/java/org/apache/tajo/tuple/offheap/UnSafeTuple.java>:[34,17] sun.nio.ch.DirectBuffer is Sun proprietary API and may be removed in a future release
[WARNING] <https://builds.apache.org/job/Tajo-master-CODEGEN-build/ws/tajo-storage/tajo-storage-common/src/main/java/org/apache/tajo/tuple/offheap/OffHeapMemory.java>:[37,25] sun.misc.Unsafe is Sun proprietary API and may be removed in a future release
[WARNING] <https://builds.apache.org/job/Tajo-master-CODEGEN-build/ws/tajo-storage/tajo-storage-common/src/main/java/org/apache/tajo/tuple/offheap/OffHeapRowBlockReader.java>:[26,23] sun.misc.Unsafe is Sun proprietary API and may be removed in a future release
[WARNING] <https://builds.apache.org/job/Tajo-master-CODEGEN-build/ws/tajo-storage/tajo-storage-common/src/main/java/org/apache/tajo/tuple/offheap/UnSafeTuple.java>:[43,23] sun.misc.Unsafe is Sun proprietary API and may be removed in a future release
[WARNING] <https://builds.apache.org/job/Tajo-master-CODEGEN-build/ws/tajo-storage/tajo-storage-common/src/main/java/org/apache/tajo/tuple/offheap/UnSafeTuple.java>:[45,10] sun.nio.ch.DirectBuffer is Sun proprietary API and may be removed in a future release
[WARNING] <https://builds.apache.org/job/Tajo-master-CODEGEN-build/ws/tajo-storage/tajo-storage-common/src/main/java/org/apache/tajo/tuple/offheap/HeapTuple.java>:[32,15] sun.misc.Unsafe is Sun proprietary API and may be removed in a future release
[WARNING] <https://builds.apache.org/job/Tajo-master-CODEGEN-build/ws/tajo-storage/tajo-storage-common/src/main/java/org/apache/tajo/tuple/offheap/HeapTuple.java>:[40,23] sun.misc.Unsafe is Sun proprietary API and may be removed in a future release
[WARNING] <https://builds.apache.org/job/Tajo-master-CODEGEN-build/ws/tajo-storage/tajo-storage-common/src/main/java/org/apache/tajo/tuple/offheap/UnSafeTupleBytesComparator.java>:[25,15] sun.misc.Unsafe is Sun proprietary API and may be removed in a future release
[WARNING] <https://builds.apache.org/job/Tajo-master-CODEGEN-build/ws/tajo-storage/tajo-storage-common/src/main/java/org/apache/tajo/tuple/offheap/UnSafeTupleBytesComparator.java>:[33,23] sun.misc.Unsafe is Sun proprietary API and may be removed in a future release
[WARNING] <https://builds.apache.org/job/Tajo-master-CODEGEN-build/ws/tajo-storage/tajo-storage-common/src/main/java/org/apache/tajo/tuple/BaseTupleBuilder.java>:[33,15] sun.misc.Unsafe is Sun proprietary API and may be removed in a future release
[WARNING] <https://builds.apache.org/job/Tajo-master-CODEGEN-build/ws/tajo-storage/tajo-storage-common/src/main/java/org/apache/tajo/tuple/BaseTupleBuilder.java>:[34,17] sun.nio.ch.DirectBuffer is Sun proprietary API and may be removed in a future release
[WARNING] <https://builds.apache.org/job/Tajo-master-CODEGEN-build/ws/tajo-storage/tajo-storage-common/src/main/java/org/apache/tajo/tuple/BaseTupleBuilder.java>:[42,23] sun.misc.Unsafe is Sun proprietary API and may be removed in a future release
[WARNING] <https://builds.apache.org/job/Tajo-master-CODEGEN-build/ws/tajo-storage/tajo-storage-common/src/main/java/org/apache/tajo/storage/StorageUtil.java>:[25,17] sun.nio.ch.DirectBuffer is Sun proprietary API and may be removed in a future release
[WARNING] <https://builds.apache.org/job/Tajo-master-CODEGEN-build/ws/tajo-storage/tajo-storage-common/src/main/java/org/apache/tajo/tuple/offheap/OffHeapMemory.java>:[47,21] sun.nio.ch.DirectBuffer is Sun proprietary API and may be removed in a future release
[WARNING] <https://builds.apache.org/job/Tajo-master-CODEGEN-build/ws/tajo-storage/tajo-storage-common/src/main/java/org/apache/tajo/tuple/offheap/OffHeapMemory.java>:[77,24] sun.nio.ch.DirectBuffer is Sun proprietary API and may be removed in a future release
[WARNING] <https://builds.apache.org/job/Tajo-master-CODEGEN-build/ws/tajo-storage/tajo-storage-common/src/main/java/org/apache/tajo/tuple/offheap/UnSafeTuple.java>:[51,15] sun.nio.ch.DirectBuffer is Sun proprietary API and may be removed in a future release
[WARNING] <https://builds.apache.org/job/Tajo-master-CODEGEN-build/ws/tajo-storage/tajo-storage-common/src/main/java/org/apache/tajo/tuple/offheap/UnSafeTuple.java>:[82,12] sun.nio.ch.DirectBuffer is Sun proprietary API and may be removed in a future release
[WARNING] <https://builds.apache.org/job/Tajo-master-CODEGEN-build/ws/tajo-storage/tajo-storage-common/src/main/java/org/apache/tajo/tuple/BaseTupleBuilder.java>:[64,26] sun.nio.ch.DirectBuffer is Sun proprietary API and may be removed in a future release
[WARNING] <https://builds.apache.org/job/Tajo-master-CODEGEN-build/ws/tajo-storage/tajo-storage-common/src/main/java/org/apache/tajo/storage/StorageUtil.java>:[154,10] sun.nio.ch.DirectBuffer is Sun proprietary API and may be removed in a future release
[INFO]
[INFO] --- maven-resources-plugin:2.2:testResources (default-testResources) @ tajo-storage-common ---
[INFO] Using default encoding to copy filtered resources.
[INFO]
[INFO] --- maven-compiler-plugin:2.5.1:testCompile (default-testCompile) @ tajo-storage-common ---
[INFO] Compiling 8 source files to <https://builds.apache.org/job/Tajo-master-CODEGEN-build/ws/tajo-storage/tajo-storage-common/target/test-classes>
[INFO]
[INFO] --- maven-surefire-plugin:2.17:test (default-test) @ tajo-storage-common ---
[INFO] Surefire report directory: <https://builds.apache.org/job/Tajo-master-CODEGEN-build/ws/tajo-storage/tajo-storage-common/target/surefire-reports>
-------------------------------------------------------
T E S T S
-------------------------------------------------------
Running org.apache.tajo.tuple.offheap.TestHeapTuple
log4j:WARN No appenders could be found for logger (org.apache.tajo.tuple.offheap.TestOffHeapRowBlock).
log4j:WARN Please initialize the log4j system properly.
log4j:WARN See http://logging.apache.org/log4j/1.2/faq.html#noconfig for more info.
Tests run: 1, Failures: 0, Errors: 0, Skipped: 0, Time elapsed: 0.86 sec - in org.apache.tajo.tuple.offheap.TestHeapTuple
Running org.apache.tajo.tuple.offheap.TestResizableSpec
Tests run: 2, Failures: 0, Errors: 0, Skipped: 0, Time elapsed: 0.001 sec - in org.apache.tajo.tuple.offheap.TestResizableSpec
Running org.apache.tajo.tuple.offheap.TestOffHeapRowBlock
Tests run: 8, Failures: 0, Errors: 0, Skipped: 0, Time elapsed: 6.694 sec - in org.apache.tajo.tuple.offheap.TestOffHeapRowBlock
Running org.apache.tajo.tuple.TestBaseTupleBuilder
Tests run: 2, Failures: 0, Errors: 0, Skipped: 0, Time elapsed: 0.92 sec - in org.apache.tajo.tuple.TestBaseTupleBuilder
Running org.apache.tajo.storage.TestFrameTuple
Tests run: 1, Failures: 0, Errors: 0, Skipped: 0, Time elapsed: 0.003 sec - in org.apache.tajo.storage.TestFrameTuple
Running org.apache.tajo.storage.TestTupleComparator
Tests run: 3, Failures: 0, Errors: 0, Skipped: 0, Time elapsed: 0.003 sec - in org.apache.tajo.storage.TestTupleComparator
Running org.apache.tajo.storage.TestVTuple
Tests run: 6, Failures: 0, Errors: 0, Skipped: 0, Time elapsed: 0.004 sec - in org.apache.tajo.storage.TestVTuple
Running org.apache.tajo.storage.TestLazyTuple
Tests run: 8, Failures: 0, Errors: 0, Skipped: 0, Time elapsed: 0.027 sec - in org.apache.tajo.storage.TestLazyTuple
Results :
Tests run: 31, Failures: 0, Errors: 0, Skipped: 0
[INFO]
[INFO] --- build-helper-maven-plugin:1.5:add-source (add-source-2.3) @ tajo-storage-common ---
[INFO] Source directory: <https://builds.apache.org/job/Tajo-master-CODEGEN-build/ws/tajo-storage/tajo-storage-common/src/main/hadoop-2.3.0> added.
[INFO]
[INFO] --- maven-jar-plugin:2.4:jar (default-jar) @ tajo-storage-common ---
[INFO] Building jar: <https://builds.apache.org/job/Tajo-master-CODEGEN-build/ws/tajo-storage/tajo-storage-common/target/tajo-storage-common-0.11.0-SNAPSHOT.jar>
[INFO]
[INFO] --- maven-site-plugin:3.3:attach-descriptor (attach-descriptor) @ tajo-storage-common ---
[INFO]
[INFO] --- maven-jar-plugin:2.4:test-jar (default) @ tajo-storage-common ---
[INFO] Building jar: <https://builds.apache.org/job/Tajo-master-CODEGEN-build/ws/tajo-storage/tajo-storage-common/target/tajo-storage-common-0.11.0-SNAPSHOT-tests.jar>
[INFO]
[INFO] --- apache-rat-plugin:0.8:check (default) @ tajo-storage-common ---
[INFO] No excludes
[INFO]
[INFO] --- maven-install-plugin:2.5.2:install (default-install) @ tajo-storage-common ---
[INFO] Installing <https://builds.apache.org/job/Tajo-master-CODEGEN-build/ws/tajo-storage/tajo-storage-common/target/tajo-storage-common-0.11.0-SNAPSHOT.jar> to /home/jenkins/.m2/repository/org/apache/tajo/tajo-storage-common/0.11.0-SNAPSHOT/tajo-storage-common-0.11.0-SNAPSHOT.jar
[INFO] Installing <https://builds.apache.org/job/Tajo-master-CODEGEN-build/ws/tajo-storage/tajo-storage-common/pom.xml> to /home/jenkins/.m2/repository/org/apache/tajo/tajo-storage-common/0.11.0-SNAPSHOT/tajo-storage-common-0.11.0-SNAPSHOT.pom
[INFO] Installing <https://builds.apache.org/job/Tajo-master-CODEGEN-build/ws/tajo-storage/tajo-storage-common/target/tajo-storage-common-0.11.0-SNAPSHOT-tests.jar> to /home/jenkins/.m2/repository/org/apache/tajo/tajo-storage-common/0.11.0-SNAPSHOT/tajo-storage-common-0.11.0-SNAPSHOT-tests.jar
[INFO]
[INFO] ------------------------------------------------------------------------
[INFO] Building Tajo HDFS Storage 0.11.0-SNAPSHOT
[INFO] ------------------------------------------------------------------------
[INFO]
[INFO] --- maven-clean-plugin:2.5:clean (default-clean) @ tajo-storage-hdfs ---
[INFO] Deleting <https://builds.apache.org/job/Tajo-master-CODEGEN-build/ws/tajo-storage/tajo-storage-hdfs/target>
[INFO]
[INFO] --- maven-antrun-plugin:1.6:run (default) @ tajo-storage-hdfs ---
[INFO] Executing tasks
main:
[INFO] Executed tasks
[INFO]
[INFO] --- maven-antrun-plugin:1.6:run (create-protobuf-generated-sources-directory) @ tajo-storage-hdfs ---
[INFO] Executing tasks
main:
[mkdir] Created dir: <https://builds.apache.org/job/Tajo-master-CODEGEN-build/ws/tajo-storage/tajo-storage-hdfs/target/generated-sources/proto>
[INFO] Executed tasks
[INFO]
[INFO] --- exec-maven-plugin:1.2:exec (generate-sources) @ tajo-storage-hdfs ---
[INFO]
[INFO] --- build-helper-maven-plugin:1.5:add-source (add-source) @ tajo-storage-hdfs ---
[INFO] Source directory: <https://builds.apache.org/job/Tajo-master-CODEGEN-build/ws/tajo-storage/tajo-storage-hdfs/target/generated-sources/proto> added.
[INFO]
[INFO] --- maven-remote-resources-plugin:1.5:process (default) @ tajo-storage-hdfs ---
[INFO]
[INFO] --- maven-resources-plugin:2.2:resources (default-resources) @ tajo-storage-hdfs ---
[INFO] Using default encoding to copy filtered resources.
[INFO]
[INFO] --- maven-compiler-plugin:2.5.1:compile (default-compile) @ tajo-storage-hdfs ---
[INFO] Compiling 70 source files to <https://builds.apache.org/job/Tajo-master-CODEGEN-build/ws/tajo-storage/tajo-storage-hdfs/target/classes>
[INFO]
[INFO] --- maven-resources-plugin:2.2:testResources (default-testResources) @ tajo-storage-hdfs ---
[INFO] Using default encoding to copy filtered resources.
[INFO]
[INFO] --- maven-compiler-plugin:2.5.1:testCompile (default-testCompile) @ tajo-storage-hdfs ---
[INFO] Compiling 19 source files to <https://builds.apache.org/job/Tajo-master-CODEGEN-build/ws/tajo-storage/tajo-storage-hdfs/target/test-classes>
[INFO]
[INFO] --- maven-surefire-plugin:2.17:test (default-test) @ tajo-storage-hdfs ---
[INFO] Surefire report directory: <https://builds.apache.org/job/Tajo-master-CODEGEN-build/ws/tajo-storage/tajo-storage-hdfs/target/surefire-reports>
-------------------------------------------------------
T E S T S
-------------------------------------------------------
Running org.apache.tajo.storage.parquet.TestReadWrite
log4j:WARN No appenders could be found for logger (org.apache.hadoop.metrics2.lib.MutableMetricsFactory).
log4j:WARN Please initialize the log4j system properly.
log4j:WARN See http://logging.apache.org/log4j/1.2/faq.html#noconfig for more info.
SLF4J: Failed to load class "org.slf4j.impl.StaticLoggerBinder".
SLF4J: Defaulting to no-operation (NOP) logger implementation
SLF4J: See http://www.slf4j.org/codes.html#StaticLoggerBinder for further details.
Tests run: 1, Failures: 0, Errors: 0, Skipped: 0, Time elapsed: 1.601 sec - in org.apache.tajo.storage.parquet.TestReadWrite
Running org.apache.tajo.storage.parquet.TestSchemaConverter
Tests run: 2, Failures: 0, Errors: 0, Skipped: 0, Time elapsed: 0.004 sec - in org.apache.tajo.storage.parquet.TestSchemaConverter
Running org.apache.tajo.storage.TestFileStorageManager
Formatting using clusterid: testClusterID
Formatting using clusterid: testClusterID
Formatting using clusterid: testClusterID
Tests run: 4, Failures: 0, Errors: 0, Skipped: 0, Time elapsed: 6.34 sec - in org.apache.tajo.storage.TestFileStorageManager
Running org.apache.tajo.storage.TestMergeScanner
Tests run: 6, Failures: 0, Errors: 0, Skipped: 0, Time elapsed: 3.011 sec - in org.apache.tajo.storage.TestMergeScanner
Running org.apache.tajo.storage.avro.TestAvroUtil
Tests run: 3, Failures: 0, Errors: 0, Skipped: 0, Time elapsed: 0.197 sec - in org.apache.tajo.storage.avro.TestAvroUtil
Running org.apache.tajo.storage.TestCompressionStorages
Tests run: 16, Failures: 0, Errors: 0, Skipped: 0, Time elapsed: 3.228 sec - in org.apache.tajo.storage.TestCompressionStorages
Running org.apache.tajo.storage.index.TestSingleCSVFileBSTIndex
Tests run: 2, Failures: 0, Errors: 0, Skipped: 0, Time elapsed: 1.865 sec - in org.apache.tajo.storage.index.TestSingleCSVFileBSTIndex
Running org.apache.tajo.storage.index.TestBSTIndex
Tests run: 30, Failures: 0, Errors: 0, Skipped: 0, Time elapsed: 26.069 sec - in org.apache.tajo.storage.index.TestBSTIndex
Running org.apache.tajo.storage.TestSplitProcessor
Tests run: 4, Failures: 0, Errors: 0, Skipped: 0, Time elapsed: 0.003 sec - in org.apache.tajo.storage.TestSplitProcessor
Running org.apache.tajo.storage.TestDelimitedTextFile
java.io.IOException: org.apache.tajo.storage.text.TextLineParsingError: Unexpected End Of File position 165: null, Error line: {"col1": "true", "col2": "hyunsik", "col3": 17, "col4": 59, "col5": 23, "col6": 77.9, "col7": 271.9, "col8": "hyunsik", "col9": "aHl1bnNpaw==", "col10": "192.168.0.1"
Tests run: 4, Failures: 0, Errors: 0, Skipped: 0, Time elapsed: 0.183 sec - in org.apache.tajo.storage.TestDelimitedTextFile
Running org.apache.tajo.storage.TestStorages
Tests run: 96, Failures: 1, Errors: 0, Skipped: 0, Time elapsed: 6.932 sec <<< FAILURE! - in org.apache.tajo.storage.TestStorages
testSplitable[4](org.apache.tajo.storage.TestStorages) Time elapsed: 0.03 sec <<< FAILURE!
java.lang.AssertionError: expected:<10000> but was:<10088>
at org.junit.Assert.fail(Assert.java:88)
at org.junit.Assert.failNotEquals(Assert.java:743)
at org.junit.Assert.assertEquals(Assert.java:118)
at org.junit.Assert.assertEquals(Assert.java:555)
at org.junit.Assert.assertEquals(Assert.java:542)
at org.apache.tajo.storage.TestStorages.testSplitable(TestStorages.java:200)
Running org.apache.tajo.storage.TestByteBufLineReader
Formatting using clusterid: testClusterID
Tests run: 3, Failures: 0, Errors: 0, Skipped: 0, Time elapsed: 1.222 sec - in org.apache.tajo.storage.TestByteBufLineReader
Running org.apache.tajo.storage.TestFileSystems
Tests run: 1, Failures: 0, Errors: 0, Skipped: 0, Time elapsed: 0.021 sec - in org.apache.tajo.storage.TestFileSystems
Running org.apache.tajo.storage.json.TestJsonSerDe
Tests run: 1, Failures: 0, Errors: 0, Skipped: 0, Time elapsed: 0.016 sec - in org.apache.tajo.storage.json.TestJsonSerDe
Running org.apache.tajo.storage.TestStorageUtil
Tests run: 1, Failures: 0, Errors: 0, Skipped: 0, Time elapsed: 0.064 sec - in org.apache.tajo.storage.TestStorageUtil
Running org.apache.tajo.storage.TestLineReader
Tests run: 6, Failures: 0, Errors: 0, Skipped: 0, Time elapsed: 0.301 sec - in org.apache.tajo.storage.TestLineReader
Apr 18, 2015 5:59:00 AM INFO: parquet.hadoop.ParquetFileReader: reading another 1 footers
Apr 18, 2015 5:59:07 AM INFO: parquet.hadoop.ParquetFileReader: reading another 1 footers
Apr 18, 2015 5:59:08 AM INFO: parquet.hadoop.ParquetFileReader: reading another 1 footers
Apr 18, 2015 5:59:43 AM INFO: parquet.hadoop.ParquetFileReader: reading another 1 footers
Apr 18, 2015 5:59:43 AM INFO: parquet.hadoop.ParquetFileReader: reading another 1 footers
Apr 18, 2015 5:59:43 AM INFO: parquet.hadoop.ParquetFileReader: reading another 1 footers
Apr 18, 2015 5:59:44 AM INFO: parquet.hadoop.ParquetFileReader: reading another 1 footers
Results :
Failed tests:
TestStorages.testSplitable:200 expected:<10000> but was:<10088>
Tests run: 180, Failures: 1, Errors: 0, Skipped: 0
[INFO] ------------------------------------------------------------------------
[INFO] Reactor Summary:
[INFO]
[INFO] Tajo Main ......................................... SUCCESS [ 1.610 s]
[INFO] Tajo Project POM .................................. SUCCESS [ 1.139 s]
[INFO] Tajo Maven Plugins ................................ SUCCESS [ 2.681 s]
[INFO] Tajo Common ....................................... SUCCESS [ 22.879 s]
[INFO] Tajo Algebra ...................................... SUCCESS [ 1.297 s]
[INFO] Tajo Catalog Common ............................... SUCCESS [ 6.630 s]
[INFO] Tajo Plan ......................................... SUCCESS [ 5.747 s]
[INFO] Tajo Rpc Common ................................... SUCCESS [ 0.405 s]
[INFO] Tajo Protocol Buffer Rpc .......................... SUCCESS [ 34.399 s]
[INFO] Tajo Catalog Client ............................... SUCCESS [ 1.047 s]
[INFO] Tajo Catalog Server ............................... SUCCESS [ 9.884 s]
[INFO] Tajo Storage Common ............................... SUCCESS [ 10.911 s]
[INFO] Tajo HDFS Storage ................................. FAILURE [ 53.252 s]
[INFO] Tajo HBase Storage ................................ SKIPPED
[INFO] Tajo PullServer ................................... SKIPPED
[INFO] Tajo Client ....................................... SKIPPED
[INFO] Tajo CLI tools .................................... SKIPPED
[INFO] Tajo JDBC Driver .................................. SKIPPED
[INFO] ASM (thirdparty) .................................. SKIPPED
[INFO] Tajo RESTful Container ............................ SKIPPED
[INFO] Tajo Core ......................................... SKIPPED
[INFO] Tajo RPC .......................................... SKIPPED
[INFO] Tajo Catalog Drivers Hive ......................... SKIPPED
[INFO] Tajo Catalog Drivers .............................. SKIPPED
[INFO] Tajo Catalog ...................................... SKIPPED
[INFO] Tajo Storage ...................................... SKIPPED
[INFO] Tajo Distribution ................................. SKIPPED
[INFO] ------------------------------------------------------------------------
[INFO] BUILD FAILURE
[INFO] ------------------------------------------------------------------------
[INFO] Total time: 02:32 min
[INFO] Finished at: 2015-04-18T05:59:49+00:00
[INFO] Final Memory: 72M/1210M
[INFO] ------------------------------------------------------------------------
[ERROR] Failed to execute goal org.apache.maven.plugins:maven-surefire-plugin:2.17:test (default-test) on project tajo-storage-hdfs: There are test failures.
[ERROR]
[ERROR] Please refer to <https://builds.apache.org/job/Tajo-master-CODEGEN-build/ws/tajo-storage/tajo-storage-hdfs/target/surefire-reports> for the individual test results.
[ERROR] -> [Help 1]
[ERROR]
[ERROR] To see the full stack trace of the errors, re-run Maven with the -e switch.
[ERROR] Re-run Maven using the -X switch to enable full debug logging.
[ERROR]
[ERROR] For more information about the errors and possible solutions, please read the following articles:
[ERROR] [Help 1] http://cwiki.apache.org/confluence/display/MAVEN/MojoFailureException
[ERROR]
[ERROR] After correcting the problems, you can resume the build with the command
[ERROR] mvn <goals> -rf :tajo-storage-hdfs
Build step 'Execute shell' marked build as failure
Updating TAJO-1564
Build failed in Jenkins: Tajo-master-CODEGEN-build #311
Posted by Apache Jenkins Server <je...@builds.apache.org>.
See <https://builds.apache.org/job/Tajo-master-CODEGEN-build/311/changes>
Changes:
[jihoonson] TAJO-1344: Python UDF support. (jihoon)
------------------------------------------
[...truncated 386542 lines...]
TestConditionalExpressions.testCoalesceBoolean:206->ExprTestBase.testSimpleEval:182->ExprTestBase.testEval:202->ExprTestBase.testEval:292 » AbstractMethod
TestMathFunctions.testRoundWithSpecifiedPrecision:452->ExprTestBase.testSimpleEval:182->ExprTestBase.testEval:202->ExprTestBase.testEval:292 » AbstractMethod
TestMathFunctions.testAbs:334->ExprTestBase.testSimpleEval:182->ExprTestBase.testEval:202->ExprTestBase.testEval:292 » AbstractMethod
TestMathFunctions.testCos:134->ExprTestBase.testSimpleEval:182->ExprTestBase.testEval:202->ExprTestBase.testEval:292 » AbstractMethod
TestMathFunctions.testDiv:247->ExprTestBase.testSimpleEval:182->ExprTestBase.testEval:202->ExprTestBase.testEval:292 » AbstractMethod
TestMathFunctions.testExp:313->ExprTestBase.testSimpleEval:182->ExprTestBase.testEval:202->ExprTestBase.testEval:292 » AbstractMethod
TestMathFunctions.testMod:231->ExprTestBase.testSimpleEval:182->ExprTestBase.testEval:202->ExprTestBase.testEval:292 » AbstractMethod
TestMathFunctions.testPow:397->ExprTestBase.testSimpleEval:182->ExprTestBase.testEval:202->ExprTestBase.testEval:292 » AbstractMethod
TestMathFunctions.testSin:117->ExprTestBase.testSimpleEval:182->ExprTestBase.testEval:202->ExprTestBase.testEval:292 » AbstractMethod
TestMathFunctions.testTan:150->ExprTestBase.testSimpleEval:182->ExprTestBase.testEval:202->ExprTestBase.testEval:292 » AbstractMethod
TestMathFunctions.testAtan2:214->ExprTestBase.testSimpleEval:182->ExprTestBase.testEval:202->ExprTestBase.testEval:292 » AbstractMethod
TestMathFunctions.testFloor:61->ExprTestBase.testSimpleEval:182->ExprTestBase.testEval:202->ExprTestBase.testEval:292 » AbstractMethod
TestMathFunctions.testRound:32->ExprTestBase.testSimpleEval:182->ExprTestBase.testEval:202->ExprTestBase.testEval:292 » AbstractMethod
TestMathFunctions.testAcos:182->ExprTestBase.testSimpleEval:182->ExprTestBase.testEval:202->ExprTestBase.testEval:292 » AbstractMethod
TestMathFunctions.testAsin:166->ExprTestBase.testSimpleEval:182->ExprTestBase.testEval:202->ExprTestBase.testEval:292 » AbstractMethod
TestMathFunctions.testAtan:198->ExprTestBase.testSimpleEval:182->ExprTestBase.testEval:202->ExprTestBase.testEval:292 » AbstractMethod
TestMathFunctions.testCbrt:355->ExprTestBase.testSimpleEval:182->ExprTestBase.testEval:202->ExprTestBase.testEval:292 » AbstractMethod
TestMathFunctions.testCeil:79->ExprTestBase.testSimpleEval:182->ExprTestBase.testEval:202->ExprTestBase.testEval:292 » AbstractMethod
TestMathFunctions.testSign:263->ExprTestBase.testSimpleEval:182->ExprTestBase.testEval:202->ExprTestBase.testEval:292 » AbstractMethod
TestMathFunctions.testSqrt:288->ExprTestBase.testSimpleEval:182->ExprTestBase.testEval:202->ExprTestBase.testEval:292 » AbstractMethod
TestMathFunctions.testPi:438->ExprTestBase.testSimpleEval:182->ExprTestBase.testEval:202->ExprTestBase.testEval:292 » AbstractMethod
TestMathFunctions.testCeiling:98->ExprTestBase.testSimpleEval:182->ExprTestBase.testEval:202->ExprTestBase.testEval:292 » AbstractMethod
TestMathFunctions.testRadians:418->ExprTestBase.testSimpleEval:182->ExprTestBase.testEval:202->ExprTestBase.testEval:292 » AbstractMethod
TestMathFunctions.testDegrees:377->ExprTestBase.testSimpleEval:182->ExprTestBase.testEval:202->ExprTestBase.testEval:292 » AbstractMethod
TestJsonFunctions.testJsonExtractPathText:32->ExprTestBase.testSimpleEval:182->ExprTestBase.testEval:202->ExprTestBase.testEval:292 » AbstractMethod
TestDateTimeFunctions.testDatePart:242->ExprTestBase.testEval:202->ExprTestBase.testEval:290 » Compilation
TestDateTimeFunctions.testExtract:125->ExprTestBase.testEval:202->ExprTestBase.testEval:290 » Compilation
TestDateTimeFunctions.testAddDays:398->ExprTestBase.testSimpleEval:182->ExprTestBase.testEval:202->ExprTestBase.testEval:292 » AbstractMethod
TestDateTimeFunctions.testToTimestamp:48->ExprTestBase.testSimpleEval:182->ExprTestBase.testEval:202->ExprTestBase.testEval:292 » AbstractMethod
TestDateTimeFunctions.testDateTimeNow:438->ExprTestBase.testSimpleEval:186->ExprTestBase.testEval:209->ExprTestBase.testEval:292 » AbstractMethod
TestDateTimeFunctions.testUtcUsecTo:349->ExprTestBase.testSimpleEval:182->ExprTestBase.testEval:202->ExprTestBase.testEval:292 » AbstractMethod
TestDateTimeFunctions.testTimeValueKeyword:467->ExprTestBase.testSimpleEval:186->ExprTestBase.testEval:209->ExprTestBase.testEval:292 » AbstractMethod
TestDateTimeFunctions.testAddMonths:367->ExprTestBase.testSimpleEval:182->ExprTestBase.testEval:202->ExprTestBase.testEval:292 » AbstractMethod
TestDateTimeFunctions.testToChar:109->ExprTestBase.testSimpleEval:182->ExprTestBase.testEval:202->ExprTestBase.testEval:292 » AbstractMethod
TestDateTimeFunctions.testToDate:358->ExprTestBase.testSimpleEval:182->ExprTestBase.testEval:202->ExprTestBase.testEval:292 » AbstractMethod
TestStringOperatorsAndFunctions.testRegexReplace:127->ExprTestBase.testSimpleEval:182->ExprTestBase.testEval:202->ExprTestBase.testEval:292 » AbstractMethod
TestStringOperatorsAndFunctions.testOctetLength:343->ExprTestBase.testSimpleEval:182->ExprTestBase.testEval:202->ExprTestBase.testEval:292 » AbstractMethod
TestStringOperatorsAndFunctions.testBin:329->ExprTestBase.testSimpleEval:182->ExprTestBase.testEval:202->ExprTestBase.testEval:292 » AbstractMethod
TestStringOperatorsAndFunctions.testChr:514->ExprTestBase.testSimpleEval:182->ExprTestBase.testEval:202->ExprTestBase.testEval:292 » AbstractMethod
TestStringOperatorsAndFunctions.testHex:314->ExprTestBase.testSimpleEval:182->ExprTestBase.testEval:202->ExprTestBase.testEval:292 » AbstractMethod
TestStringOperatorsAndFunctions.testMd5:287->ExprTestBase.testSimpleEval:182->ExprTestBase.testEval:202->ExprTestBase.testEval:292 » AbstractMethod
TestStringOperatorsAndFunctions.testAscii:501->ExprTestBase.testSimpleEval:182->ExprTestBase.testEval:202->ExprTestBase.testEval:292 » AbstractMethod
TestStringOperatorsAndFunctions.testLTrim:68->ExprTestBase.testSimpleEval:182->ExprTestBase.testEval:202->ExprTestBase.testEval:292 » AbstractMethod
TestStringOperatorsAndFunctions.testLower:250->ExprTestBase.testSimpleEval:182->ExprTestBase.testEval:202->ExprTestBase.testEval:292 » AbstractMethod
TestStringOperatorsAndFunctions.testRTrim:89->ExprTestBase.testSimpleEval:182->ExprTestBase.testEval:202->ExprTestBase.testEval:292 » AbstractMethod
TestStringOperatorsAndFunctions.testRight:181->ExprTestBase.testSimpleEval:182->ExprTestBase.testEval:202->ExprTestBase.testEval:292 » AbstractMethod
TestStringOperatorsAndFunctions.testUpper:237->ExprTestBase.testSimpleEval:182->ExprTestBase.testEval:202->ExprTestBase.testEval:292 » AbstractMethod
TestStringOperatorsAndFunctions.testLeft:152->ExprTestBase.testSimpleEval:182->ExprTestBase.testEval:202->ExprTestBase.testEval:292 » AbstractMethod
TestStringOperatorsAndFunctions.testLpad:528->ExprTestBase.testSimpleEval:182->ExprTestBase.testEval:202->ExprTestBase.testEval:292 » AbstractMethod
TestStringOperatorsAndFunctions.testRpad:538->ExprTestBase.testSimpleEval:182->ExprTestBase.testEval:202->ExprTestBase.testEval:292 » AbstractMethod
TestStringOperatorsAndFunctions.testTrim:110->ExprTestBase.testSimpleEval:182->ExprTestBase.testEval:202->ExprTestBase.testEval:292 » AbstractMethod
TestStringOperatorsAndFunctions.testConcat_ws:610->ExprTestBase.testSimpleEval:182->ExprTestBase.testEval:202->ExprTestBase.testEval:292 » AbstractMethod
TestStringOperatorsAndFunctions.testCharLength:263->ExprTestBase.testSimpleEval:182->ExprTestBase.testEval:202->ExprTestBase.testEval:292 » AbstractMethod
TestStringOperatorsAndFunctions.testBitLength:451->ExprTestBase.testSimpleEval:182->ExprTestBase.testEval:202->ExprTestBase.testEval:292 » AbstractMethod
TestStringOperatorsAndFunctions.testConcatenateOnExpressions:48->ExprTestBase.testSimpleEval:182->ExprTestBase.testEval:202->ExprTestBase.testEval:292 » AbstractMethod
TestStringOperatorsAndFunctions.testFunctionCallIngoreCases:56->ExprTestBase.testSimpleEval:182->ExprTestBase.testEval:202->ExprTestBase.testEval:292 » AbstractMethod
TestStringOperatorsAndFunctions.testQuote_ident:548->ExprTestBase.testSimpleEval:182->ExprTestBase.testEval:202->ExprTestBase.testEval:292 » AbstractMethod
TestStringOperatorsAndFunctions.testReverse:210->ExprTestBase.testSimpleEval:182->ExprTestBase.testEval:202->ExprTestBase.testEval:292 » AbstractMethod
TestStringOperatorsAndFunctions.testSplitPart:357->ExprTestBase.testSimpleEval:182->ExprTestBase.testEval:202->ExprTestBase.testEval:292 » AbstractMethod
TestStringOperatorsAndFunctions.testFindInSet:579->ExprTestBase.testSimpleEval:182->ExprTestBase.testEval:202->ExprTestBase.testEval:292 » AbstractMethod
TestStringOperatorsAndFunctions.testConcat:601->ExprTestBase.testSimpleEval:182->ExprTestBase.testEval:202->ExprTestBase.testEval:292 » AbstractMethod
TestStringOperatorsAndFunctions.testDecode:566->ExprTestBase.testSimpleEval:182->ExprTestBase.testEval:202->ExprTestBase.testEval:292 » AbstractMethod
TestStringOperatorsAndFunctions.testDigest:300->ExprTestBase.testSimpleEval:182->ExprTestBase.testEval:202->ExprTestBase.testEval:292 » AbstractMethod
TestStringOperatorsAndFunctions.testEncode:554->ExprTestBase.testSimpleEval:182->ExprTestBase.testEval:202->ExprTestBase.testEval:292 » AbstractMethod
TestStringOperatorsAndFunctions.testLength:275->ExprTestBase.testSimpleEval:182->ExprTestBase.testEval:202->ExprTestBase.testEval:292 » AbstractMethod
TestStringOperatorsAndFunctions.testLocate:403->ExprTestBase.testSimpleEval:182->ExprTestBase.testEval:202->ExprTestBase.testEval:292 » AbstractMethod
TestStringOperatorsAndFunctions.testInitcap:495->ExprTestBase.testSimpleEval:182->ExprTestBase.testEval:202->ExprTestBase.testEval:292 » AbstractMethod
TestStringOperatorsAndFunctions.testRepeat:223->ExprTestBase.testSimpleEval:182->ExprTestBase.testEval:202->ExprTestBase.testEval:292 » AbstractMethod
TestStringOperatorsAndFunctions.testStrpos:463->ExprTestBase.testSimpleEval:182->ExprTestBase.testEval:202->ExprTestBase.testEval:292 » AbstractMethod
TestStringOperatorsAndFunctions.testSubstr:376->ExprTestBase.testSimpleEval:182->ExprTestBase.testEval:202->ExprTestBase.testEval:292 » AbstractMethod
TestStringOperatorsAndFunctions.testConcatenateOnLiteral:35->ExprTestBase.testSimpleEval:182->ExprTestBase.testEval:202->ExprTestBase.testEval:292 » AbstractMethod
TestStringOperatorsAndFunctions.testStrposb:479->ExprTestBase.testSimpleEval:182->ExprTestBase.testEval:202->ExprTestBase.testEval:292 » AbstractMethod
TestJoinBroadcast.testMultiplePartitionedBroadcastDataFileWithZeroLength:770 » Service
TestInsertQuery.testInsertOverwriteWithUnion:727->QueryTestCaseBase.executeFile:424 » Service
TestInsertQuery.testInsertOverwriteWithUnionDifferentAlias:755->QueryTestCaseBase.executeFile:424 » Service
TestInsertQuery.testInsertOverwriteWithDatabase:615->QueryTestCaseBase.executeFile:424 » Service
TestInsertQuery.testInsertInto:69->QueryTestCaseBase.executeFile:424 » Service
TestInsertQuery.testInsertOverwriteSmallerColumns:304->QueryTestCaseBase.executeFile:424 » Service
TestInsertQuery.testInsertOverwrite:49->QueryTestCaseBase.executeFile:424 » Service
TestInsertQuery.testInsertOverwriteIntoParquet:546->QueryTestCaseBase.executeString:323 » Service
TestSelectQuery.testDatabaseRef:406->QueryTestCaseBase.executeFile:424 » Service
TestGroupByQuery.testGroupByWithNullData6:627->QueryTestCaseBase.executeString:323 » Service
TestGroupByQuery.testGroupByWithNullData7:639->QueryTestCaseBase.executeString:323 » Service
TestGroupByQuery.testGroupByWithNullData8:651->QueryTestCaseBase.executeString:323 » Service
TestGroupByQuery.testGroupByWithNullData9:663->QueryTestCaseBase.executeString:323 » Service
TestGroupByQuery.testDistinctAggregationCasebyCase11:435 » Service java.sql.SQ...
TestGroupByQuery.testGroupByWithNullData5:615->QueryTestCaseBase.executeString:323 » Service
TestGroupByQuery.testGroupByWithNullData6:627->QueryTestCaseBase.executeString:323 » Service
TestGroupByQuery.testGroupByWithNullData7:639->QueryTestCaseBase.executeString:323 » Service
TestGroupByQuery.testGroupByWithNullData8:651->QueryTestCaseBase.executeString:323 » Service
TestGroupByQuery.testGroupByWithNullData9:663->QueryTestCaseBase.executeString:323 » Service
TestGroupByQuery.testDistinctAggregationCaseByCase3:497 » Service java.sql.SQL...
TestGroupByQuery.testDistinctAggregationCaseByCase4:526 » Service java.sql.SQL...
TestGroupByQuery.testNumShufflePartition:724 » Service java.sql.SQLException: ...
TestGroupByQuery.testDistinctAggregationCasebyCase11:435 » Service java.sql.SQ...
TestJoinQuery.testLeftOuterJoinWithEmptySubquery1:479 » Service java.sql.SQLEx...
TestJoinQuery.testLeftOuterJoinWithEmptySubquery2:521 » Service java.sql.SQLEx...
TestJoinQuery.testRightOuterJoinPredicationCaseByCase1:886->createOuterJoinTestTable:1010 » Service
TestJoinQuery.testRightOuterJoinPredicationCaseByCase2:916->createOuterJoinTestTable:1010 » Service
TestJoinQuery.testRightOuterJoinPredicationCaseByCase3:944->createOuterJoinTestTable:1010 » Service
TestJoinQuery.testLeftOuterJoinPredicationCaseByCase1:652->createOuterJoinTestTable:1010 » Service
TestJoinQuery.testLeftOuterJoinPredicationCaseByCase2:680->createOuterJoinTestTable:1010 » Service
TestJoinQuery.testLeftOuterJoinPredicationCaseByCase3:741->createOuterJoinTestTable:1010 » Service
TestJoinQuery.testLeftOuterJoinPredicationCaseByCase4:771->createOuterJoinTestTable:1010 » Service
TestJoinQuery.testLeftOuterJoinPredicationCaseByCase5:801->createOuterJoinTestTable:1010 » Service
TestJoinQuery.testLeftOuterJoinPredicationCaseByCase6:831->createOuterJoinTestTable:1010 » Service
TestJoinQuery.testLeftOuterWithEmptyTable:860->createOuterJoinTestTable:1010 » Service
TestJoinQuery.testFullOuterJoinPredicationCaseByCase1:971->createOuterJoinTestTable:1010 » Service
TestJoinQuery.testJoinOnMultipleDatabases:564->QueryTestCaseBase.executeString:323 » Service
TestJoinQuery.testJoinOnMultipleDatabasesWithJson:607->QueryTestCaseBase.executeString:323 » Service
TestJoinQuery.testLeftOuterJoinPredicationCaseByCase2_1:709->createOuterJoinTestTable:1010 » Service
TestJoinQuery.testLeftOuterJoinWithEmptySubquery1:479 » Service java.sql.SQLEx...
TestJoinQuery.testLeftOuterJoinWithEmptySubquery2:521 » Service java.sql.SQLEx...
TestJoinQuery.testRightOuterJoinPredicationCaseByCase1:886->createOuterJoinTestTable:1010 » Service
TestJoinQuery.testRightOuterJoinPredicationCaseByCase2:916->createOuterJoinTestTable:1010 » Service
TestJoinQuery.testRightOuterJoinPredicationCaseByCase3:944->createOuterJoinTestTable:1010 » Service
TestJoinQuery.testLeftOuterJoinPredicationCaseByCase1:652->createOuterJoinTestTable:1010 » Service
TestJoinQuery.testLeftOuterJoinPredicationCaseByCase2:680->createOuterJoinTestTable:1010 » Service
TestJoinQuery.testLeftOuterJoinPredicationCaseByCase3:741->createOuterJoinTestTable:1010 » Service
TestJoinQuery.testLeftOuterJoinPredicationCaseByCase4:771->createOuterJoinTestTable:1010 » Service
TestJoinQuery.testLeftOuterJoinPredicationCaseByCase5:801->createOuterJoinTestTable:1010 » Service
TestJoinQuery.testLeftOuterJoinPredicationCaseByCase6:831->createOuterJoinTestTable:1010 » Service
TestJoinQuery.testLeftOuterWithEmptyTable:860->createOuterJoinTestTable:1010 » Service
TestJoinQuery.testFullOuterJoinPredicationCaseByCase1:971->createOuterJoinTestTable:1010 » Service
TestJoinQuery.testJoinOnMultipleDatabases:564->QueryTestCaseBase.executeString:323 » Service
TestJoinQuery.testJoinOnMultipleDatabasesWithJson:607->QueryTestCaseBase.executeString:323 » Service
TestJoinQuery.testLeftOuterJoinPredicationCaseByCase2_1:709->createOuterJoinTestTable:1010 » Service
TestJoinQuery.testLeftOuterJoinWithEmptySubquery1:479 » Service java.sql.SQLEx...
TestJoinQuery.testLeftOuterJoinWithEmptySubquery2:521 » Service java.sql.SQLEx...
TestJoinQuery.testRightOuterJoinPredicationCaseByCase1:886->createOuterJoinTestTable:1010 » Service
TestJoinQuery.testRightOuterJoinPredicationCaseByCase2:916->createOuterJoinTestTable:1010 » Service
TestJoinQuery.testRightOuterJoinPredicationCaseByCase3:944->createOuterJoinTestTable:1010 » Service
TestJoinQuery.testLeftOuterJoinPredicationCaseByCase1:652->createOuterJoinTestTable:1010 » Service
TestJoinQuery.testLeftOuterJoinPredicationCaseByCase2:680->createOuterJoinTestTable:1010 » Service
TestJoinQuery.testLeftOuterJoinPredicationCaseByCase3:741->createOuterJoinTestTable:1010 » Service
TestJoinQuery.testLeftOuterJoinPredicationCaseByCase4:771->createOuterJoinTestTable:1010 » Service
TestJoinQuery.testLeftOuterJoinPredicationCaseByCase5:801->createOuterJoinTestTable:1010 » Service
TestJoinQuery.testLeftOuterJoinPredicationCaseByCase6:831->createOuterJoinTestTable:1010 » Service
TestJoinQuery.testLeftOuterWithEmptyTable:860->createOuterJoinTestTable:1010 » Service
TestJoinQuery.testFullOuterJoinPredicationCaseByCase1:971->createOuterJoinTestTable:1010 » Service
TestJoinQuery.testJoinOnMultipleDatabases:564->QueryTestCaseBase.executeString:323 » Service
TestJoinQuery.testJoinOnMultipleDatabasesWithJson:607->QueryTestCaseBase.executeString:323 » Service
TestJoinQuery.testLeftOuterJoinPredicationCaseByCase2_1:709->createOuterJoinTestTable:1010 » Service
TestJoinQuery.testLeftOuterJoinWithEmptySubquery1:479 » Service java.sql.SQLEx...
TestJoinQuery.testLeftOuterJoinWithEmptySubquery2:521 » Service java.sql.SQLEx...
TestJoinQuery.testRightOuterJoinPredicationCaseByCase1:886->createOuterJoinTestTable:1010 » Service
TestJoinQuery.testRightOuterJoinPredicationCaseByCase2:916->createOuterJoinTestTable:1010 » Service
TestJoinQuery.testRightOuterJoinPredicationCaseByCase3:944->createOuterJoinTestTable:1010 » Service
TestJoinQuery.testLeftOuterJoinPredicationCaseByCase1:652->createOuterJoinTestTable:1010 » Service
TestJoinQuery.testLeftOuterJoinPredicationCaseByCase2:680->createOuterJoinTestTable:1010 » Service
TestJoinQuery.testLeftOuterJoinPredicationCaseByCase3:741->createOuterJoinTestTable:1010 » Service
TestJoinQuery.testLeftOuterJoinPredicationCaseByCase4:771->createOuterJoinTestTable:1010 » Service
TestJoinQuery.testLeftOuterJoinPredicationCaseByCase5:801->createOuterJoinTestTable:1010 » Service
TestJoinQuery.testLeftOuterJoinPredicationCaseByCase6:831->createOuterJoinTestTable:1010 » Service
TestJoinQuery.testLeftOuterWithEmptyTable:860->createOuterJoinTestTable:1010 » Service
TestJoinQuery.testFullOuterJoinPredicationCaseByCase1:971->createOuterJoinTestTable:1010 » Service
TestJoinQuery.testJoinOnMultipleDatabases:564->QueryTestCaseBase.executeString:323 » Service
TestJoinQuery.testJoinOnMultipleDatabasesWithJson:607->QueryTestCaseBase.executeString:323 » Service
TestJoinQuery.testLeftOuterJoinPredicationCaseByCase2_1:709->createOuterJoinTestTable:1010 » Service
TestCaseByCases.testTAJO1224Case1:179->QueryTestCaseBase.executeQuery:333->QueryTestCaseBase.executeFile:424 » Service
TestHBaseTable.testJoin:601->QueryTestCaseBase.executeString:323 » Service HBa...
TestHBaseTable.testInsertIntoLocation:1256->QueryTestCaseBase.executeString:323 » Service
TestHBaseTable.testNonForwardQuery:561->QueryTestCaseBase.executeString:323 » Service
TestHBaseTable.testInsertInto:643->QueryTestCaseBase.executeString:323 » Service
TestHBaseTable.testInsertIntoDifferentType:1068->QueryTestCaseBase.executeString:323 » Service
TestHBaseTable.testInsertIntoMultiRegionWithSplitFile:802->QueryTestCaseBase.executeString:323 » Service
TestHBaseTable.testInsertIntoMultiRegion:685->QueryTestCaseBase.executeString:323 » Service
TestHBaseTable.testInsertIntoMultiRegionMultiRowFields:860->QueryTestCaseBase.executeString:323 » Service
TestHBaseTable.testInsertIntoMultiRegion2:743->QueryTestCaseBase.executeString:323 » Service
TestHBaseTable.testInsertIntoUsingPut:1207->QueryTestCaseBase.executeString:323 » Service
TestHBaseTable.testCreateHBaseTable:112->QueryTestCaseBase.executeString:323 » Service
TestHBaseTable.testInsertIntoRowField:1105->QueryTestCaseBase.executeString:323 » Service
TestCTASQuery.testCtasWithGroupby:149->QueryTestCaseBase.executeQuery:333->QueryTestCaseBase.executeFile:424 » Service
TestCTASQuery.testCtasWithTextFile:231->QueryTestCaseBase.executeQuery:333->QueryTestCaseBase.executeFile:424 » Service
TestCTASQuery.testCtasWithLimit:169->QueryTestCaseBase.executeQuery:333->QueryTestCaseBase.executeFile:424 » Service
TestCTASQuery.testCtasWithUnion:179->QueryTestCaseBase.executeQuery:333->QueryTestCaseBase.executeFile:424 » Service
TestCTASQuery.testCtasWithOptions:245->QueryTestCaseBase.executeQuery:333->QueryTestCaseBase.executeFile:424 » Service
TestCTASQuery.testCtasWithStoreType:217->QueryTestCaseBase.executeQuery:333->QueryTestCaseBase.executeFile:424 » Service
TestCTASQuery.testCtasWithOrderby:159->QueryTestCaseBase.executeQuery:333->QueryTestCaseBase.executeFile:424 » Service
TestCTASQuery.testCtasWithMultipleUnions:189->QueryTestCaseBase.executeQuery:333->QueryTestCaseBase.executeFile:424 » Service
TestTruncateTable.testTruncateTable:64->QueryTestCaseBase.executeString:323 » Service
TestEvalCodeGenerator.testGetField:57->ExprTestBase.testEval:202->ExprTestBase.testEval:292 » AbstractMethod
TestEvalCodeGenerator.testComparison:112->ExprTestBase.testSimpleEval:182->ExprTestBase.testEval:202->ExprTestBase.testEval:292 » AbstractMethod
TestEvalCodeGenerator.testArithmetic:48->ExprTestBase.testEval:202->ExprTestBase.testEval:292 » AbstractMethod
TestEvalCodeGenerator.testAndOr:270->ExprTestBase.testSimpleEval:182->ExprTestBase.testEval:202->ExprTestBase.testEval:292 » AbstractMethod
TestEvalCodeGenerator.testUnary:246->ExprTestBase.testEval:202->ExprTestBase.testEval:292 » AbstractMethod
TestEvalCodeGenerator.testBetweenSymmetric:201->ExprTestBase.testEval:202->ExprTestBase.testEval:292 » AbstractMethod
TestEvalCodeGenerator.testStringConcat:302->ExprTestBase.testSimpleEval:182->ExprTestBase.testEval:202->ExprTestBase.testEval:292 » AbstractMethod
TestEvalCodeGenerator.testBetweenAsymmetric:167->ExprTestBase.testEval:202->ExprTestBase.testEval:292 » AbstractMethod
TestEvalCodeGenerator.testNullHandling:81->ExprTestBase.testEval:202->ExprTestBase.testEval:292 » AbstractMethod
TestEvalCodeGenerator.testFunction:293->ExprTestBase.testEval:202->ExprTestBase.testEval:292 » AbstractMethod
TestTajoClient.testGetQueryStatusAndResultAfterFinish:668 » SQL com.google.pro...
TestTajoClient.testGetQueryInfoAndHistory:748 » test timed out after 30000 mi...
TestTajoClient.testNullCharSessionInCTAS:697 » Service java.sql.SQLException: ...
Tests run: 1457, Failures: 666, Errors: 251, Skipped: 0
[INFO] ------------------------------------------------------------------------
[INFO] Reactor Summary:
[INFO]
[INFO] Tajo Main ......................................... SUCCESS [ 1.625 s]
[INFO] Tajo Project POM .................................. SUCCESS [ 1.182 s]
[INFO] Tajo Maven Plugins ................................ SUCCESS [ 3.153 s]
[INFO] Tajo Common ....................................... SUCCESS [ 24.666 s]
[INFO] Tajo Algebra ...................................... SUCCESS [ 1.338 s]
[INFO] Tajo Catalog Common ............................... SUCCESS [ 6.777 s]
[INFO] Tajo Plan ......................................... SUCCESS [ 5.905 s]
[INFO] Tajo Rpc Common ................................... SUCCESS [ 0.506 s]
[INFO] Tajo Protocol Buffer Rpc .......................... SUCCESS [ 34.392 s]
[INFO] Tajo Catalog Client ............................... SUCCESS [ 1.024 s]
[INFO] Tajo Catalog Server ............................... SUCCESS [ 9.805 s]
[INFO] Tajo Storage Common ............................... SUCCESS [ 11.214 s]
[INFO] Tajo HDFS Storage ................................. SUCCESS [ 54.251 s]
[INFO] Tajo HBase Storage ................................ SUCCESS [ 3.364 s]
[INFO] Tajo PullServer ................................... SUCCESS [ 0.935 s]
[INFO] Tajo Client ....................................... SUCCESS [ 2.880 s]
[INFO] Tajo CLI tools .................................... SUCCESS [ 0.670 s]
[INFO] Tajo JDBC Driver .................................. SUCCESS [ 3.041 s]
[INFO] ASM (thirdparty) .................................. SUCCESS [ 0.547 s]
[INFO] Tajo RESTful Container ............................ SUCCESS [ 3.362 s]
[INFO] Tajo Core ......................................... FAILURE [15:27 min]
[INFO] Tajo RPC .......................................... SKIPPED
[INFO] Tajo Catalog Drivers Hive ......................... SKIPPED
[INFO] Tajo Catalog Drivers .............................. SKIPPED
[INFO] Tajo Catalog ...................................... SKIPPED
[INFO] Tajo Storage ...................................... SKIPPED
[INFO] Tajo Distribution ................................. SKIPPED
[INFO] ------------------------------------------------------------------------
[INFO] BUILD FAILURE
[INFO] ------------------------------------------------------------------------
[INFO] Total time: 18:18 min
[INFO] Finished at: 2015-04-18T03:16:34+00:00
[INFO] Final Memory: 98M/1011M
[INFO] ------------------------------------------------------------------------
[ERROR] Failed to execute goal org.apache.maven.plugins:maven-surefire-plugin:2.17:test (default-test) on project tajo-core: There are test failures.
[ERROR]
[ERROR] Please refer to <https://builds.apache.org/job/Tajo-master-CODEGEN-build/ws/tajo-core/target/surefire-reports> for the individual test results.
[ERROR] -> [Help 1]
[ERROR]
[ERROR] To see the full stack trace of the errors, re-run Maven with the -e switch.
[ERROR] Re-run Maven using the -X switch to enable full debug logging.
[ERROR]
[ERROR] For more information about the errors and possible solutions, please read the following articles:
[ERROR] [Help 1] http://cwiki.apache.org/confluence/display/MAVEN/MojoFailureException
[ERROR]
[ERROR] After correcting the problems, you can resume the build with the command
[ERROR] mvn <goals> -rf :tajo-core
Build step 'Execute shell' marked build as failure
Updating TAJO-1344
Build failed in Jenkins: Tajo-master-CODEGEN-build #310
Posted by Apache Jenkins Server <je...@builds.apache.org>.
See <https://builds.apache.org/job/Tajo-master-CODEGEN-build/310/changes>
Changes:
[jihoonson] TAJO-923: Add VAR_SAMP and VAR_POP window functions.
------------------------------------------
[...truncated 345416 lines...]
TestConditionalExpressions.testCoalesceBoolean:206->ExprTestBase.testSimpleEval:176->ExprTestBase.testEval:196->ExprTestBase.testEval:284 » AbstractMethod
TestMathFunctions.testRoundWithSpecifiedPrecision:452->ExprTestBase.testSimpleEval:176->ExprTestBase.testEval:196->ExprTestBase.testEval:284 » AbstractMethod
TestMathFunctions.testAbs:334->ExprTestBase.testSimpleEval:176->ExprTestBase.testEval:196->ExprTestBase.testEval:284 » AbstractMethod
TestMathFunctions.testCos:134->ExprTestBase.testSimpleEval:176->ExprTestBase.testEval:196->ExprTestBase.testEval:284 » AbstractMethod
TestMathFunctions.testDiv:247->ExprTestBase.testSimpleEval:176->ExprTestBase.testEval:196->ExprTestBase.testEval:284 » AbstractMethod
TestMathFunctions.testExp:313->ExprTestBase.testSimpleEval:176->ExprTestBase.testEval:196->ExprTestBase.testEval:284 » AbstractMethod
TestMathFunctions.testMod:231->ExprTestBase.testSimpleEval:176->ExprTestBase.testEval:196->ExprTestBase.testEval:284 » AbstractMethod
TestMathFunctions.testPow:397->ExprTestBase.testSimpleEval:176->ExprTestBase.testEval:196->ExprTestBase.testEval:284 » AbstractMethod
TestMathFunctions.testSin:117->ExprTestBase.testSimpleEval:176->ExprTestBase.testEval:196->ExprTestBase.testEval:284 » AbstractMethod
TestMathFunctions.testTan:150->ExprTestBase.testSimpleEval:176->ExprTestBase.testEval:196->ExprTestBase.testEval:284 » AbstractMethod
TestMathFunctions.testAtan2:214->ExprTestBase.testSimpleEval:176->ExprTestBase.testEval:196->ExprTestBase.testEval:284 » AbstractMethod
TestMathFunctions.testFloor:61->ExprTestBase.testSimpleEval:176->ExprTestBase.testEval:196->ExprTestBase.testEval:284 » AbstractMethod
TestMathFunctions.testRound:32->ExprTestBase.testSimpleEval:176->ExprTestBase.testEval:196->ExprTestBase.testEval:284 » AbstractMethod
TestMathFunctions.testAcos:182->ExprTestBase.testSimpleEval:176->ExprTestBase.testEval:196->ExprTestBase.testEval:284 » AbstractMethod
TestMathFunctions.testAsin:166->ExprTestBase.testSimpleEval:176->ExprTestBase.testEval:196->ExprTestBase.testEval:284 » AbstractMethod
TestMathFunctions.testAtan:198->ExprTestBase.testSimpleEval:176->ExprTestBase.testEval:196->ExprTestBase.testEval:284 » AbstractMethod
TestMathFunctions.testCbrt:355->ExprTestBase.testSimpleEval:176->ExprTestBase.testEval:196->ExprTestBase.testEval:284 » AbstractMethod
TestMathFunctions.testCeil:79->ExprTestBase.testSimpleEval:176->ExprTestBase.testEval:196->ExprTestBase.testEval:284 » AbstractMethod
TestMathFunctions.testSign:263->ExprTestBase.testSimpleEval:176->ExprTestBase.testEval:196->ExprTestBase.testEval:284 » AbstractMethod
TestMathFunctions.testSqrt:288->ExprTestBase.testSimpleEval:176->ExprTestBase.testEval:196->ExprTestBase.testEval:284 » AbstractMethod
TestMathFunctions.testPi:438->ExprTestBase.testSimpleEval:176->ExprTestBase.testEval:196->ExprTestBase.testEval:284 » AbstractMethod
TestMathFunctions.testCeiling:98->ExprTestBase.testSimpleEval:176->ExprTestBase.testEval:196->ExprTestBase.testEval:284 » AbstractMethod
TestMathFunctions.testRadians:418->ExprTestBase.testSimpleEval:176->ExprTestBase.testEval:196->ExprTestBase.testEval:284 » AbstractMethod
TestMathFunctions.testDegrees:377->ExprTestBase.testSimpleEval:176->ExprTestBase.testEval:196->ExprTestBase.testEval:284 » AbstractMethod
TestJsonFunctions.testJsonExtractPathText:32->ExprTestBase.testSimpleEval:176->ExprTestBase.testEval:196->ExprTestBase.testEval:284 » AbstractMethod
TestDateTimeFunctions.testDatePart:242->ExprTestBase.testEval:196->ExprTestBase.testEval:282 » Compilation
TestDateTimeFunctions.testExtract:125->ExprTestBase.testEval:196->ExprTestBase.testEval:282 » Compilation
TestDateTimeFunctions.testAddDays:398->ExprTestBase.testSimpleEval:176->ExprTestBase.testEval:196->ExprTestBase.testEval:284 » AbstractMethod
TestDateTimeFunctions.testToTimestamp:48->ExprTestBase.testSimpleEval:176->ExprTestBase.testEval:196->ExprTestBase.testEval:284 » AbstractMethod
TestDateTimeFunctions.testDateTimeNow:438->ExprTestBase.testSimpleEval:180->ExprTestBase.testEval:203->ExprTestBase.testEval:284 » AbstractMethod
TestDateTimeFunctions.testUtcUsecTo:349->ExprTestBase.testSimpleEval:176->ExprTestBase.testEval:196->ExprTestBase.testEval:284 » AbstractMethod
TestDateTimeFunctions.testTimeValueKeyword:467->ExprTestBase.testSimpleEval:180->ExprTestBase.testEval:203->ExprTestBase.testEval:284 » AbstractMethod
TestDateTimeFunctions.testAddMonths:367->ExprTestBase.testSimpleEval:176->ExprTestBase.testEval:196->ExprTestBase.testEval:284 » AbstractMethod
TestDateTimeFunctions.testToChar:109->ExprTestBase.testSimpleEval:176->ExprTestBase.testEval:196->ExprTestBase.testEval:284 » AbstractMethod
TestDateTimeFunctions.testToDate:358->ExprTestBase.testSimpleEval:176->ExprTestBase.testEval:196->ExprTestBase.testEval:284 » AbstractMethod
TestStringOperatorsAndFunctions.testRegexReplace:127->ExprTestBase.testSimpleEval:176->ExprTestBase.testEval:196->ExprTestBase.testEval:284 » AbstractMethod
TestStringOperatorsAndFunctions.testOctetLength:343->ExprTestBase.testSimpleEval:176->ExprTestBase.testEval:196->ExprTestBase.testEval:284 » AbstractMethod
TestStringOperatorsAndFunctions.testBin:329->ExprTestBase.testSimpleEval:176->ExprTestBase.testEval:196->ExprTestBase.testEval:284 » AbstractMethod
TestStringOperatorsAndFunctions.testChr:514->ExprTestBase.testSimpleEval:176->ExprTestBase.testEval:196->ExprTestBase.testEval:284 » AbstractMethod
TestStringOperatorsAndFunctions.testHex:314->ExprTestBase.testSimpleEval:176->ExprTestBase.testEval:196->ExprTestBase.testEval:284 » AbstractMethod
TestStringOperatorsAndFunctions.testMd5:287->ExprTestBase.testSimpleEval:176->ExprTestBase.testEval:196->ExprTestBase.testEval:284 » AbstractMethod
TestStringOperatorsAndFunctions.testAscii:501->ExprTestBase.testSimpleEval:176->ExprTestBase.testEval:196->ExprTestBase.testEval:284 » AbstractMethod
TestStringOperatorsAndFunctions.testLTrim:68->ExprTestBase.testSimpleEval:176->ExprTestBase.testEval:196->ExprTestBase.testEval:284 » AbstractMethod
TestStringOperatorsAndFunctions.testLower:250->ExprTestBase.testSimpleEval:176->ExprTestBase.testEval:196->ExprTestBase.testEval:284 » AbstractMethod
TestStringOperatorsAndFunctions.testRTrim:89->ExprTestBase.testSimpleEval:176->ExprTestBase.testEval:196->ExprTestBase.testEval:284 » AbstractMethod
TestStringOperatorsAndFunctions.testRight:181->ExprTestBase.testSimpleEval:176->ExprTestBase.testEval:196->ExprTestBase.testEval:284 » AbstractMethod
TestStringOperatorsAndFunctions.testUpper:237->ExprTestBase.testSimpleEval:176->ExprTestBase.testEval:196->ExprTestBase.testEval:284 » AbstractMethod
TestStringOperatorsAndFunctions.testLeft:152->ExprTestBase.testSimpleEval:176->ExprTestBase.testEval:196->ExprTestBase.testEval:284 » AbstractMethod
TestStringOperatorsAndFunctions.testLpad:528->ExprTestBase.testSimpleEval:176->ExprTestBase.testEval:196->ExprTestBase.testEval:284 » AbstractMethod
TestStringOperatorsAndFunctions.testRpad:538->ExprTestBase.testSimpleEval:176->ExprTestBase.testEval:196->ExprTestBase.testEval:284 » AbstractMethod
TestStringOperatorsAndFunctions.testTrim:110->ExprTestBase.testSimpleEval:176->ExprTestBase.testEval:196->ExprTestBase.testEval:284 » AbstractMethod
TestStringOperatorsAndFunctions.testConcat_ws:610->ExprTestBase.testSimpleEval:176->ExprTestBase.testEval:196->ExprTestBase.testEval:284 » AbstractMethod
TestStringOperatorsAndFunctions.testCharLength:263->ExprTestBase.testSimpleEval:176->ExprTestBase.testEval:196->ExprTestBase.testEval:284 » AbstractMethod
TestStringOperatorsAndFunctions.testBitLength:451->ExprTestBase.testSimpleEval:176->ExprTestBase.testEval:196->ExprTestBase.testEval:284 » AbstractMethod
TestStringOperatorsAndFunctions.testConcatenateOnExpressions:48->ExprTestBase.testSimpleEval:176->ExprTestBase.testEval:196->ExprTestBase.testEval:284 » AbstractMethod
TestStringOperatorsAndFunctions.testFunctionCallIngoreCases:56->ExprTestBase.testSimpleEval:176->ExprTestBase.testEval:196->ExprTestBase.testEval:284 » AbstractMethod
TestStringOperatorsAndFunctions.testQuote_ident:548->ExprTestBase.testSimpleEval:176->ExprTestBase.testEval:196->ExprTestBase.testEval:284 » AbstractMethod
TestStringOperatorsAndFunctions.testReverse:210->ExprTestBase.testSimpleEval:176->ExprTestBase.testEval:196->ExprTestBase.testEval:284 » AbstractMethod
TestStringOperatorsAndFunctions.testSplitPart:357->ExprTestBase.testSimpleEval:176->ExprTestBase.testEval:196->ExprTestBase.testEval:284 » AbstractMethod
TestStringOperatorsAndFunctions.testFindInSet:579->ExprTestBase.testSimpleEval:176->ExprTestBase.testEval:196->ExprTestBase.testEval:284 » AbstractMethod
TestStringOperatorsAndFunctions.testConcat:601->ExprTestBase.testSimpleEval:176->ExprTestBase.testEval:196->ExprTestBase.testEval:284 » AbstractMethod
TestStringOperatorsAndFunctions.testDecode:566->ExprTestBase.testSimpleEval:176->ExprTestBase.testEval:196->ExprTestBase.testEval:284 » AbstractMethod
TestStringOperatorsAndFunctions.testDigest:300->ExprTestBase.testSimpleEval:176->ExprTestBase.testEval:196->ExprTestBase.testEval:284 » AbstractMethod
TestStringOperatorsAndFunctions.testEncode:554->ExprTestBase.testSimpleEval:176->ExprTestBase.testEval:196->ExprTestBase.testEval:284 » AbstractMethod
TestStringOperatorsAndFunctions.testLength:275->ExprTestBase.testSimpleEval:176->ExprTestBase.testEval:196->ExprTestBase.testEval:284 » AbstractMethod
TestStringOperatorsAndFunctions.testLocate:403->ExprTestBase.testSimpleEval:176->ExprTestBase.testEval:196->ExprTestBase.testEval:284 » AbstractMethod
TestStringOperatorsAndFunctions.testInitcap:495->ExprTestBase.testSimpleEval:176->ExprTestBase.testEval:196->ExprTestBase.testEval:284 » AbstractMethod
TestStringOperatorsAndFunctions.testRepeat:223->ExprTestBase.testSimpleEval:176->ExprTestBase.testEval:196->ExprTestBase.testEval:284 » AbstractMethod
TestStringOperatorsAndFunctions.testStrpos:463->ExprTestBase.testSimpleEval:176->ExprTestBase.testEval:196->ExprTestBase.testEval:284 » AbstractMethod
TestStringOperatorsAndFunctions.testSubstr:376->ExprTestBase.testSimpleEval:176->ExprTestBase.testEval:196->ExprTestBase.testEval:284 » AbstractMethod
TestStringOperatorsAndFunctions.testConcatenateOnLiteral:35->ExprTestBase.testSimpleEval:176->ExprTestBase.testEval:196->ExprTestBase.testEval:284 » AbstractMethod
TestStringOperatorsAndFunctions.testStrposb:479->ExprTestBase.testSimpleEval:176->ExprTestBase.testEval:196->ExprTestBase.testEval:284 » AbstractMethod
TestJoinBroadcast.testMultiplePartitionedBroadcastDataFileWithZeroLength:770 » Service
TestInsertQuery.testInsertOverwriteWithUnion:727->QueryTestCaseBase.executeFile:424 » Service
TestInsertQuery.testInsertOverwriteWithUnionDifferentAlias:755->QueryTestCaseBase.executeFile:424 » Service
TestInsertQuery.testInsertOverwriteWithDatabase:615->QueryTestCaseBase.executeFile:424 » Service
TestInsertQuery.testInsertInto:69->QueryTestCaseBase.executeFile:424 » Service
TestInsertQuery.testInsertOverwriteSmallerColumns:304->QueryTestCaseBase.executeFile:424 » Service
TestInsertQuery.testInsertOverwrite:49->QueryTestCaseBase.executeFile:424 » Service
TestInsertQuery.testInsertOverwriteIntoParquet:546->QueryTestCaseBase.executeString:323 » Service
TestSelectQuery.testDatabaseRef:406->QueryTestCaseBase.executeFile:424 » Service
TestGroupByQuery.testGroupByWithNullData6:627->QueryTestCaseBase.executeString:323 » Service
TestGroupByQuery.testGroupByWithNullData7:639->QueryTestCaseBase.executeString:323 » Service
TestGroupByQuery.testGroupByWithNullData8:651->QueryTestCaseBase.executeString:323 » Service
TestGroupByQuery.testGroupByWithNullData9:663->QueryTestCaseBase.executeString:323 » Service
TestGroupByQuery.testDistinctAggregationCasebyCase11:435 » Service java.sql.SQ...
TestGroupByQuery.testGroupByWithNullData5:615->QueryTestCaseBase.executeString:323 » Service
TestGroupByQuery.testGroupByWithNullData6:627->QueryTestCaseBase.executeString:323 » Service
TestGroupByQuery.testGroupByWithNullData7:639->QueryTestCaseBase.executeString:323 » Service
TestGroupByQuery.testGroupByWithNullData8:651->QueryTestCaseBase.executeString:323 » Service
TestGroupByQuery.testGroupByWithNullData9:663->QueryTestCaseBase.executeString:323 » Service
TestGroupByQuery.testDistinctAggregationCaseByCase3:497 » Service java.sql.SQL...
TestGroupByQuery.testDistinctAggregationCaseByCase4:526 » Service java.sql.SQL...
TestGroupByQuery.testNumShufflePartition:724 » Service java.sql.SQLException: ...
TestGroupByQuery.testDistinctAggregationCasebyCase11:435 » Service java.sql.SQ...
TestJoinQuery.testLeftOuterJoinWithEmptySubquery1:479 » Service java.sql.SQLEx...
TestJoinQuery.testLeftOuterJoinWithEmptySubquery2:521 » Service java.sql.SQLEx...
TestJoinQuery.testRightOuterJoinPredicationCaseByCase1:886->createOuterJoinTestTable:1010 » Service
TestJoinQuery.testRightOuterJoinPredicationCaseByCase2:916->createOuterJoinTestTable:1010 » Service
TestJoinQuery.testRightOuterJoinPredicationCaseByCase3:944->createOuterJoinTestTable:1010 » Service
TestJoinQuery.testLeftOuterJoinPredicationCaseByCase1:652->createOuterJoinTestTable:1010 » Service
TestJoinQuery.testLeftOuterJoinPredicationCaseByCase2:680->createOuterJoinTestTable:1010 » Service
TestJoinQuery.testLeftOuterJoinPredicationCaseByCase3:741->createOuterJoinTestTable:1010 » Service
TestJoinQuery.testLeftOuterJoinPredicationCaseByCase4:771->createOuterJoinTestTable:1010 » Service
TestJoinQuery.testLeftOuterJoinPredicationCaseByCase5:801->createOuterJoinTestTable:1010 » Service
TestJoinQuery.testLeftOuterJoinPredicationCaseByCase6:831->createOuterJoinTestTable:1010 » Service
TestJoinQuery.testLeftOuterWithEmptyTable:860->createOuterJoinTestTable:1010 » Service
TestJoinQuery.testFullOuterJoinPredicationCaseByCase1:971->createOuterJoinTestTable:1010 » Service
TestJoinQuery.testJoinOnMultipleDatabases:564->QueryTestCaseBase.executeString:323 » Service
TestJoinQuery.testJoinOnMultipleDatabasesWithJson:607->QueryTestCaseBase.executeString:323 » Service
TestJoinQuery.testLeftOuterJoinPredicationCaseByCase2_1:709->createOuterJoinTestTable:1010 » Service
TestJoinQuery.testLeftOuterJoinWithEmptySubquery1:479 » Service java.sql.SQLEx...
TestJoinQuery.testLeftOuterJoinWithEmptySubquery2:521 » Service java.sql.SQLEx...
TestJoinQuery.testRightOuterJoinPredicationCaseByCase1:886->createOuterJoinTestTable:1010 » Service
TestJoinQuery.testRightOuterJoinPredicationCaseByCase2:916->createOuterJoinTestTable:1010 » Service
TestJoinQuery.testRightOuterJoinPredicationCaseByCase3:944->createOuterJoinTestTable:1010 » Service
TestJoinQuery.testLeftOuterJoinPredicationCaseByCase1:652->createOuterJoinTestTable:1010 » Service
TestJoinQuery.testLeftOuterJoinPredicationCaseByCase2:680->createOuterJoinTestTable:1010 » Service
TestJoinQuery.testLeftOuterJoinPredicationCaseByCase3:741->createOuterJoinTestTable:1010 » Service
TestJoinQuery.testLeftOuterJoinPredicationCaseByCase4:771->createOuterJoinTestTable:1010 » Service
TestJoinQuery.testLeftOuterJoinPredicationCaseByCase5:801->createOuterJoinTestTable:1010 » Service
TestJoinQuery.testLeftOuterJoinPredicationCaseByCase6:831->createOuterJoinTestTable:1010 » Service
TestJoinQuery.testLeftOuterWithEmptyTable:860->createOuterJoinTestTable:1010 » Service
TestJoinQuery.testFullOuterJoinPredicationCaseByCase1:971->createOuterJoinTestTable:1010 » Service
TestJoinQuery.testJoinOnMultipleDatabases:564->QueryTestCaseBase.executeString:323 » Service
TestJoinQuery.testJoinOnMultipleDatabasesWithJson:607->QueryTestCaseBase.executeString:323 » Service
TestJoinQuery.testLeftOuterJoinPredicationCaseByCase2_1:709->createOuterJoinTestTable:1010 » Service
TestJoinQuery.testLeftOuterJoinWithEmptySubquery1:479 » Service java.sql.SQLEx...
TestJoinQuery.testLeftOuterJoinWithEmptySubquery2:521 » Service java.sql.SQLEx...
TestJoinQuery.testRightOuterJoinPredicationCaseByCase1:886->createOuterJoinTestTable:1010 » Service
TestJoinQuery.testRightOuterJoinPredicationCaseByCase2:916->createOuterJoinTestTable:1010 » Service
TestJoinQuery.testRightOuterJoinPredicationCaseByCase3:944->createOuterJoinTestTable:1010 » Service
TestJoinQuery.testLeftOuterJoinPredicationCaseByCase1:652->createOuterJoinTestTable:1010 » Service
TestJoinQuery.testLeftOuterJoinPredicationCaseByCase2:680->createOuterJoinTestTable:1010 » Service
TestJoinQuery.testLeftOuterJoinPredicationCaseByCase3:741->createOuterJoinTestTable:1010 » Service
TestJoinQuery.testLeftOuterJoinPredicationCaseByCase4:771->createOuterJoinTestTable:1010 » Service
TestJoinQuery.testLeftOuterJoinPredicationCaseByCase5:801->createOuterJoinTestTable:1010 » Service
TestJoinQuery.testLeftOuterJoinPredicationCaseByCase6:831->createOuterJoinTestTable:1010 » Service
TestJoinQuery.testLeftOuterWithEmptyTable:860->createOuterJoinTestTable:1010 » Service
TestJoinQuery.testFullOuterJoinPredicationCaseByCase1:971->createOuterJoinTestTable:1010 » Service
TestJoinQuery.testJoinOnMultipleDatabases:564->QueryTestCaseBase.executeString:323 » Service
TestJoinQuery.testJoinOnMultipleDatabasesWithJson:607->QueryTestCaseBase.executeString:323 » Service
TestJoinQuery.testLeftOuterJoinPredicationCaseByCase2_1:709->createOuterJoinTestTable:1010 » Service
TestJoinQuery.testLeftOuterJoinWithEmptySubquery1:479 » Service java.sql.SQLEx...
TestJoinQuery.testLeftOuterJoinWithEmptySubquery2:521 » Service java.sql.SQLEx...
TestJoinQuery.testRightOuterJoinPredicationCaseByCase1:886->createOuterJoinTestTable:1010 » Service
TestJoinQuery.testRightOuterJoinPredicationCaseByCase2:916->createOuterJoinTestTable:1010 » Service
TestJoinQuery.testRightOuterJoinPredicationCaseByCase3:944->createOuterJoinTestTable:1010 » Service
TestJoinQuery.testLeftOuterJoinPredicationCaseByCase1:652->createOuterJoinTestTable:1010 » Service
TestJoinQuery.testLeftOuterJoinPredicationCaseByCase2:680->createOuterJoinTestTable:1010 » Service
TestJoinQuery.testLeftOuterJoinPredicationCaseByCase3:741->createOuterJoinTestTable:1010 » Service
TestJoinQuery.testLeftOuterJoinPredicationCaseByCase4:771->createOuterJoinTestTable:1010 » Service
TestJoinQuery.testLeftOuterJoinPredicationCaseByCase5:801->createOuterJoinTestTable:1010 » Service
TestJoinQuery.testLeftOuterJoinPredicationCaseByCase6:831->createOuterJoinTestTable:1010 » Service
TestJoinQuery.testLeftOuterWithEmptyTable:860->createOuterJoinTestTable:1010 » Service
TestJoinQuery.testFullOuterJoinPredicationCaseByCase1:971->createOuterJoinTestTable:1010 » Service
TestJoinQuery.testJoinOnMultipleDatabases:564->QueryTestCaseBase.executeString:323 » Service
TestJoinQuery.testJoinOnMultipleDatabasesWithJson:607->QueryTestCaseBase.executeString:323 » Service
TestJoinQuery.testLeftOuterJoinPredicationCaseByCase2_1:709->createOuterJoinTestTable:1010 » Service
TestCaseByCases.testTAJO1224Case1:179->QueryTestCaseBase.executeQuery:333->QueryTestCaseBase.executeFile:424 » Service
TestHBaseTable.testJoin:601->QueryTestCaseBase.executeString:323 » Service HBa...
TestHBaseTable.testInsertIntoLocation:1256->QueryTestCaseBase.executeString:323 » Service
TestHBaseTable.testNonForwardQuery:561->QueryTestCaseBase.executeString:323 » Service
TestHBaseTable.testInsertInto:643->QueryTestCaseBase.executeString:323 » Service
TestHBaseTable.testInsertIntoDifferentType:1068->QueryTestCaseBase.executeString:323 » Service
TestHBaseTable.testInsertIntoMultiRegionWithSplitFile:802->QueryTestCaseBase.executeString:323 » Service
TestHBaseTable.testInsertIntoMultiRegion:685->QueryTestCaseBase.executeString:323 » Service
TestHBaseTable.testInsertIntoMultiRegionMultiRowFields:860->QueryTestCaseBase.executeString:323 » Service
TestHBaseTable.testInsertIntoMultiRegion2:743->QueryTestCaseBase.executeString:323 » Service
TestHBaseTable.testInsertIntoUsingPut:1207->QueryTestCaseBase.executeString:323 » Service
TestHBaseTable.testCreateHBaseTable:112->QueryTestCaseBase.executeString:323 » Service
TestHBaseTable.testInsertIntoRowField:1105->QueryTestCaseBase.executeString:323 » Service
TestCTASQuery.testCtasWithGroupby:149->QueryTestCaseBase.executeQuery:333->QueryTestCaseBase.executeFile:424 » Service
TestCTASQuery.testCtasWithTextFile:231->QueryTestCaseBase.executeQuery:333->QueryTestCaseBase.executeFile:424 » Service
TestCTASQuery.testCtasWithLimit:169->QueryTestCaseBase.executeQuery:333->QueryTestCaseBase.executeFile:424 » Service
TestCTASQuery.testCtasWithUnion:179->QueryTestCaseBase.executeQuery:333->QueryTestCaseBase.executeFile:424 » Service
TestCTASQuery.testCtasWithOptions:245->QueryTestCaseBase.executeQuery:333->QueryTestCaseBase.executeFile:424 » Service
TestCTASQuery.testCtasWithStoreType:217->QueryTestCaseBase.executeQuery:333->QueryTestCaseBase.executeFile:424 » Service
TestCTASQuery.testCtasWithOrderby:159->QueryTestCaseBase.executeQuery:333->QueryTestCaseBase.executeFile:424 » Service
TestCTASQuery.testCtasWithMultipleUnions:189->QueryTestCaseBase.executeQuery:333->QueryTestCaseBase.executeFile:424 » Service
TestTruncateTable.testTruncateTable:64->QueryTestCaseBase.executeString:323 » Service
TestEvalCodeGenerator.testGetField:57->ExprTestBase.testEval:196->ExprTestBase.testEval:284 » AbstractMethod
TestEvalCodeGenerator.testComparison:112->ExprTestBase.testSimpleEval:176->ExprTestBase.testEval:196->ExprTestBase.testEval:284 » AbstractMethod
TestEvalCodeGenerator.testArithmetic:48->ExprTestBase.testEval:196->ExprTestBase.testEval:284 » AbstractMethod
TestEvalCodeGenerator.testAndOr:270->ExprTestBase.testSimpleEval:176->ExprTestBase.testEval:196->ExprTestBase.testEval:284 » AbstractMethod
TestEvalCodeGenerator.testUnary:246->ExprTestBase.testEval:196->ExprTestBase.testEval:284 » AbstractMethod
TestEvalCodeGenerator.testBetweenSymmetric:201->ExprTestBase.testEval:196->ExprTestBase.testEval:284 » AbstractMethod
TestEvalCodeGenerator.testStringConcat:302->ExprTestBase.testSimpleEval:176->ExprTestBase.testEval:196->ExprTestBase.testEval:284 » AbstractMethod
TestEvalCodeGenerator.testBetweenAsymmetric:167->ExprTestBase.testEval:196->ExprTestBase.testEval:284 » AbstractMethod
TestEvalCodeGenerator.testNullHandling:81->ExprTestBase.testEval:196->ExprTestBase.testEval:284 » AbstractMethod
TestEvalCodeGenerator.testFunction:293->ExprTestBase.testEval:196->ExprTestBase.testEval:284 » AbstractMethod
TestTajoClient.testGetQueryStatusAndResultAfterFinish:668 » SQL com.google.pro...
TestTajoClient.testGetQueryInfoAndHistory:748 » test timed out after 30000 mi...
TestTajoClient.testNullCharSessionInCTAS:697 » Service java.sql.SQLException: ...
Tests run: 1448, Failures: 659, Errors: 249, Skipped: 0
[INFO] ------------------------------------------------------------------------
[INFO] Reactor Summary:
[INFO]
[INFO] Tajo Main ......................................... SUCCESS [ 1.622 s]
[INFO] Tajo Project POM .................................. SUCCESS [ 1.230 s]
[INFO] Tajo Maven Plugins ................................ SUCCESS [ 3.268 s]
[INFO] Tajo Common ....................................... SUCCESS [ 25.369 s]
[INFO] Tajo Algebra ...................................... SUCCESS [ 1.351 s]
[INFO] Tajo Catalog Common ............................... SUCCESS [ 6.756 s]
[INFO] Tajo Plan ......................................... SUCCESS [ 5.950 s]
[INFO] Tajo Rpc Common ................................... SUCCESS [ 0.439 s]
[INFO] Tajo Protocol Buffer Rpc .......................... SUCCESS [ 34.327 s]
[INFO] Tajo Catalog Client ............................... SUCCESS [ 1.045 s]
[INFO] Tajo Catalog Server ............................... SUCCESS [ 10.212 s]
[INFO] Tajo Storage Common ............................... SUCCESS [ 11.473 s]
[INFO] Tajo HDFS Storage ................................. SUCCESS [ 53.992 s]
[INFO] Tajo HBase Storage ................................ SUCCESS [ 2.992 s]
[INFO] Tajo PullServer ................................... SUCCESS [ 0.959 s]
[INFO] Tajo Client ....................................... SUCCESS [ 2.890 s]
[INFO] Tajo CLI tools .................................... SUCCESS [ 0.634 s]
[INFO] Tajo JDBC Driver .................................. SUCCESS [ 2.993 s]
[INFO] ASM (thirdparty) .................................. SUCCESS [ 0.538 s]
[INFO] Tajo RESTful Container ............................ SUCCESS [ 3.331 s]
[INFO] Tajo Core ......................................... FAILURE [15:41 min]
[INFO] Tajo RPC .......................................... SKIPPED
[INFO] Tajo Catalog Drivers Hive ......................... SKIPPED
[INFO] Tajo Catalog Drivers .............................. SKIPPED
[INFO] Tajo Catalog ...................................... SKIPPED
[INFO] Tajo Storage ...................................... SKIPPED
[INFO] Tajo Distribution ................................. SKIPPED
[INFO] ------------------------------------------------------------------------
[INFO] BUILD FAILURE
[INFO] ------------------------------------------------------------------------
[INFO] Total time: 18:33 min
[INFO] Finished at: 2015-04-17T15:17:48+00:00
[INFO] Final Memory: 103M/1063M
[INFO] ------------------------------------------------------------------------
[ERROR] Failed to execute goal org.apache.maven.plugins:maven-surefire-plugin:2.17:test (default-test) on project tajo-core: There are test failures.
[ERROR]
[ERROR] Please refer to <https://builds.apache.org/job/Tajo-master-CODEGEN-build/ws/tajo-core/target/surefire-reports> for the individual test results.
[ERROR] -> [Help 1]
[ERROR]
[ERROR] To see the full stack trace of the errors, re-run Maven with the -e switch.
[ERROR] Re-run Maven using the -X switch to enable full debug logging.
[ERROR]
[ERROR] For more information about the errors and possible solutions, please read the following articles:
[ERROR] [Help 1] http://cwiki.apache.org/confluence/display/MAVEN/MojoFailureException
[ERROR]
[ERROR] After correcting the problems, you can resume the build with the command
[ERROR] mvn <goals> -rf :tajo-core
Build step 'Execute shell' marked build as failure
Updating TAJO-923