You are viewing a plain text version of this content. The canonical link for it is here.
Posted to builds@beam.apache.org by Apache Jenkins Server <je...@builds.apache.org> on 2022/08/08 23:14:08 UTC
Build failed in Jenkins: beam_PostCommit_Python38 #2982
See <https://ci-beam.apache.org/job/beam_PostCommit_Python38/2982/display/redirect?page=changes>
Changes:
[vlad.matyunin] modifed WithKeys Playground Example
[alexander.zhuravlev] [Playground] Removed banner from Playground header, deleted unused
[noreply] Add PyDoc buttons to the top and bottom of the Machine Learning page
[noreply] [Playground][Backend][Bug]: Moving the initialization of properties file
[noreply] Bump cloud.google.com/go/bigquery from 1.36.0 to 1.37.0 in /sdks
------------------------------------------
[...truncated 43.61 MB...]
[32mINFO [0m apache_beam.runners.dataflow.dataflow_runner:dataflow_runner.py:242 2022-08-08T21:55:15.982Z: JOB_MESSAGE_BASIC: Executing operation Create/Impulse+Create/FlatMap(<lambda at core.py:3481>)+Create/MaybeReshuffle/Reshuffle/AddRandomKeys+Create/MaybeReshuffle/Reshuffle/ReshufflePerKey/Map(reify_timestamps)+Create/MaybeReshuffle/Reshuffle/ReshufflePerKey/GroupByKey/Reify+Create/MaybeReshuffle/Reshuffle/ReshufflePerKey/GroupByKey/Write
[32mINFO [0m apache_beam.runners.dataflow.dataflow_runner:dataflow_runner.py:242 2022-08-08T21:55:42.614Z: JOB_MESSAGE_BASIC: Your project already contains 100 Dataflow-created metric descriptors, so new user metrics of the form custom.googleapis.com/* will not be created. However, all user metrics are also available in the metric dataflow.googleapis.com/job/user_counter. If you rely on the custom metrics, you can delete old / unused metric descriptors. See https://developers.google.com/apis-explorer/#p/monitoring/v3/monitoring.projects.metricDescriptors.list and https://developers.google.com/apis-explorer/#p/monitoring/v3/monitoring.projects.metricDescriptors.delete
[32mINFO [0m apache_beam.runners.dataflow.dataflow_runner:dataflow_runner.py:242 2022-08-08T21:55:51.700Z: JOB_MESSAGE_DETAILED: Autoscaling: Raised the number of workers to 1 based on the rate of progress in the currently running stage(s).
[32mINFO [0m apache_beam.runners.dataflow.dataflow_runner:dataflow_runner.py:242 2022-08-08T21:56:19.851Z: JOB_MESSAGE_DETAILED: Workers have started successfully.
[32mINFO [0m apache_beam.runners.dataflow.dataflow_runner:dataflow_runner.py:242 2022-08-08T22:01:29.657Z: JOB_MESSAGE_BASIC: Finished operation Create/Impulse+Create/FlatMap(<lambda at core.py:3481>)+Create/MaybeReshuffle/Reshuffle/AddRandomKeys+Create/MaybeReshuffle/Reshuffle/ReshufflePerKey/Map(reify_timestamps)+Create/MaybeReshuffle/Reshuffle/ReshufflePerKey/GroupByKey/Reify+Create/MaybeReshuffle/Reshuffle/ReshufflePerKey/GroupByKey/Write
[32mINFO [0m apache_beam.runners.dataflow.dataflow_runner:dataflow_runner.py:242 2022-08-08T22:01:29.744Z: JOB_MESSAGE_BASIC: Executing operation Create/MaybeReshuffle/Reshuffle/ReshufflePerKey/GroupByKey/Close
[32mINFO [0m apache_beam.runners.dataflow.dataflow_runner:dataflow_runner.py:242 2022-08-08T22:01:30.083Z: JOB_MESSAGE_BASIC: Finished operation Create/MaybeReshuffle/Reshuffle/ReshufflePerKey/GroupByKey/Close
[32mINFO [0m apache_beam.runners.dataflow.dataflow_runner:dataflow_runner.py:242 2022-08-08T22:01:30.161Z: JOB_MESSAGE_BASIC: Executing operation GroupByKey/Create
[32mINFO [0m apache_beam.runners.dataflow.dataflow_runner:dataflow_runner.py:242 2022-08-08T22:01:30.349Z: JOB_MESSAGE_BASIC: Finished operation GroupByKey/Create
[32mINFO [0m apache_beam.runners.dataflow.dataflow_runner:dataflow_runner.py:242 2022-08-08T22:01:30.496Z: JOB_MESSAGE_DEBUG: Value "GroupByKey/Session" materialized.
[32mINFO [0m apache_beam.runners.dataflow.dataflow_runner:dataflow_runner.py:242 2022-08-08T22:01:30.560Z: JOB_MESSAGE_BASIC: Executing operation Create/MaybeReshuffle/Reshuffle/ReshufflePerKey/GroupByKey/Read+Create/MaybeReshuffle/Reshuffle/ReshufflePerKey/GroupByKey/GroupByWindow+Create/MaybeReshuffle/Reshuffle/ReshufflePerKey/FlatMap(restore_timestamps)+Create/MaybeReshuffle/Reshuffle/RemoveRandomKeys+Create/Map(decode)+metrics+map_to_common_key+GroupByKey/Write
[32mINFO [0m apache_beam.runners.dataflow.dataflow_runner:dataflow_runner.py:242 2022-08-08T22:01:38.069Z: JOB_MESSAGE_BASIC: Finished operation Create/MaybeReshuffle/Reshuffle/ReshufflePerKey/GroupByKey/Read+Create/MaybeReshuffle/Reshuffle/ReshufflePerKey/GroupByKey/GroupByWindow+Create/MaybeReshuffle/Reshuffle/ReshufflePerKey/FlatMap(restore_timestamps)+Create/MaybeReshuffle/Reshuffle/RemoveRandomKeys+Create/Map(decode)+metrics+map_to_common_key+GroupByKey/Write
[32mINFO [0m apache_beam.runners.dataflow.dataflow_runner:dataflow_runner.py:242 2022-08-08T22:01:38.149Z: JOB_MESSAGE_BASIC: Executing operation GroupByKey/Close
[32mINFO [0m apache_beam.runners.dataflow.dataflow_runner:dataflow_runner.py:242 2022-08-08T22:01:38.958Z: JOB_MESSAGE_BASIC: Finished operation GroupByKey/Close
[32mINFO [0m apache_beam.runners.dataflow.dataflow_runner:dataflow_runner.py:242 2022-08-08T22:01:39.031Z: JOB_MESSAGE_BASIC: Executing operation GroupByKey/Read+m_out
[32mINFO [0m apache_beam.runners.dataflow.dataflow_runner:dataflow_runner.py:242 2022-08-08T22:01:40.236Z: JOB_MESSAGE_BASIC: Finished operation GroupByKey/Read+m_out
[32mINFO [0m apache_beam.runners.dataflow.dataflow_runner:dataflow_runner.py:242 2022-08-08T22:01:40.316Z: JOB_MESSAGE_DEBUG: Executing success step success17
[32mINFO [0m apache_beam.runners.dataflow.dataflow_runner:dataflow_runner.py:242 2022-08-08T22:01:40.492Z: JOB_MESSAGE_DETAILED: Cleaning up.
[32mINFO [0m apache_beam.runners.dataflow.dataflow_runner:dataflow_runner.py:242 2022-08-08T22:01:40.542Z: JOB_MESSAGE_DEBUG: Starting worker pool teardown.
[32mINFO [0m apache_beam.runners.dataflow.dataflow_runner:dataflow_runner.py:242 2022-08-08T22:01:40.577Z: JOB_MESSAGE_BASIC: Stopping worker pool...
[32mINFO [0m apache_beam.runners.dataflow.dataflow_runner:dataflow_runner.py:242 2022-08-08T22:03:48.968Z: JOB_MESSAGE_DETAILED: Autoscaling: Resized worker pool from 1 to 0.
[32mINFO [0m apache_beam.runners.dataflow.dataflow_runner:dataflow_runner.py:242 2022-08-08T22:03:49.021Z: JOB_MESSAGE_BASIC: Worker pool stopped.
[32mINFO [0m apache_beam.runners.dataflow.dataflow_runner:dataflow_runner.py:242 2022-08-08T22:03:49.121Z: JOB_MESSAGE_DEBUG: Tearing down pending resources...
[32mINFO [0m apache_beam.runners.dataflow.dataflow_runner:dataflow_runner.py:197 Job 2022-08-08_14_55_07-17379054186896646968 is in state JOB_STATE_DONE
[33m=============================== warnings summary ===============================[0m
../../build/gradleenv/-1734967051/lib/python3.8/site-packages/hdfs/config.py:15
../../build/gradleenv/-1734967051/lib/python3.8/site-packages/hdfs/config.py:15
../../build/gradleenv/-1734967051/lib/python3.8/site-packages/hdfs/config.py:15
../../build/gradleenv/-1734967051/lib/python3.8/site-packages/hdfs/config.py:15
../../build/gradleenv/-1734967051/lib/python3.8/site-packages/hdfs/config.py:15
../../build/gradleenv/-1734967051/lib/python3.8/site-packages/hdfs/config.py:15
../../build/gradleenv/-1734967051/lib/python3.8/site-packages/hdfs/config.py:15
../../build/gradleenv/-1734967051/lib/python3.8/site-packages/hdfs/config.py:15
../../build/gradleenv/-1734967051/lib/python3.8/site-packages/hdfs/config.py:15
<https://ci-beam.apache.org/job/beam_PostCommit_Python38/ws/src/build/gradleenv/-1734967051/lib/python3.8/site-packages/hdfs/config.py>:15: DeprecationWarning: the imp module is deprecated in favour of importlib; see the module's documentation for alternative uses
from imp import load_source
../../build/gradleenv/-1734967051/lib/python3.8/site-packages/tenacity/_asyncio.py:42
../../build/gradleenv/-1734967051/lib/python3.8/site-packages/tenacity/_asyncio.py:42
../../build/gradleenv/-1734967051/lib/python3.8/site-packages/tenacity/_asyncio.py:42
../../build/gradleenv/-1734967051/lib/python3.8/site-packages/tenacity/_asyncio.py:42
../../build/gradleenv/-1734967051/lib/python3.8/site-packages/tenacity/_asyncio.py:42
../../build/gradleenv/-1734967051/lib/python3.8/site-packages/tenacity/_asyncio.py:42
../../build/gradleenv/-1734967051/lib/python3.8/site-packages/tenacity/_asyncio.py:42
../../build/gradleenv/-1734967051/lib/python3.8/site-packages/tenacity/_asyncio.py:42
<https://ci-beam.apache.org/job/beam_PostCommit_Python38/ws/src/build/gradleenv/-1734967051/lib/python3.8/site-packages/tenacity/_asyncio.py>:42: DeprecationWarning: "@coroutine" decorator is deprecated since Python 3.8, use "async def" instead
def call(self, fn, *args, **kwargs):
apache_beam/examples/complete/game/leader_board_it_test.py::LeaderBoardIT::test_leader_board_it
apache_beam/examples/complete/game/game_stats_it_test.py::GameStatsIT::test_game_stats_it
apache_beam/examples/complete/game/hourly_team_score_it_test.py::HourlyTeamScoreIT::test_hourly_team_score_it
apache_beam/io/gcp/bigquery_test.py::PubSubBigQueryIT::test_file_loads
apache_beam/io/gcp/bigquery_test.py::PubSubBigQueryIT::test_streaming_inserts
<https://ci-beam.apache.org/job/beam_PostCommit_Python38/ws/src/sdks/python/apache_beam/io/gcp/tests/utils.py>:63: PendingDeprecationWarning: Client.dataset is deprecated and will be removed in a future version. Use a string like 'my_project.my_dataset' or a cloud.google.bigquery.DatasetReference object, instead.
dataset_ref = client.dataset(unique_dataset_name, project=project)
apache_beam/examples/complete/game/leader_board_it_test.py: 2 warnings
apache_beam/examples/complete/game/game_stats_it_test.py: 2 warnings
apache_beam/examples/cookbook/bigquery_tornadoes_it_test.py: 1 warning
apache_beam/examples/complete/game/hourly_team_score_it_test.py: 1 warning
apache_beam/io/gcp/big_query_query_to_table_it_test.py: 6 warnings
apache_beam/io/gcp/bigquery_test.py: 6 warnings
apache_beam/io/gcp/bigquery_file_loads_test.py: 3 warnings
apache_beam/io/gcp/bigquery_write_it_test.py: 4 warnings
apache_beam/io/gcp/bigquery_json_it_test.py: 2 warnings
<https://ci-beam.apache.org/job/beam_PostCommit_Python38/ws/src/sdks/python/apache_beam/io/gcp/bigquery.py>:2288: BeamDeprecationWarning: options is deprecated since First stable release. References to <pipeline>.options will not be supported
is_streaming_pipeline = p.options.view_as(StandardOptions).streaming
apache_beam/examples/complete/game/leader_board_it_test.py: 2 warnings
apache_beam/examples/complete/game/game_stats_it_test.py: 2 warnings
apache_beam/examples/cookbook/bigquery_tornadoes_it_test.py: 1 warning
apache_beam/examples/complete/game/hourly_team_score_it_test.py: 1 warning
apache_beam/io/gcp/big_query_query_to_table_it_test.py: 6 warnings
apache_beam/io/gcp/bigquery_test.py: 6 warnings
apache_beam/io/gcp/bigquery_file_loads_test.py: 3 warnings
apache_beam/io/gcp/bigquery_write_it_test.py: 4 warnings
apache_beam/io/gcp/bigquery_json_it_test.py: 2 warnings
<https://ci-beam.apache.org/job/beam_PostCommit_Python38/ws/src/sdks/python/apache_beam/io/gcp/bigquery.py>:2294: BeamDeprecationWarning: options is deprecated since First stable release. References to <pipeline>.options will not be supported
experiments = p.options.view_as(DebugOptions).experiments or []
apache_beam/examples/cookbook/bigquery_tornadoes_it_test.py: 1 warning
apache_beam/io/gcp/big_query_query_to_table_it_test.py: 6 warnings
apache_beam/io/gcp/bigquery_io_read_it_test.py: 2 warnings
apache_beam/examples/dataframe/flight_delays_it_test.py: 1 warning
apache_beam/io/gcp/bigquery_read_it_test.py: 7 warnings
apache_beam/io/gcp/bigquery_json_it_test.py: 3 warnings
<https://ci-beam.apache.org/job/beam_PostCommit_Python38/ws/src/sdks/python/apache_beam/io/gcp/bigquery.py>:2778: BeamDeprecationWarning: options is deprecated since First stable release. References to <pipeline>.options will not be supported
temp_location = pcoll.pipeline.options.view_as(
apache_beam/examples/cookbook/bigquery_tornadoes_it_test.py: 1 warning
apache_beam/io/gcp/big_query_query_to_table_it_test.py: 6 warnings
apache_beam/io/gcp/bigquery_io_read_it_test.py: 2 warnings
apache_beam/examples/dataframe/flight_delays_it_test.py: 1 warning
apache_beam/io/gcp/bigquery_read_it_test.py: 7 warnings
apache_beam/io/gcp/bigquery_json_it_test.py: 3 warnings
<https://ci-beam.apache.org/job/beam_PostCommit_Python38/ws/src/sdks/python/apache_beam/io/gcp/bigquery.py>:2780: BeamDeprecationWarning: options is deprecated since First stable release. References to <pipeline>.options will not be supported
job_name = pcoll.pipeline.options.view_as(GoogleCloudOptions).job_name
apache_beam/examples/cookbook/bigquery_tornadoes_it_test.py: 1 warning
apache_beam/io/gcp/big_query_query_to_table_it_test.py: 6 warnings
apache_beam/io/gcp/bigquery_io_read_it_test.py: 2 warnings
apache_beam/examples/dataframe/flight_delays_it_test.py: 1 warning
apache_beam/io/gcp/bigquery_read_it_test.py: 7 warnings
apache_beam/io/gcp/bigquery_json_it_test.py: 3 warnings
<https://ci-beam.apache.org/job/beam_PostCommit_Python38/ws/src/sdks/python/apache_beam/io/gcp/bigquery.py>:2804: BeamDeprecationWarning: options is deprecated since First stable release. References to <pipeline>.options will not be supported
pipeline_options=pcoll.pipeline.options,
apache_beam/examples/cookbook/bigquery_tornadoes_it_test.py: 1 warning
apache_beam/io/gcp/big_query_query_to_table_it_test.py: 6 warnings
apache_beam/io/gcp/bigquery_write_it_test.py: 4 warnings
apache_beam/io/gcp/bigquery_test.py: 2 warnings
<https://ci-beam.apache.org/job/beam_PostCommit_Python38/ws/src/sdks/python/apache_beam/io/gcp/bigquery.py>:2284: BeamDeprecationWarning: options is deprecated since First stable release. References to <pipeline>.options will not be supported
self.table_reference.projectId = pcoll.pipeline.options.view_as(
apache_beam/examples/cookbook/bigquery_tornadoes_it_test.py: 1 warning
apache_beam/examples/complete/game/hourly_team_score_it_test.py: 1 warning
apache_beam/io/gcp/big_query_query_to_table_it_test.py: 6 warnings
apache_beam/io/gcp/bigquery_file_loads_test.py: 3 warnings
apache_beam/io/gcp/bigquery_test.py: 3 warnings
apache_beam/io/gcp/bigquery_write_it_test.py: 3 warnings
<https://ci-beam.apache.org/job/beam_PostCommit_Python38/ws/src/sdks/python/apache_beam/io/gcp/bigquery_file_loads.py>:1129: BeamDeprecationWarning: options is deprecated since First stable release. References to <pipeline>.options will not be supported
temp_location = p.options.view_as(GoogleCloudOptions).temp_location
apache_beam/examples/cookbook/bigquery_tornadoes_it_test.py: 1 warning
apache_beam/examples/complete/game/hourly_team_score_it_test.py: 1 warning
apache_beam/io/gcp/big_query_query_to_table_it_test.py: 6 warnings
apache_beam/io/gcp/bigquery_file_loads_test.py: 3 warnings
apache_beam/io/gcp/bigquery_test.py: 3 warnings
apache_beam/io/gcp/bigquery_write_it_test.py: 3 warnings
<https://ci-beam.apache.org/job/beam_PostCommit_Python38/ws/src/sdks/python/apache_beam/io/gcp/bigquery_file_loads.py>:1131: BeamDeprecationWarning: options is deprecated since First stable release. References to <pipeline>.options will not be supported
p.options.view_as(GoogleCloudOptions).job_name or 'AUTOMATIC_JOB_NAME')
apache_beam/examples/cookbook/bigquery_tornadoes_it_test.py::BigqueryTornadoesIT::test_bigquery_tornadoes_it
<https://ci-beam.apache.org/job/beam_PostCommit_Python38/ws/src/sdks/python/apache_beam/io/gcp/tests/utils.py>:100: PendingDeprecationWarning: Client.dataset is deprecated and will be removed in a future version. Use a string like 'my_project.my_dataset' or a cloud.google.bigquery.DatasetReference object, instead.
table_ref = client.dataset(dataset_id).table(table_id)
apache_beam/examples/dataframe/taxiride_it_test.py::TaxirideIT::test_aggregation
apache_beam/examples/dataframe/flight_delays_it_test.py::FlightDelaysTest::test_flight_delays
apache_beam/examples/dataframe/taxiride_it_test.py::TaxirideIT::test_enrich
<https://ci-beam.apache.org/job/beam_PostCommit_Python38/ws/src/sdks/python/apache_beam/dataframe/io.py>:629: FutureWarning: WriteToFiles is experimental.
return pcoll | fileio.WriteToFiles(
apache_beam/examples/dataframe/taxiride_it_test.py::TaxirideIT::test_aggregation
apache_beam/examples/dataframe/flight_delays_it_test.py::FlightDelaysTest::test_flight_delays
apache_beam/examples/dataframe/taxiride_it_test.py::TaxirideIT::test_enrich
<https://ci-beam.apache.org/job/beam_PostCommit_Python38/ws/src/sdks/python/apache_beam/io/fileio.py>:581: BeamDeprecationWarning: options is deprecated since First stable release. References to <pipeline>.options will not be supported
p.options.view_as(GoogleCloudOptions).temp_location or
apache_beam/examples/dataframe/flight_delays_it_test.py::FlightDelaysTest::test_flight_delays
<https://ci-beam.apache.org/job/beam_PostCommit_Python38/ws/src/sdks/python/apache_beam/examples/dataframe/flight_delays.py>:47: FutureWarning: Dropping of nuisance columns in DataFrame reductions (with 'numeric_only=None') is deprecated; in a future version this will raise TypeError. Select only valid columns before calling the reduction.
return airline_df[at_top_airports].mean()
apache_beam/io/gcp/bigquery_test.py::BigQueryStreamingInsertTransformIntegrationTests::test_multiple_destinations_transform
<https://ci-beam.apache.org/job/beam_PostCommit_Python38/ws/src/sdks/python/apache_beam/io/gcp/bigquery_test.py>:1846: BeamDeprecationWarning: options is deprecated since First stable release. References to <pipeline>.options will not be supported
streaming = self.test_pipeline.options.view_as(StandardOptions).streaming
apache_beam/io/gcp/bigquery_read_it_test.py::ReadTests::test_native_source
<https://ci-beam.apache.org/job/beam_PostCommit_Python38/ws/src/sdks/python/apache_beam/io/gcp/bigquery_read_it_test.py>:171: BeamDeprecationWarning: BigQuerySource is deprecated since 2.25.0. Use ReadFromBigQuery instead.
beam.io.BigQuerySource(query=self.query, use_standard_sql=True)))
apache_beam/io/gcp/big_query_query_to_table_it_test.py::BigQueryQueryToTableIT::test_big_query_new_types_native
apache_beam/io/gcp/big_query_query_to_table_it_test.py::BigQueryQueryToTableIT::test_big_query_standard_sql_kms_key_native
<https://ci-beam.apache.org/job/beam_PostCommit_Python38/ws/src/sdks/python/apache_beam/io/gcp/big_query_query_to_table_pipeline.py>:81: BeamDeprecationWarning: BigQuerySource is deprecated since 2.25.0. Use ReadFromBigQuery instead.
beam.io.BigQuerySource(
apache_beam/io/gcp/big_query_query_to_table_it_test.py::BigQueryQueryToTableIT::test_big_query_new_types_native
apache_beam/io/gcp/big_query_query_to_table_it_test.py::BigQueryQueryToTableIT::test_big_query_standard_sql_kms_key_native
<https://ci-beam.apache.org/job/beam_PostCommit_Python38/ws/src/sdks/python/apache_beam/runners/dataflow/ptransform_overrides.py>:316: BeamDeprecationWarning: BigQuerySink is deprecated since 2.11.0. Use WriteToBigQuery instead.
io.BigQuerySink(
apache_beam/io/gcp/bigquery_json_it_test.py: 1 warning
apache_beam/io/gcp/bigquery_read_it_test.py: 9 warnings
<https://ci-beam.apache.org/job/beam_PostCommit_Python38/ws/src/sdks/python/apache_beam/io/gcp/bigquery.py>:2822: BeamDeprecationWarning: options is deprecated since First stable release. References to <pipeline>.options will not be supported
project_id = pcoll.pipeline.options.view_as(GoogleCloudOptions).project
apache_beam/io/gcp/bigquery_json_it_test.py: 1 warning
apache_beam/io/gcp/bigquery_read_it_test.py: 9 warnings
<https://ci-beam.apache.org/job/beam_PostCommit_Python38/ws/src/sdks/python/apache_beam/io/gcp/bigquery.py>:2843: BeamDeprecationWarning: options is deprecated since First stable release. References to <pipeline>.options will not be supported
pipeline_options=pcoll.pipeline.options,
apache_beam/ml/gcp/cloud_dlp_it_test.py::CloudDLPIT::test_deidentification
<https://ci-beam.apache.org/job/beam_PostCommit_Python38/ws/src/sdks/python/apache_beam/ml/gcp/cloud_dlp_it_test.py>:74: FutureWarning: MaskDetectedDetails is experimental.
| MaskDetectedDetails(
apache_beam/ml/gcp/cloud_dlp_it_test.py::CloudDLPIT::test_inspection
<https://ci-beam.apache.org/job/beam_PostCommit_Python38/ws/src/sdks/python/apache_beam/ml/gcp/cloud_dlp_it_test.py>:85: FutureWarning: InspectForDetails is experimental.
| InspectForDetails(
apache_beam/io/gcp/bigquery_read_it_test.py::ReadNewTypesTests::test_native_source
<https://ci-beam.apache.org/job/beam_PostCommit_Python38/ws/src/sdks/python/apache_beam/io/gcp/bigquery_read_it_test.py>:646: BeamDeprecationWarning: BigQuerySource is deprecated since 2.25.0. Use ReadFromBigQuery instead.
beam.io.BigQuerySource(query=self.query, use_standard_sql=True)))
apache_beam/io/gcp/bigquery_read_it_test.py::ReadAllBQTests::test_read_queries
<https://ci-beam.apache.org/job/beam_PostCommit_Python38/ws/src/sdks/python/apache_beam/io/gcp/bigquery_read_it_test.py>:761: FutureWarning: ReadAllFromBigQuery is experimental.
| beam.io.ReadAllFromBigQuery())
apache_beam/io/gcp/bigquery_read_it_test.py::ReadAllBQTests::test_read_queries
<https://ci-beam.apache.org/job/beam_PostCommit_Python38/ws/src/sdks/python/apache_beam/io/gcp/bigquery.py>:2953: BeamDeprecationWarning: options is deprecated since First stable release. References to <pipeline>.options will not be supported
job_name = pcoll.pipeline.options.view_as(GoogleCloudOptions).job_name
apache_beam/io/gcp/bigquery_read_it_test.py::ReadAllBQTests::test_read_queries
<https://ci-beam.apache.org/job/beam_PostCommit_Python38/ws/src/sdks/python/apache_beam/io/gcp/bigquery.py>:2954: BeamDeprecationWarning: options is deprecated since First stable release. References to <pipeline>.options will not be supported
project = pcoll.pipeline.options.view_as(GoogleCloudOptions).project
apache_beam/io/gcp/bigquery_read_it_test.py::ReadAllBQTests::test_read_queries
<https://ci-beam.apache.org/job/beam_PostCommit_Python38/ws/src/sdks/python/apache_beam/io/gcp/bigquery.py>:2967: BeamDeprecationWarning: options is deprecated since First stable release. References to <pipeline>.options will not be supported
options=pcoll.pipeline.options,
-- Docs: https://docs.pytest.org/en/stable/how-to/capture-warnings.html
- generated xml file: <https://ci-beam.apache.org/job/beam_PostCommit_Python38/ws/src/sdks/python/pytest_postCommitIT-df-py38.xml> -
=========================== short test summary info ============================
FAILED apache_beam/runners/dataflow/dataflow_exercise_metrics_pipeline_test.py::ExerciseMetricsPipelineTest::test_metrics_it
[31m===== [31m[1m1 failed[0m, [32m82 passed[0m, [33m11 skipped[0m, [33m224 warnings[0m[31m in 10592.69s (2:56:32)[0m[31m =====[0m
> Task :sdks:python:test-suites:dataflow:py38:postCommitIT FAILED
FAILURE: Build failed with an exception.
* Where:
Script '<https://ci-beam.apache.org/job/beam_PostCommit_Python38/ws/src/sdks/python/test-suites/dataflow/common.gradle'> line: 121
* What went wrong:
Execution failed for task ':sdks:python:test-suites:dataflow:py38:postCommitIT'.
> Process 'command 'sh'' finished with non-zero exit value 1
* Try:
> Run with --stacktrace option to get the stack trace.
> Run with --info or --debug option to get more log output.
> Run with --scan to get full insights.
* Get more help at https://help.gradle.org
Deprecated Gradle features were used in this build, making it incompatible with Gradle 8.0.
You can use '--warning-mode all' to show the individual deprecation warnings and determine if they come from your own scripts or plugins.
See https://docs.gradle.org/7.4/userguide/command_line_interface.html#sec:command_line_warnings
Execution optimizations have been disabled for 1 invalid unit(s) of work during this build to ensure correctness.
Please consult deprecation warnings for more details.
BUILD FAILED in 2h 58m 37s
220 actionable tasks: 150 executed, 64 from cache, 6 up-to-date
Publishing build scan...
https://gradle.com/s/f4karmshrmx5k
Build step 'Invoke Gradle script' changed build result to FAILURE
Build step 'Invoke Gradle script' marked build as failure
---------------------------------------------------------------------
To unsubscribe, e-mail: builds-unsubscribe@beam.apache.org
For additional commands, e-mail: builds-help@beam.apache.org
Jenkins build is back to normal : beam_PostCommit_Python38 #2988
Posted by Apache Jenkins Server <je...@builds.apache.org>.
See <https://ci-beam.apache.org/job/beam_PostCommit_Python38/2988/display/redirect>
---------------------------------------------------------------------
To unsubscribe, e-mail: builds-unsubscribe@beam.apache.org
For additional commands, e-mail: builds-help@beam.apache.org
beam_PostCommit_Python38 - Build # 2987 - Aborted!
Posted by Apache Jenkins Server <je...@builds.apache.org>.
beam_PostCommit_Python38 - Build # 2987 - Aborted:
Check console output at https://ci-beam.apache.org/job/beam_PostCommit_Python38/2987/ to view the results.
beam_PostCommit_Python38 - Build # 2986 - Aborted!
Posted by Apache Jenkins Server <je...@builds.apache.org>.
beam_PostCommit_Python38 - Build # 2986 - Aborted:
Check console output at https://ci-beam.apache.org/job/beam_PostCommit_Python38/2986/ to view the results.
Build failed in Jenkins: beam_PostCommit_Python38 #2985
Posted by Apache Jenkins Server <je...@builds.apache.org>.
See <https://ci-beam.apache.org/job/beam_PostCommit_Python38/2985/display/redirect?page=changes>
Changes:
[noreply] Bump google.golang.org/api from 0.90.0 to 0.91.0 in /sdks (#22568)
------------------------------------------
[...truncated 43.63 MB...]
[32mINFO [0m apache_beam.runners.dataflow.dataflow_runner:dataflow_runner.py:242 2022-08-09T15:54:25.076Z: JOB_MESSAGE_BASIC: Executing operation Create/Impulse+Create/FlatMap(<lambda at core.py:3481>)+Create/MaybeReshuffle/Reshuffle/AddRandomKeys+Create/MaybeReshuffle/Reshuffle/ReshufflePerKey/Map(reify_timestamps)+Create/MaybeReshuffle/Reshuffle/ReshufflePerKey/GroupByKey/Reify+Create/MaybeReshuffle/Reshuffle/ReshufflePerKey/GroupByKey/Write
[32mINFO [0m apache_beam.runners.dataflow.dataflow_runner:dataflow_runner.py:242 2022-08-09T15:54:44.601Z: JOB_MESSAGE_BASIC: Your project already contains 100 Dataflow-created metric descriptors, so new user metrics of the form custom.googleapis.com/* will not be created. However, all user metrics are also available in the metric dataflow.googleapis.com/job/user_counter. If you rely on the custom metrics, you can delete old / unused metric descriptors. See https://developers.google.com/apis-explorer/#p/monitoring/v3/monitoring.projects.metricDescriptors.list and https://developers.google.com/apis-explorer/#p/monitoring/v3/monitoring.projects.metricDescriptors.delete
[32mINFO [0m apache_beam.runners.dataflow.dataflow_runner:dataflow_runner.py:242 2022-08-09T15:54:58.367Z: JOB_MESSAGE_DETAILED: Autoscaling: Raised the number of workers to 1 based on the rate of progress in the currently running stage(s).
[32mINFO [0m apache_beam.runners.dataflow.dataflow_runner:dataflow_runner.py:242 2022-08-09T15:55:28.578Z: JOB_MESSAGE_DETAILED: Workers have started successfully.
[32mINFO [0m apache_beam.runners.dataflow.dataflow_runner:dataflow_runner.py:242 2022-08-09T16:00:47.287Z: JOB_MESSAGE_BASIC: Finished operation Create/Impulse+Create/FlatMap(<lambda at core.py:3481>)+Create/MaybeReshuffle/Reshuffle/AddRandomKeys+Create/MaybeReshuffle/Reshuffle/ReshufflePerKey/Map(reify_timestamps)+Create/MaybeReshuffle/Reshuffle/ReshufflePerKey/GroupByKey/Reify+Create/MaybeReshuffle/Reshuffle/ReshufflePerKey/GroupByKey/Write
[32mINFO [0m apache_beam.runners.dataflow.dataflow_runner:dataflow_runner.py:242 2022-08-09T16:00:47.379Z: JOB_MESSAGE_BASIC: Executing operation Create/MaybeReshuffle/Reshuffle/ReshufflePerKey/GroupByKey/Close
[32mINFO [0m apache_beam.runners.dataflow.dataflow_runner:dataflow_runner.py:242 2022-08-09T16:00:47.438Z: JOB_MESSAGE_BASIC: Finished operation Create/MaybeReshuffle/Reshuffle/ReshufflePerKey/GroupByKey/Close
[32mINFO [0m apache_beam.runners.dataflow.dataflow_runner:dataflow_runner.py:242 2022-08-09T16:00:47.503Z: JOB_MESSAGE_BASIC: Executing operation GroupByKey/Create
[32mINFO [0m apache_beam.runners.dataflow.dataflow_runner:dataflow_runner.py:242 2022-08-09T16:00:47.687Z: JOB_MESSAGE_BASIC: Finished operation GroupByKey/Create
[32mINFO [0m apache_beam.runners.dataflow.dataflow_runner:dataflow_runner.py:242 2022-08-09T16:00:47.766Z: JOB_MESSAGE_DEBUG: Value "GroupByKey/Session" materialized.
[32mINFO [0m apache_beam.runners.dataflow.dataflow_runner:dataflow_runner.py:242 2022-08-09T16:00:47.832Z: JOB_MESSAGE_BASIC: Executing operation Create/MaybeReshuffle/Reshuffle/ReshufflePerKey/GroupByKey/Read+Create/MaybeReshuffle/Reshuffle/ReshufflePerKey/GroupByKey/GroupByWindow+Create/MaybeReshuffle/Reshuffle/ReshufflePerKey/FlatMap(restore_timestamps)+Create/MaybeReshuffle/Reshuffle/RemoveRandomKeys+Create/Map(decode)+metrics+map_to_common_key+GroupByKey/Write
[32mINFO [0m apache_beam.runners.dataflow.dataflow_runner:dataflow_runner.py:242 2022-08-09T16:00:55.332Z: JOB_MESSAGE_BASIC: Finished operation Create/MaybeReshuffle/Reshuffle/ReshufflePerKey/GroupByKey/Read+Create/MaybeReshuffle/Reshuffle/ReshufflePerKey/GroupByKey/GroupByWindow+Create/MaybeReshuffle/Reshuffle/ReshufflePerKey/FlatMap(restore_timestamps)+Create/MaybeReshuffle/Reshuffle/RemoveRandomKeys+Create/Map(decode)+metrics+map_to_common_key+GroupByKey/Write
[32mINFO [0m apache_beam.runners.dataflow.dataflow_runner:dataflow_runner.py:242 2022-08-09T16:00:55.386Z: JOB_MESSAGE_BASIC: Executing operation GroupByKey/Close
[32mINFO [0m apache_beam.runners.dataflow.dataflow_runner:dataflow_runner.py:242 2022-08-09T16:00:55.437Z: JOB_MESSAGE_BASIC: Finished operation GroupByKey/Close
[32mINFO [0m apache_beam.runners.dataflow.dataflow_runner:dataflow_runner.py:242 2022-08-09T16:00:55.506Z: JOB_MESSAGE_BASIC: Executing operation GroupByKey/Read+m_out
[32mINFO [0m apache_beam.runners.dataflow.dataflow_runner:dataflow_runner.py:242 2022-08-09T16:00:56.709Z: JOB_MESSAGE_BASIC: Finished operation GroupByKey/Read+m_out
[32mINFO [0m apache_beam.runners.dataflow.dataflow_runner:dataflow_runner.py:242 2022-08-09T16:00:56.808Z: JOB_MESSAGE_DEBUG: Executing success step success17
[32mINFO [0m apache_beam.runners.dataflow.dataflow_runner:dataflow_runner.py:242 2022-08-09T16:00:56.870Z: JOB_MESSAGE_DETAILED: Cleaning up.
[32mINFO [0m apache_beam.runners.dataflow.dataflow_runner:dataflow_runner.py:242 2022-08-09T16:00:56.921Z: JOB_MESSAGE_DEBUG: Starting worker pool teardown.
[32mINFO [0m apache_beam.runners.dataflow.dataflow_runner:dataflow_runner.py:242 2022-08-09T16:00:56.949Z: JOB_MESSAGE_BASIC: Stopping worker pool...
[32mINFO [0m apache_beam.runners.dataflow.dataflow_runner:dataflow_runner.py:242 2022-08-09T16:01:29.729Z: JOB_MESSAGE_DETAILED: Autoscaling: Resized worker pool from 1 to 0.
[32mINFO [0m apache_beam.runners.dataflow.dataflow_runner:dataflow_runner.py:242 2022-08-09T16:01:29.769Z: JOB_MESSAGE_BASIC: Worker pool stopped.
[32mINFO [0m apache_beam.runners.dataflow.dataflow_runner:dataflow_runner.py:242 2022-08-09T16:01:29.787Z: JOB_MESSAGE_DEBUG: Tearing down pending resources...
[32mINFO [0m apache_beam.runners.dataflow.dataflow_runner:dataflow_runner.py:197 Job 2022-08-09_08_54_17-3949643832142601121 is in state JOB_STATE_DONE
[33m=============================== warnings summary ===============================[0m
../../build/gradleenv/-1734967051/lib/python3.8/site-packages/hdfs/config.py:15
../../build/gradleenv/-1734967051/lib/python3.8/site-packages/hdfs/config.py:15
../../build/gradleenv/-1734967051/lib/python3.8/site-packages/hdfs/config.py:15
../../build/gradleenv/-1734967051/lib/python3.8/site-packages/hdfs/config.py:15
../../build/gradleenv/-1734967051/lib/python3.8/site-packages/hdfs/config.py:15
../../build/gradleenv/-1734967051/lib/python3.8/site-packages/hdfs/config.py:15
../../build/gradleenv/-1734967051/lib/python3.8/site-packages/hdfs/config.py:15
../../build/gradleenv/-1734967051/lib/python3.8/site-packages/hdfs/config.py:15
../../build/gradleenv/-1734967051/lib/python3.8/site-packages/hdfs/config.py:15
<https://ci-beam.apache.org/job/beam_PostCommit_Python38/ws/src/build/gradleenv/-1734967051/lib/python3.8/site-packages/hdfs/config.py>:15: DeprecationWarning: the imp module is deprecated in favour of importlib; see the module's documentation for alternative uses
from imp import load_source
../../build/gradleenv/-1734967051/lib/python3.8/site-packages/tenacity/_asyncio.py:42
../../build/gradleenv/-1734967051/lib/python3.8/site-packages/tenacity/_asyncio.py:42
../../build/gradleenv/-1734967051/lib/python3.8/site-packages/tenacity/_asyncio.py:42
../../build/gradleenv/-1734967051/lib/python3.8/site-packages/tenacity/_asyncio.py:42
../../build/gradleenv/-1734967051/lib/python3.8/site-packages/tenacity/_asyncio.py:42
../../build/gradleenv/-1734967051/lib/python3.8/site-packages/tenacity/_asyncio.py:42
../../build/gradleenv/-1734967051/lib/python3.8/site-packages/tenacity/_asyncio.py:42
../../build/gradleenv/-1734967051/lib/python3.8/site-packages/tenacity/_asyncio.py:42
<https://ci-beam.apache.org/job/beam_PostCommit_Python38/ws/src/build/gradleenv/-1734967051/lib/python3.8/site-packages/tenacity/_asyncio.py>:42: DeprecationWarning: "@coroutine" decorator is deprecated since Python 3.8, use "async def" instead
def call(self, fn, *args, **kwargs):
apache_beam/examples/complete/game/leader_board_it_test.py::LeaderBoardIT::test_leader_board_it
apache_beam/examples/complete/game/game_stats_it_test.py::GameStatsIT::test_game_stats_it
apache_beam/examples/complete/game/hourly_team_score_it_test.py::HourlyTeamScoreIT::test_hourly_team_score_it
apache_beam/io/gcp/bigquery_test.py::PubSubBigQueryIT::test_file_loads
apache_beam/io/gcp/bigquery_test.py::PubSubBigQueryIT::test_streaming_inserts
<https://ci-beam.apache.org/job/beam_PostCommit_Python38/ws/src/sdks/python/apache_beam/io/gcp/tests/utils.py>:63: PendingDeprecationWarning: Client.dataset is deprecated and will be removed in a future version. Use a string like 'my_project.my_dataset' or a cloud.google.bigquery.DatasetReference object, instead.
dataset_ref = client.dataset(unique_dataset_name, project=project)
apache_beam/examples/complete/game/leader_board_it_test.py: 2 warnings
apache_beam/examples/complete/game/game_stats_it_test.py: 2 warnings
apache_beam/examples/complete/game/hourly_team_score_it_test.py: 1 warning
apache_beam/examples/cookbook/bigquery_tornadoes_it_test.py: 1 warning
apache_beam/io/gcp/big_query_query_to_table_it_test.py: 6 warnings
apache_beam/io/gcp/bigquery_test.py: 6 warnings
apache_beam/io/gcp/bigquery_file_loads_test.py: 3 warnings
apache_beam/io/gcp/bigquery_write_it_test.py: 4 warnings
apache_beam/io/gcp/bigquery_json_it_test.py: 2 warnings
<https://ci-beam.apache.org/job/beam_PostCommit_Python38/ws/src/sdks/python/apache_beam/io/gcp/bigquery.py>:2285: BeamDeprecationWarning: options is deprecated since First stable release. References to <pipeline>.options will not be supported
is_streaming_pipeline = p.options.view_as(StandardOptions).streaming
apache_beam/examples/complete/game/leader_board_it_test.py: 2 warnings
apache_beam/examples/complete/game/game_stats_it_test.py: 2 warnings
apache_beam/examples/complete/game/hourly_team_score_it_test.py: 1 warning
apache_beam/examples/cookbook/bigquery_tornadoes_it_test.py: 1 warning
apache_beam/io/gcp/big_query_query_to_table_it_test.py: 6 warnings
apache_beam/io/gcp/bigquery_test.py: 6 warnings
apache_beam/io/gcp/bigquery_file_loads_test.py: 3 warnings
apache_beam/io/gcp/bigquery_write_it_test.py: 4 warnings
apache_beam/io/gcp/bigquery_json_it_test.py: 2 warnings
<https://ci-beam.apache.org/job/beam_PostCommit_Python38/ws/src/sdks/python/apache_beam/io/gcp/bigquery.py>:2291: BeamDeprecationWarning: options is deprecated since First stable release. References to <pipeline>.options will not be supported
experiments = p.options.view_as(DebugOptions).experiments or []
apache_beam/examples/complete/game/hourly_team_score_it_test.py: 1 warning
apache_beam/examples/cookbook/bigquery_tornadoes_it_test.py: 1 warning
apache_beam/io/gcp/big_query_query_to_table_it_test.py: 6 warnings
apache_beam/io/gcp/bigquery_file_loads_test.py: 3 warnings
apache_beam/io/gcp/bigquery_test.py: 3 warnings
apache_beam/io/gcp/bigquery_write_it_test.py: 3 warnings
<https://ci-beam.apache.org/job/beam_PostCommit_Python38/ws/src/sdks/python/apache_beam/io/gcp/bigquery_file_loads.py>:1129: BeamDeprecationWarning: options is deprecated since First stable release. References to <pipeline>.options will not be supported
temp_location = p.options.view_as(GoogleCloudOptions).temp_location
apache_beam/examples/complete/game/hourly_team_score_it_test.py: 1 warning
apache_beam/examples/cookbook/bigquery_tornadoes_it_test.py: 1 warning
apache_beam/io/gcp/big_query_query_to_table_it_test.py: 6 warnings
apache_beam/io/gcp/bigquery_file_loads_test.py: 3 warnings
apache_beam/io/gcp/bigquery_test.py: 3 warnings
apache_beam/io/gcp/bigquery_write_it_test.py: 3 warnings
<https://ci-beam.apache.org/job/beam_PostCommit_Python38/ws/src/sdks/python/apache_beam/io/gcp/bigquery_file_loads.py>:1131: BeamDeprecationWarning: options is deprecated since First stable release. References to <pipeline>.options will not be supported
p.options.view_as(GoogleCloudOptions).job_name or 'AUTOMATIC_JOB_NAME')
apache_beam/examples/cookbook/bigquery_tornadoes_it_test.py: 1 warning
apache_beam/examples/dataframe/flight_delays_it_test.py: 1 warning
apache_beam/io/gcp/big_query_query_to_table_it_test.py: 6 warnings
apache_beam/io/gcp/bigquery_io_read_it_test.py: 2 warnings
apache_beam/io/gcp/bigquery_read_it_test.py: 7 warnings
apache_beam/io/gcp/bigquery_json_it_test.py: 3 warnings
<https://ci-beam.apache.org/job/beam_PostCommit_Python38/ws/src/sdks/python/apache_beam/io/gcp/bigquery.py>:2774: BeamDeprecationWarning: options is deprecated since First stable release. References to <pipeline>.options will not be supported
temp_location = pcoll.pipeline.options.view_as(
apache_beam/examples/cookbook/bigquery_tornadoes_it_test.py: 1 warning
apache_beam/examples/dataframe/flight_delays_it_test.py: 1 warning
apache_beam/io/gcp/big_query_query_to_table_it_test.py: 6 warnings
apache_beam/io/gcp/bigquery_io_read_it_test.py: 2 warnings
apache_beam/io/gcp/bigquery_read_it_test.py: 7 warnings
apache_beam/io/gcp/bigquery_json_it_test.py: 3 warnings
<https://ci-beam.apache.org/job/beam_PostCommit_Python38/ws/src/sdks/python/apache_beam/io/gcp/bigquery.py>:2776: BeamDeprecationWarning: options is deprecated since First stable release. References to <pipeline>.options will not be supported
job_name = pcoll.pipeline.options.view_as(GoogleCloudOptions).job_name
apache_beam/examples/cookbook/bigquery_tornadoes_it_test.py: 1 warning
apache_beam/examples/dataframe/flight_delays_it_test.py: 1 warning
apache_beam/io/gcp/big_query_query_to_table_it_test.py: 6 warnings
apache_beam/io/gcp/bigquery_io_read_it_test.py: 2 warnings
apache_beam/io/gcp/bigquery_read_it_test.py: 7 warnings
apache_beam/io/gcp/bigquery_json_it_test.py: 3 warnings
<https://ci-beam.apache.org/job/beam_PostCommit_Python38/ws/src/sdks/python/apache_beam/io/gcp/bigquery.py>:2800: BeamDeprecationWarning: options is deprecated since First stable release. References to <pipeline>.options will not be supported
pipeline_options=pcoll.pipeline.options,
apache_beam/examples/cookbook/bigquery_tornadoes_it_test.py: 1 warning
apache_beam/io/gcp/big_query_query_to_table_it_test.py: 6 warnings
apache_beam/io/gcp/bigquery_write_it_test.py: 4 warnings
apache_beam/io/gcp/bigquery_test.py: 2 warnings
<https://ci-beam.apache.org/job/beam_PostCommit_Python38/ws/src/sdks/python/apache_beam/io/gcp/bigquery.py>:2281: BeamDeprecationWarning: options is deprecated since First stable release. References to <pipeline>.options will not be supported
self.table_reference.projectId = pcoll.pipeline.options.view_as(
apache_beam/examples/cookbook/bigquery_tornadoes_it_test.py::BigqueryTornadoesIT::test_bigquery_tornadoes_it
<https://ci-beam.apache.org/job/beam_PostCommit_Python38/ws/src/sdks/python/apache_beam/io/gcp/tests/utils.py>:100: PendingDeprecationWarning: Client.dataset is deprecated and will be removed in a future version. Use a string like 'my_project.my_dataset' or a cloud.google.bigquery.DatasetReference object, instead.
table_ref = client.dataset(dataset_id).table(table_id)
apache_beam/examples/dataframe/taxiride_it_test.py::TaxirideIT::test_aggregation
apache_beam/examples/dataframe/flight_delays_it_test.py::FlightDelaysTest::test_flight_delays
apache_beam/examples/dataframe/taxiride_it_test.py::TaxirideIT::test_enrich
<https://ci-beam.apache.org/job/beam_PostCommit_Python38/ws/src/sdks/python/apache_beam/dataframe/io.py>:629: FutureWarning: WriteToFiles is experimental.
return pcoll | fileio.WriteToFiles(
apache_beam/examples/dataframe/taxiride_it_test.py::TaxirideIT::test_aggregation
apache_beam/examples/dataframe/flight_delays_it_test.py::FlightDelaysTest::test_flight_delays
apache_beam/examples/dataframe/taxiride_it_test.py::TaxirideIT::test_enrich
<https://ci-beam.apache.org/job/beam_PostCommit_Python38/ws/src/sdks/python/apache_beam/io/fileio.py>:581: BeamDeprecationWarning: options is deprecated since First stable release. References to <pipeline>.options will not be supported
p.options.view_as(GoogleCloudOptions).temp_location or
apache_beam/examples/dataframe/flight_delays_it_test.py::FlightDelaysTest::test_flight_delays
<https://ci-beam.apache.org/job/beam_PostCommit_Python38/ws/src/sdks/python/apache_beam/examples/dataframe/flight_delays.py>:47: FutureWarning: Dropping of nuisance columns in DataFrame reductions (with 'numeric_only=None') is deprecated; in a future version this will raise TypeError. Select only valid columns before calling the reduction.
return airline_df[at_top_airports].mean()
apache_beam/io/gcp/bigquery_test.py::BigQueryStreamingInsertTransformIntegrationTests::test_multiple_destinations_transform
<https://ci-beam.apache.org/job/beam_PostCommit_Python38/ws/src/sdks/python/apache_beam/io/gcp/bigquery_test.py>:1846: BeamDeprecationWarning: options is deprecated since First stable release. References to <pipeline>.options will not be supported
streaming = self.test_pipeline.options.view_as(StandardOptions).streaming
apache_beam/io/gcp/bigquery_read_it_test.py::ReadTests::test_native_source
<https://ci-beam.apache.org/job/beam_PostCommit_Python38/ws/src/sdks/python/apache_beam/io/gcp/bigquery_read_it_test.py>:171: BeamDeprecationWarning: BigQuerySource is deprecated since 2.25.0. Use ReadFromBigQuery instead.
beam.io.BigQuerySource(query=self.query, use_standard_sql=True)))
apache_beam/ml/gcp/cloud_dlp_it_test.py::CloudDLPIT::test_deidentification
<https://ci-beam.apache.org/job/beam_PostCommit_Python38/ws/src/sdks/python/apache_beam/ml/gcp/cloud_dlp_it_test.py>:74: FutureWarning: MaskDetectedDetails is experimental.
| MaskDetectedDetails(
apache_beam/io/gcp/big_query_query_to_table_it_test.py::BigQueryQueryToTableIT::test_big_query_new_types_native
apache_beam/io/gcp/big_query_query_to_table_it_test.py::BigQueryQueryToTableIT::test_big_query_standard_sql_kms_key_native
<https://ci-beam.apache.org/job/beam_PostCommit_Python38/ws/src/sdks/python/apache_beam/io/gcp/big_query_query_to_table_pipeline.py>:81: BeamDeprecationWarning: BigQuerySource is deprecated since 2.25.0. Use ReadFromBigQuery instead.
beam.io.BigQuerySource(
apache_beam/io/gcp/big_query_query_to_table_it_test.py::BigQueryQueryToTableIT::test_big_query_new_types_native
apache_beam/io/gcp/big_query_query_to_table_it_test.py::BigQueryQueryToTableIT::test_big_query_standard_sql_kms_key_native
<https://ci-beam.apache.org/job/beam_PostCommit_Python38/ws/src/sdks/python/apache_beam/runners/dataflow/ptransform_overrides.py>:316: BeamDeprecationWarning: BigQuerySink is deprecated since 2.11.0. Use WriteToBigQuery instead.
io.BigQuerySink(
apache_beam/ml/gcp/cloud_dlp_it_test.py::CloudDLPIT::test_inspection
<https://ci-beam.apache.org/job/beam_PostCommit_Python38/ws/src/sdks/python/apache_beam/ml/gcp/cloud_dlp_it_test.py>:85: FutureWarning: InspectForDetails is experimental.
| InspectForDetails(
apache_beam/io/gcp/bigquery_json_it_test.py: 1 warning
apache_beam/io/gcp/bigquery_read_it_test.py: 9 warnings
<https://ci-beam.apache.org/job/beam_PostCommit_Python38/ws/src/sdks/python/apache_beam/io/gcp/bigquery.py>:2818: BeamDeprecationWarning: options is deprecated since First stable release. References to <pipeline>.options will not be supported
project_id = pcoll.pipeline.options.view_as(GoogleCloudOptions).project
apache_beam/io/gcp/bigquery_json_it_test.py: 1 warning
apache_beam/io/gcp/bigquery_read_it_test.py: 9 warnings
<https://ci-beam.apache.org/job/beam_PostCommit_Python38/ws/src/sdks/python/apache_beam/io/gcp/bigquery.py>:2839: BeamDeprecationWarning: options is deprecated since First stable release. References to <pipeline>.options will not be supported
pipeline_options=pcoll.pipeline.options,
apache_beam/io/gcp/bigquery_read_it_test.py::ReadNewTypesTests::test_native_source
<https://ci-beam.apache.org/job/beam_PostCommit_Python38/ws/src/sdks/python/apache_beam/io/gcp/bigquery_read_it_test.py>:646: BeamDeprecationWarning: BigQuerySource is deprecated since 2.25.0. Use ReadFromBigQuery instead.
beam.io.BigQuerySource(query=self.query, use_standard_sql=True)))
apache_beam/io/gcp/bigquery_read_it_test.py::ReadAllBQTests::test_read_queries
<https://ci-beam.apache.org/job/beam_PostCommit_Python38/ws/src/sdks/python/apache_beam/io/gcp/bigquery_read_it_test.py>:761: FutureWarning: ReadAllFromBigQuery is experimental.
| beam.io.ReadAllFromBigQuery())
apache_beam/io/gcp/bigquery_read_it_test.py::ReadAllBQTests::test_read_queries
<https://ci-beam.apache.org/job/beam_PostCommit_Python38/ws/src/sdks/python/apache_beam/io/gcp/bigquery.py>:2947: BeamDeprecationWarning: options is deprecated since First stable release. References to <pipeline>.options will not be supported
job_name = pcoll.pipeline.options.view_as(GoogleCloudOptions).job_name
apache_beam/io/gcp/bigquery_read_it_test.py::ReadAllBQTests::test_read_queries
<https://ci-beam.apache.org/job/beam_PostCommit_Python38/ws/src/sdks/python/apache_beam/io/gcp/bigquery.py>:2948: BeamDeprecationWarning: options is deprecated since First stable release. References to <pipeline>.options will not be supported
project = pcoll.pipeline.options.view_as(GoogleCloudOptions).project
apache_beam/io/gcp/bigquery_read_it_test.py::ReadAllBQTests::test_read_queries
<https://ci-beam.apache.org/job/beam_PostCommit_Python38/ws/src/sdks/python/apache_beam/io/gcp/bigquery.py>:2961: BeamDeprecationWarning: options is deprecated since First stable release. References to <pipeline>.options will not be supported
options=pcoll.pipeline.options,
-- Docs: https://docs.pytest.org/en/stable/how-to/capture-warnings.html
- generated xml file: <https://ci-beam.apache.org/job/beam_PostCommit_Python38/ws/src/sdks/python/pytest_postCommitIT-df-py38.xml> -
=========================== short test summary info ============================
FAILED apache_beam/runners/dataflow/dataflow_exercise_metrics_pipeline_test.py::ExerciseMetricsPipelineTest::test_metrics_it
[31m===== [31m[1m1 failed[0m, [32m82 passed[0m, [33m11 skipped[0m, [33m224 warnings[0m[31m in 10514.47s (2:55:14)[0m[31m =====[0m
> Task :sdks:python:test-suites:dataflow:py38:postCommitIT FAILED
FAILURE: Build failed with an exception.
* Where:
Script '<https://ci-beam.apache.org/job/beam_PostCommit_Python38/ws/src/sdks/python/test-suites/dataflow/common.gradle'> line: 121
* What went wrong:
Execution failed for task ':sdks:python:test-suites:dataflow:py38:postCommitIT'.
> Process 'command 'sh'' finished with non-zero exit value 1
* Try:
> Run with --stacktrace option to get the stack trace.
> Run with --info or --debug option to get more log output.
> Run with --scan to get full insights.
* Get more help at https://help.gradle.org
Deprecated Gradle features were used in this build, making it incompatible with Gradle 8.0.
You can use '--warning-mode all' to show the individual deprecation warnings and determine if they come from your own scripts or plugins.
See https://docs.gradle.org/7.4/userguide/command_line_interface.html#sec:command_line_warnings
Execution optimizations have been disabled for 1 invalid unit(s) of work during this build to ensure correctness.
Please consult deprecation warnings for more details.
BUILD FAILED in 2h 57m 25s
220 actionable tasks: 150 executed, 64 from cache, 6 up-to-date
Publishing build scan...
https://gradle.com/s/givq4b7yn67qy
Build step 'Invoke Gradle script' changed build result to FAILURE
Build step 'Invoke Gradle script' marked build as failure
---------------------------------------------------------------------
To unsubscribe, e-mail: builds-unsubscribe@beam.apache.org
For additional commands, e-mail: builds-help@beam.apache.org
beam_PostCommit_Python38 - Build # 2984 - Aborted!
Posted by Apache Jenkins Server <je...@builds.apache.org>.
beam_PostCommit_Python38 - Build # 2984 - Aborted:
Check console output at https://ci-beam.apache.org/job/beam_PostCommit_Python38/2984/ to view the results.
beam_PostCommit_Python38 - Build # 2983 - Aborted!
Posted by Apache Jenkins Server <je...@builds.apache.org>.
beam_PostCommit_Python38 - Build # 2983 - Aborted:
Check console output at https://ci-beam.apache.org/job/beam_PostCommit_Python38/2983/ to view the results.