You are viewing a plain text version of this content. The canonical link for it is here.
Posted to common-dev@hadoop.apache.org by "Gabor Bota (JIRA)" <ji...@apache.org> on 2019/07/11 13:10:00 UTC

[jira] [Created] (HADOOP-16422) AbstractITCommitMRJob.testMRJob test failures

Gabor Bota created HADOOP-16422:
-----------------------------------

             Summary: AbstractITCommitMRJob.testMRJob test failures
                 Key: HADOOP-16422
                 URL: https://issues.apache.org/jira/browse/HADOOP-16422
             Project: Hadoop Common
          Issue Type: Sub-task
          Components: fs/s3
    Affects Versions: 3.2.0
            Reporter: Gabor Bota


There are 4 recurring test failures based on AbstractITCommitMRJob.testMRJob in S3A:
```
[ERROR]   ITestMagicCommitMRJob>AbstractITCommitMRJob.testMRJob:146->AbstractFSContractTestBase.assertIsDirectory:327 ? FileNotFound
[ERROR]   ITestDirectoryCommitMRJob>AbstractITCommitMRJob.testMRJob:146->AbstractFSContractTestBase.assertIsDirectory:327 ? FileNotFound
[ERROR]   ITestPartitionCommitMRJob>AbstractITCommitMRJob.testMRJob:146->AbstractFSContractTestBase.assertIsDirectory:327 ? FileNotFound
[ERROR]   ITestStagingCommitMRJob>AbstractITCommitMRJob.testMRJob:146->AbstractFSContractTestBase.assertIsDirectory:327 ? FileNotFound
```
The full stack traces:
```
[ERROR] Tests run: 1, Failures: 0, Errors: 1, Skipped: 0, Time elapsed: 58.639 s <<< FAILURE! - in org.apache.hadoop.fs.s3a.commit.staging.integration.ITestPartitionCommitMRJob
[ERROR] testMRJob(org.apache.hadoop.fs.s3a.commit.staging.integration.ITestPartitionCommitMRJob)  Time elapsed: 34.236 s  <<< ERROR!
java.io.FileNotFoundException: Path s3a://gabota-versioned-bucket-ireland/test/DELAY_LISTING_ME/testMRJob is recorded as deleted by S3Guard at 2019-07-11T12:06:20.159Z
	at org.apache.hadoop.fs.s3a.S3AFileSystem.innerGetFileStatus(S3AFileSystem.java:2634)
	at org.apache.hadoop.fs.s3a.S3AFileSystem.getFileStatus(S3AFileSystem.java:2601)
	at org.apache.hadoop.fs.contract.ContractTestUtils.assertIsDirectory(ContractTestUtils.java:561)
	at org.apache.hadoop.fs.contract.AbstractFSContractTestBase.assertIsDirectory(AbstractFSContractTestBase.java:327)
	at org.apache.hadoop.fs.s3a.commit.AbstractITCommitMRJob.testMRJob(AbstractITCommitMRJob.java:146)
	at sun.reflect.NativeMethodAccessorImpl.invoke0(Native Method)
	at sun.reflect.NativeMethodAccessorImpl.invoke(NativeMethodAccessorImpl.java:62)
	at sun.reflect.DelegatingMethodAccessorImpl.invoke(DelegatingMethodAccessorImpl.java:43)
	at java.lang.reflect.Method.invoke(Method.java:498)
	at org.junit.runners.model.FrameworkMethod$1.runReflectiveCall(FrameworkMethod.java:50)
	at org.junit.internal.runners.model.ReflectiveCallable.run(ReflectiveCallable.java:12)
	at org.junit.runners.model.FrameworkMethod.invokeExplosively(FrameworkMethod.java:47)
	at org.junit.internal.runners.statements.InvokeMethod.evaluate(InvokeMethod.java:17)
	at org.junit.internal.runners.statements.RunBefores.evaluate(RunBefores.java:26)
	at org.junit.internal.runners.statements.RunAfters.evaluate(RunAfters.java:27)
	at org.junit.rules.ExternalResource$1.evaluate(ExternalResource.java:48)
	at org.junit.rules.TestWatcher$1.evaluate(TestWatcher.java:55)
	at org.junit.internal.runners.statements.FailOnTimeout$CallableStatement.call(FailOnTimeout.java:298)
	at org.junit.internal.runners.statements.FailOnTimeout$CallableStatement.call(FailOnTimeout.java:292)
	at java.util.concurrent.FutureTask.run(FutureTask.java:266)
	at java.lang.Thread.run(Thread.java:748)
```
```
[ERROR] Tests run: 2, Failures: 0, Errors: 1, Skipped: 0, Time elapsed: 70.31 s <<< FAILURE! - in org.apache.hadoop.fs.s3a.commit.staging.integration.ITestStagingCommitMRJob
[ERROR] testMRJob(org.apache.hadoop.fs.s3a.commit.staging.integration.ITestStagingCommitMRJob)  Time elapsed: 29.917 s  <<< ERROR!
java.io.FileNotFoundException: Path s3a://gabota-versioned-bucket-ireland/test/DELAY_LISTING_ME/testMRJob is recorded as deleted by S3Guard at 2019-07-11T12:07:17.791Z
	at org.apache.hadoop.fs.s3a.S3AFileSystem.innerGetFileStatus(S3AFileSystem.java:2634)
	at org.apache.hadoop.fs.s3a.S3AFileSystem.getFileStatus(S3AFileSystem.java:2601)
	at org.apache.hadoop.fs.contract.ContractTestUtils.assertIsDirectory(ContractTestUtils.java:561)
	at org.apache.hadoop.fs.contract.AbstractFSContractTestBase.assertIsDirectory(AbstractFSContractTestBase.java:327)
	at org.apache.hadoop.fs.s3a.commit.AbstractITCommitMRJob.testMRJob(AbstractITCommitMRJob.java:146)
	at sun.reflect.NativeMethodAccessorImpl.invoke0(Native Method)
	at sun.reflect.NativeMethodAccessorImpl.invoke(NativeMethodAccessorImpl.java:62)
	at sun.reflect.DelegatingMethodAccessorImpl.invoke(DelegatingMethodAccessorImpl.java:43)
	at java.lang.reflect.Method.invoke(Method.java:498)
	at org.junit.runners.model.FrameworkMethod$1.runReflectiveCall(FrameworkMethod.java:50)
	at org.junit.internal.runners.model.ReflectiveCallable.run(ReflectiveCallable.java:12)
	at org.junit.runners.model.FrameworkMethod.invokeExplosively(FrameworkMethod.java:47)
	at org.junit.internal.runners.statements.InvokeMethod.evaluate(InvokeMethod.java:17)
	at org.junit.internal.runners.statements.RunBefores.evaluate(RunBefores.java:26)
	at org.junit.internal.runners.statements.RunAfters.evaluate(RunAfters.java:27)
	at org.junit.rules.ExternalResource$1.evaluate(ExternalResource.java:48)
	at org.junit.rules.TestWatcher$1.evaluate(TestWatcher.java:55)
	at org.junit.internal.runners.statements.FailOnTimeout$CallableStatement.call(FailOnTimeout.java:298)
	at org.junit.internal.runners.statements.FailOnTimeout$CallableStatement.call(FailOnTimeout.java:292)
	at java.util.concurrent.FutureTask.run(FutureTask.java:266)
	at java.lang.Thread.run(Thread.java:748)
```

```
[ERROR] Tests run: 1, Failures: 0, Errors: 1, Skipped: 0, Time elapsed: 67.665 s <<< FAILURE! - in org.apache.hadoop.fs.s3a.commit.staging.integration.ITestDirectoryCommitMRJob
[ERROR] testMRJob(org.apache.hadoop.fs.s3a.commit.staging.integration.ITestDirectoryCommitMRJob)  Time elapsed: 29.81 s  <<< ERROR!
java.io.FileNotFoundException: Path s3a://gabota-versioned-bucket-ireland/test/DELAY_LISTING_ME/testMRJob is recorded as deleted by S3Guard at 2019-07-11T12:08:25.533Z
	at org.apache.hadoop.fs.s3a.S3AFileSystem.innerGetFileStatus(S3AFileSystem.java:2634)
	at org.apache.hadoop.fs.s3a.S3AFileSystem.getFileStatus(S3AFileSystem.java:2601)
	at org.apache.hadoop.fs.contract.ContractTestUtils.assertIsDirectory(ContractTestUtils.java:561)
	at org.apache.hadoop.fs.contract.AbstractFSContractTestBase.assertIsDirectory(AbstractFSContractTestBase.java:327)
	at org.apache.hadoop.fs.s3a.commit.AbstractITCommitMRJob.testMRJob(AbstractITCommitMRJob.java:146)
	at sun.reflect.NativeMethodAccessorImpl.invoke0(Native Method)
	at sun.reflect.NativeMethodAccessorImpl.invoke(NativeMethodAccessorImpl.java:62)
	at sun.reflect.DelegatingMethodAccessorImpl.invoke(DelegatingMethodAccessorImpl.java:43)
	at java.lang.reflect.Method.invoke(Method.java:498)
	at org.junit.runners.model.FrameworkMethod$1.runReflectiveCall(FrameworkMethod.java:50)
	at org.junit.internal.runners.model.ReflectiveCallable.run(ReflectiveCallable.java:12)
	at org.junit.runners.model.FrameworkMethod.invokeExplosively(FrameworkMethod.java:47)
	at org.junit.internal.runners.statements.InvokeMethod.evaluate(InvokeMethod.java:17)
	at org.junit.internal.runners.statements.RunBefores.evaluate(RunBefores.java:26)
	at org.junit.internal.runners.statements.RunAfters.evaluate(RunAfters.java:27)
	at org.junit.rules.ExternalResource$1.evaluate(ExternalResource.java:48)
	at org.junit.rules.TestWatcher$1.evaluate(TestWatcher.java:55)
	at org.junit.internal.runners.statements.FailOnTimeout$CallableStatement.call(FailOnTimeout.java:298)
	at org.junit.internal.runners.statements.FailOnTimeout$CallableStatement.call(FailOnTimeout.java:292)
	at java.util.concurrent.FutureTask.run(FutureTask.java:266)
	at java.lang.Thread.run(Thread.java:748)
```

```
[ERROR] Tests run: 1, Failures: 0, Errors: 1, Skipped: 0, Time elapsed: 55.787 s <<< FAILURE! - in org.apache.hadoop.fs.s3a.commit.magic.ITestMagicCommitMRJob
[ERROR] testMRJob(org.apache.hadoop.fs.s3a.commit.magic.ITestMagicCommitMRJob)  Time elapsed: 34.97 s  <<< ERROR!
java.io.FileNotFoundException: Path s3a://gabota-versioned-bucket-ireland/test/testMRJob is recorded as deleted by S3Guard at 2019-07-11T12:09:32.970Z
	at org.apache.hadoop.fs.s3a.S3AFileSystem.innerGetFileStatus(S3AFileSystem.java:2634)
	at org.apache.hadoop.fs.s3a.S3AFileSystem.getFileStatus(S3AFileSystem.java:2601)
	at org.apache.hadoop.fs.contract.ContractTestUtils.assertIsDirectory(ContractTestUtils.java:561)
	at org.apache.hadoop.fs.contract.AbstractFSContractTestBase.assertIsDirectory(AbstractFSContractTestBase.java:327)
	at org.apache.hadoop.fs.s3a.commit.AbstractITCommitMRJob.testMRJob(AbstractITCommitMRJob.java:146)
	at sun.reflect.NativeMethodAccessorImpl.invoke0(Native Method)
	at sun.reflect.NativeMethodAccessorImpl.invoke(NativeMethodAccessorImpl.java:62)
	at sun.reflect.DelegatingMethodAccessorImpl.invoke(DelegatingMethodAccessorImpl.java:43)
	at java.lang.reflect.Method.invoke(Method.java:498)
	at org.junit.runners.model.FrameworkMethod$1.runReflectiveCall(FrameworkMethod.java:50)
	at org.junit.internal.runners.model.ReflectiveCallable.run(ReflectiveCallable.java:12)
	at org.junit.runners.model.FrameworkMethod.invokeExplosively(FrameworkMethod.java:47)
	at org.junit.internal.runners.statements.InvokeMethod.evaluate(InvokeMethod.java:17)
	at org.junit.internal.runners.statements.RunBefores.evaluate(RunBefores.java:26)
	at org.junit.internal.runners.statements.RunAfters.evaluate(RunAfters.java:27)
	at org.junit.rules.ExternalResource$1.evaluate(ExternalResource.java:48)
	at org.junit.rules.TestWatcher$1.evaluate(TestWatcher.java:55)
	at org.junit.internal.runners.statements.FailOnTimeout$CallableStatement.call(FailOnTimeout.java:298)
	at org.junit.internal.runners.statements.FailOnTimeout$CallableStatement.call(FailOnTimeout.java:292)
	at java.util.concurrent.FutureTask.run(FutureTask.java:266)
	at java.lang.Thread.run(Thread.java:748)
```



--
This message was sent by Atlassian JIRA
(v7.6.14#76016)

---------------------------------------------------------------------
To unsubscribe, e-mail: common-dev-unsubscribe@hadoop.apache.org
For additional commands, e-mail: common-dev-help@hadoop.apache.org