You are viewing a plain text version of this content. The canonical link for it is here.
Posted to common-dev@hadoop.apache.org by Apache Jenkins Server <je...@builds.apache.org> on 2016/01/14 16:48:05 UTC
Build failed in Jenkins: Hadoop-Common-trunk #2228
See <https://builds.apache.org/job/Hadoop-Common-trunk/2228/changes>
Changes:
[junping_du] Remove .CHANGES.txt.swp that wrongly checked in.
------------------------------------------
[...truncated 5415 lines...]
Running org.apache.hadoop.security.TestGroupsCaching
Tests run: 10, Failures: 0, Errors: 0, Skipped: 0, Time elapsed: 1.964 sec - in org.apache.hadoop.security.TestGroupsCaching
Running org.apache.hadoop.security.ssl.TestSSLFactory
Tests run: 15, Failures: 0, Errors: 0, Skipped: 0, Time elapsed: 3.274 sec - in org.apache.hadoop.security.ssl.TestSSLFactory
Running org.apache.hadoop.security.ssl.TestReloadingX509TrustManager
Tests run: 5, Failures: 0, Errors: 0, Skipped: 0, Time elapsed: 2.636 sec - in org.apache.hadoop.security.ssl.TestReloadingX509TrustManager
Running org.apache.hadoop.security.TestUGILoginFromKeytab
Tests run: 1, Failures: 0, Errors: 0, Skipped: 0, Time elapsed: 5.427 sec - in org.apache.hadoop.security.TestUGILoginFromKeytab
Running org.apache.hadoop.security.TestUserGroupInformation
Tests run: 34, Failures: 0, Errors: 0, Skipped: 0, Time elapsed: 3.797 sec - in org.apache.hadoop.security.TestUserGroupInformation
Running org.apache.hadoop.security.TestUGIWithExternalKdc
Tests run: 1, Failures: 0, Errors: 0, Skipped: 1, Time elapsed: 0.083 sec - in org.apache.hadoop.security.TestUGIWithExternalKdc
Running org.apache.hadoop.security.http.TestCrossOriginFilter
Tests run: 9, Failures: 0, Errors: 0, Skipped: 0, Time elapsed: 0.465 sec - in org.apache.hadoop.security.http.TestCrossOriginFilter
Running org.apache.hadoop.security.TestProxyUserFromEnv
Tests run: 1, Failures: 0, Errors: 0, Skipped: 0, Time elapsed: 0.542 sec - in org.apache.hadoop.security.TestProxyUserFromEnv
Running org.apache.hadoop.security.authorize.TestProxyUsers
Tests run: 17, Failures: 0, Errors: 0, Skipped: 0, Time elapsed: 1.038 sec - in org.apache.hadoop.security.authorize.TestProxyUsers
Running org.apache.hadoop.security.authorize.TestProxyServers
Tests run: 1, Failures: 0, Errors: 0, Skipped: 0, Time elapsed: 0.456 sec - in org.apache.hadoop.security.authorize.TestProxyServers
Running org.apache.hadoop.security.authorize.TestServiceAuthorization
Tests run: 7, Failures: 0, Errors: 0, Skipped: 0, Time elapsed: 1.205 sec - in org.apache.hadoop.security.authorize.TestServiceAuthorization
Running org.apache.hadoop.security.authorize.TestAccessControlList
Tests run: 8, Failures: 0, Errors: 0, Skipped: 0, Time elapsed: 0.922 sec - in org.apache.hadoop.security.authorize.TestAccessControlList
Running org.apache.hadoop.security.alias.TestCredShell
Tests run: 9, Failures: 0, Errors: 0, Skipped: 0, Time elapsed: 1.214 sec - in org.apache.hadoop.security.alias.TestCredShell
Running org.apache.hadoop.security.alias.TestCredentialProviderFactory
Tests run: 6, Failures: 0, Errors: 0, Skipped: 0, Time elapsed: 1.381 sec - in org.apache.hadoop.security.alias.TestCredentialProviderFactory
Running org.apache.hadoop.security.alias.TestCredentialProvider
Tests run: 2, Failures: 0, Errors: 0, Skipped: 0, Time elapsed: 0.098 sec - in org.apache.hadoop.security.alias.TestCredentialProvider
Running org.apache.hadoop.security.TestAuthenticationFilter
Tests run: 1, Failures: 0, Errors: 0, Skipped: 0, Time elapsed: 0.655 sec - in org.apache.hadoop.security.TestAuthenticationFilter
Running org.apache.hadoop.security.TestLdapGroupsMapping
Tests run: 5, Failures: 0, Errors: 0, Skipped: 0, Time elapsed: 1.574 sec - in org.apache.hadoop.security.TestLdapGroupsMapping
Running org.apache.hadoop.security.token.TestToken
Tests run: 3, Failures: 0, Errors: 0, Skipped: 0, Time elapsed: 0.548 sec - in org.apache.hadoop.security.token.TestToken
Running org.apache.hadoop.security.token.delegation.TestDelegationToken
Tests run: 15, Failures: 0, Errors: 0, Skipped: 0, Time elapsed: 32.469 sec - in org.apache.hadoop.security.token.delegation.TestDelegationToken
Running org.apache.hadoop.security.token.delegation.web.TestDelegationTokenAuthenticationHandlerWithMocks
Tests run: 2, Failures: 0, Errors: 0, Skipped: 0, Time elapsed: 1.51 sec - in org.apache.hadoop.security.token.delegation.web.TestDelegationTokenAuthenticationHandlerWithMocks
Running org.apache.hadoop.security.token.delegation.web.TestDelegationTokenManager
Tests run: 2, Failures: 0, Errors: 0, Skipped: 0, Time elapsed: 0.865 sec - in org.apache.hadoop.security.token.delegation.web.TestDelegationTokenManager
Running org.apache.hadoop.security.token.delegation.web.TestWebDelegationToken
Tests run: 12, Failures: 0, Errors: 0, Skipped: 0, Time elapsed: 9.901 sec - in org.apache.hadoop.security.token.delegation.web.TestWebDelegationToken
Running org.apache.hadoop.security.token.delegation.TestZKDelegationTokenSecretManager
Tests run: 6, Failures: 0, Errors: 0, Skipped: 0, Time elapsed: 60.027 sec - in org.apache.hadoop.security.token.delegation.TestZKDelegationTokenSecretManager
Running org.apache.hadoop.security.TestShellBasedUnixGroupsMapping
Tests run: 4, Failures: 0, Errors: 0, Skipped: 0, Time elapsed: 0.423 sec - in org.apache.hadoop.security.TestShellBasedUnixGroupsMapping
Running org.apache.hadoop.security.TestShellBasedIdMapping
Tests run: 7, Failures: 0, Errors: 0, Skipped: 0, Time elapsed: 2.902 sec - in org.apache.hadoop.security.TestShellBasedIdMapping
Running org.apache.hadoop.security.TestCompositeGroupMapping
Tests run: 3, Failures: 0, Errors: 0, Skipped: 0, Time elapsed: 0.9 sec - in org.apache.hadoop.security.TestCompositeGroupMapping
Running org.apache.hadoop.security.TestSecurityUtil
Tests run: 17, Failures: 0, Errors: 0, Skipped: 0, Time elapsed: 0.994 sec - in org.apache.hadoop.security.TestSecurityUtil
Running org.apache.hadoop.security.TestHttpCrossOriginFilterInitializer
Tests run: 1, Failures: 0, Errors: 0, Skipped: 0, Time elapsed: 0.362 sec - in org.apache.hadoop.security.TestHttpCrossOriginFilterInitializer
Running org.apache.hadoop.security.TestJNIGroupsMapping
Tests run: 1, Failures: 0, Errors: 0, Skipped: 0, Time elapsed: 0.693 sec - in org.apache.hadoop.security.TestJNIGroupsMapping
Running org.apache.hadoop.security.TestLdapGroupsMappingWithPosixGroup
Tests run: 1, Failures: 0, Errors: 0, Skipped: 0, Time elapsed: 0.827 sec - in org.apache.hadoop.security.TestLdapGroupsMappingWithPosixGroup
Running org.apache.hadoop.security.TestDoAsEffectiveUser
Tests run: 9, Failures: 0, Errors: 0, Skipped: 0, Time elapsed: 1.777 sec - in org.apache.hadoop.security.TestDoAsEffectiveUser
Running org.apache.hadoop.security.TestNullGroupsMapping
Tests run: 1, Failures: 0, Errors: 0, Skipped: 0, Time elapsed: 0.095 sec - in org.apache.hadoop.security.TestNullGroupsMapping
Running org.apache.hadoop.security.TestUGIWithSecurityOn
Tests run: 2, Failures: 0, Errors: 0, Skipped: 2, Time elapsed: 0.096 sec - in org.apache.hadoop.security.TestUGIWithSecurityOn
Running org.apache.hadoop.security.TestWhitelistBasedResolver
Tests run: 3, Failures: 0, Errors: 0, Skipped: 0, Time elapsed: 0.58 sec - in org.apache.hadoop.security.TestWhitelistBasedResolver
Running org.apache.hadoop.security.TestCredentials
Tests run: 4, Failures: 0, Errors: 0, Skipped: 0, Time elapsed: 0.602 sec - in org.apache.hadoop.security.TestCredentials
Running org.apache.hadoop.security.TestGroupFallback
Tests run: 4, Failures: 0, Errors: 0, Skipped: 0, Time elapsed: 0.688 sec - in org.apache.hadoop.security.TestGroupFallback
Running org.apache.hadoop.util.TestLightWeightCache
Tests run: 1, Failures: 0, Errors: 0, Skipped: 0, Time elapsed: 8.547 sec - in org.apache.hadoop.util.TestLightWeightCache
Running org.apache.hadoop.util.TestHostsFileReader
Tests run: 7, Failures: 0, Errors: 0, Skipped: 0, Time elapsed: 0.224 sec - in org.apache.hadoop.util.TestHostsFileReader
Running org.apache.hadoop.util.TestDiskChecker
Tests run: 15, Failures: 0, Errors: 0, Skipped: 0, Time elapsed: 1.259 sec - in org.apache.hadoop.util.TestDiskChecker
Running org.apache.hadoop.util.TestProgress
Tests run: 1, Failures: 0, Errors: 0, Skipped: 0, Time elapsed: 0.175 sec - in org.apache.hadoop.util.TestProgress
Running org.apache.hadoop.util.TestGenericsUtil
Tests run: 6, Failures: 0, Errors: 0, Skipped: 0, Time elapsed: 0.368 sec - in org.apache.hadoop.util.TestGenericsUtil
Running org.apache.hadoop.util.TestChunkedArrayList
Tests run: 5, Failures: 0, Errors: 0, Skipped: 0, Time elapsed: 0.92 sec - in org.apache.hadoop.util.TestChunkedArrayList
Running org.apache.hadoop.util.TestVersionUtil
Tests run: 1, Failures: 0, Errors: 0, Skipped: 0, Time elapsed: 0.215 sec - in org.apache.hadoop.util.TestVersionUtil
Running org.apache.hadoop.util.TestProtoUtil
Tests run: 2, Failures: 0, Errors: 0, Skipped: 0, Time elapsed: 0.303 sec - in org.apache.hadoop.util.TestProtoUtil
Running org.apache.hadoop.util.TestLightWeightGSet
Tests run: 2, Failures: 0, Errors: 0, Skipped: 0, Time elapsed: 0.172 sec - in org.apache.hadoop.util.TestLightWeightGSet
Running org.apache.hadoop.util.TestGSet
Tests run: 7, Failures: 0, Errors: 0, Skipped: 0, Time elapsed: 1.871 sec - in org.apache.hadoop.util.TestGSet
Running org.apache.hadoop.util.TestStringInterner
Tests run: 3, Failures: 0, Errors: 0, Skipped: 0, Time elapsed: 0.126 sec - in org.apache.hadoop.util.TestStringInterner
Running org.apache.hadoop.util.TestZKUtil
Tests run: 9, Failures: 0, Errors: 0, Skipped: 0, Time elapsed: 0.163 sec - in org.apache.hadoop.util.TestZKUtil
Running org.apache.hadoop.util.TestStringUtils
Tests run: 14, Failures: 0, Errors: 0, Skipped: 0, Time elapsed: 0.336 sec - in org.apache.hadoop.util.TestStringUtils
Running org.apache.hadoop.util.TestFindClass
Tests run: 16, Failures: 0, Errors: 0, Skipped: 0, Time elapsed: 1.011 sec - in org.apache.hadoop.util.TestFindClass
Running org.apache.hadoop.util.TestGenericOptionsParser
Tests run: 7, Failures: 0, Errors: 0, Skipped: 0, Time elapsed: 1.251 sec - in org.apache.hadoop.util.TestGenericOptionsParser
Running org.apache.hadoop.util.TestRunJar
Tests run: 3, Failures: 0, Errors: 0, Skipped: 0, Time elapsed: 0.532 sec - in org.apache.hadoop.util.TestRunJar
Running org.apache.hadoop.util.TestSysInfoLinux
Tests run: 5, Failures: 0, Errors: 0, Skipped: 0, Time elapsed: 0.28 sec - in org.apache.hadoop.util.TestSysInfoLinux
Running org.apache.hadoop.util.TestDirectBufferPool
Tests run: 3, Failures: 0, Errors: 0, Skipped: 0, Time elapsed: 0.168 sec - in org.apache.hadoop.util.TestDirectBufferPool
Running org.apache.hadoop.util.TestFileBasedIPList
Tests run: 8, Failures: 0, Errors: 0, Skipped: 0, Time elapsed: 0.179 sec - in org.apache.hadoop.util.TestFileBasedIPList
Running org.apache.hadoop.util.TestIndexedSort
Tests run: 2, Failures: 0, Errors: 0, Skipped: 0, Time elapsed: 0.816 sec - in org.apache.hadoop.util.TestIndexedSort
Running org.apache.hadoop.util.TestIdentityHashStore
Tests run: 3, Failures: 0, Errors: 0, Skipped: 0, Time elapsed: 0.189 sec - in org.apache.hadoop.util.TestIdentityHashStore
Running org.apache.hadoop.util.TestMachineList
Tests run: 14, Failures: 0, Errors: 0, Skipped: 0, Time elapsed: 0.657 sec - in org.apache.hadoop.util.TestMachineList
Running org.apache.hadoop.util.TestWinUtils
Tests run: 11, Failures: 0, Errors: 0, Skipped: 11, Time elapsed: 0.315 sec - in org.apache.hadoop.util.TestWinUtils
Running org.apache.hadoop.util.hash.TestHash
Tests run: 1, Failures: 0, Errors: 0, Skipped: 0, Time elapsed: 0.477 sec - in org.apache.hadoop.util.hash.TestHash
Running org.apache.hadoop.util.TestSignalLogger
Tests run: 1, Failures: 0, Errors: 0, Skipped: 0, Time elapsed: 0.249 sec - in org.apache.hadoop.util.TestSignalLogger
Running org.apache.hadoop.util.TestApplicationClassLoader
Tests run: 4, Failures: 0, Errors: 0, Skipped: 0, Time elapsed: 0.272 sec - in org.apache.hadoop.util.TestApplicationClassLoader
Running org.apache.hadoop.util.TestNodeHealthScriptRunner
Tests run: 2, Failures: 0, Errors: 0, Skipped: 0, Time elapsed: 4.868 sec - in org.apache.hadoop.util.TestNodeHealthScriptRunner
Running org.apache.hadoop.util.TestCacheableIPList
Tests run: 4, Failures: 0, Errors: 0, Skipped: 0, Time elapsed: 1.344 sec - in org.apache.hadoop.util.TestCacheableIPList
Running org.apache.hadoop.util.TestSysInfoWindows
Tests run: 3, Failures: 0, Errors: 0, Skipped: 0, Time elapsed: 0.176 sec - in org.apache.hadoop.util.TestSysInfoWindows
Running org.apache.hadoop.util.TestClassUtil
Tests run: 1, Failures: 0, Errors: 0, Skipped: 0, Time elapsed: 0.081 sec - in org.apache.hadoop.util.TestClassUtil
Running org.apache.hadoop.util.TestOptions
Tests run: 2, Failures: 0, Errors: 0, Skipped: 0, Time elapsed: 0.079 sec - in org.apache.hadoop.util.TestOptions
Running org.apache.hadoop.util.TestShell
Tests run: 20, Failures: 0, Errors: 0, Skipped: 0, Time elapsed: 5.379 sec - in org.apache.hadoop.util.TestShell
Running org.apache.hadoop.util.TestAsyncDiskService
Tests run: 1, Failures: 0, Errors: 0, Skipped: 0, Time elapsed: 0.153 sec - in org.apache.hadoop.util.TestAsyncDiskService
Running org.apache.hadoop.util.TestPureJavaCrc32
Tests run: 1, Failures: 0, Errors: 0, Skipped: 0, Time elapsed: 0.578 sec - in org.apache.hadoop.util.TestPureJavaCrc32
Running org.apache.hadoop.util.TestDataChecksum
Tests run: 4, Failures: 0, Errors: 0, Skipped: 0, Time elapsed: 4.126 sec - in org.apache.hadoop.util.TestDataChecksum
Running org.apache.hadoop.util.TestShutdownThreadsHelper
Tests run: 2, Failures: 0, Errors: 0, Skipped: 0, Time elapsed: 3.188 sec - in org.apache.hadoop.util.TestShutdownThreadsHelper
Running org.apache.hadoop.util.TestHttpExceptionUtils
Tests run: 7, Failures: 0, Errors: 0, Skipped: 0, Time elapsed: 0.717 sec - in org.apache.hadoop.util.TestHttpExceptionUtils
Running org.apache.hadoop.util.TestNativeCodeLoader
Tests run: 1, Failures: 0, Errors: 0, Skipped: 0, Time elapsed: 0.164 sec - in org.apache.hadoop.util.TestNativeCodeLoader
Running org.apache.hadoop.util.TestReflectionUtils
Tests run: 5, Failures: 0, Errors: 0, Skipped: 0, Time elapsed: 0.651 sec - in org.apache.hadoop.util.TestReflectionUtils
Running org.apache.hadoop.util.TestNativeLibraryChecker
Tests run: 2, Failures: 0, Errors: 0, Skipped: 0, Time elapsed: 0.526 sec - in org.apache.hadoop.util.TestNativeLibraryChecker
Running org.apache.hadoop.util.TestShutdownHookManager
Tests run: 1, Failures: 0, Errors: 0, Skipped: 0, Time elapsed: 0.194 sec - in org.apache.hadoop.util.TestShutdownHookManager
Running org.apache.hadoop.util.TestClasspath
Tests run: 7, Failures: 0, Errors: 0, Skipped: 0, Time elapsed: 0.37 sec - in org.apache.hadoop.util.TestClasspath
Running org.apache.hadoop.util.TestLightWeightResizableGSet
Tests run: 2, Failures: 0, Errors: 0, Skipped: 0, Time elapsed: 0.465 sec - in org.apache.hadoop.util.TestLightWeightResizableGSet
Running org.apache.hadoop.util.bloom.TestBloomFilters
Tests run: 6, Failures: 0, Errors: 0, Skipped: 0, Time elapsed: 0.479 sec - in org.apache.hadoop.util.bloom.TestBloomFilters
Running org.apache.hadoop.util.TestConfTest
Tests run: 14, Failures: 0, Errors: 0, Skipped: 0, Time elapsed: 0.299 sec - in org.apache.hadoop.util.TestConfTest
Running org.apache.hadoop.util.TestStopWatch
Tests run: 3, Failures: 0, Errors: 0, Skipped: 0, Time elapsed: 0.077 sec - in org.apache.hadoop.util.TestStopWatch
Running org.apache.hadoop.util.TestJarFinder
Tests run: 4, Failures: 0, Errors: 0, Skipped: 0, Time elapsed: 0.768 sec - in org.apache.hadoop.util.TestJarFinder
Running org.apache.hadoop.util.curator.TestChildReaper
Tests run: 4, Failures: 0, Errors: 0, Skipped: 0, Time elapsed: 56.01 sec - in org.apache.hadoop.util.curator.TestChildReaper
Running org.apache.hadoop.util.TestLineReader
Tests run: 1, Failures: 0, Errors: 0, Skipped: 0, Time elapsed: 0.227 sec - in org.apache.hadoop.util.TestLineReader
Running org.apache.hadoop.util.TestNativeCrc32
Tests run: 22, Failures: 0, Errors: 0, Skipped: 0, Time elapsed: 0.988 sec - in org.apache.hadoop.util.TestNativeCrc32
Running org.apache.hadoop.log.TestLog4Json
Tests run: 5, Failures: 0, Errors: 0, Skipped: 0, Time elapsed: 0.463 sec - in org.apache.hadoop.log.TestLog4Json
Running org.apache.hadoop.log.TestLogLevel
Tests run: 1, Failures: 0, Errors: 0, Skipped: 0, Time elapsed: 0.806 sec - in org.apache.hadoop.log.TestLogLevel
Running org.apache.hadoop.conf.TestReconfiguration
Tests run: 5, Failures: 0, Errors: 0, Skipped: 0, Time elapsed: 2.923 sec - in org.apache.hadoop.conf.TestReconfiguration
Running org.apache.hadoop.conf.TestConfServlet
Tests run: 3, Failures: 0, Errors: 0, Skipped: 0, Time elapsed: 0.768 sec - in org.apache.hadoop.conf.TestConfServlet
Running org.apache.hadoop.conf.TestConfiguration
Tests run: 62, Failures: 0, Errors: 0, Skipped: 0, Time elapsed: 4.525 sec - in org.apache.hadoop.conf.TestConfiguration
Running org.apache.hadoop.conf.TestConfigurationSubclass
Tests run: 3, Failures: 0, Errors: 0, Skipped: 0, Time elapsed: 0.435 sec - in org.apache.hadoop.conf.TestConfigurationSubclass
Running org.apache.hadoop.conf.TestGetInstances
Tests run: 1, Failures: 0, Errors: 0, Skipped: 0, Time elapsed: 0.34 sec - in org.apache.hadoop.conf.TestGetInstances
Running org.apache.hadoop.conf.TestConfigurationDeprecation
Tests run: 9, Failures: 0, Errors: 0, Skipped: 0, Time elapsed: 11.819 sec - in org.apache.hadoop.conf.TestConfigurationDeprecation
Running org.apache.hadoop.conf.TestDeprecatedKeys
Tests run: 3, Failures: 0, Errors: 0, Skipped: 0, Time elapsed: 0.631 sec - in org.apache.hadoop.conf.TestDeprecatedKeys
Running org.apache.hadoop.tracing.TestTraceUtils
Tests run: 3, Failures: 0, Errors: 0, Skipped: 0, Time elapsed: 0.558 sec - in org.apache.hadoop.tracing.TestTraceUtils
Running org.apache.hadoop.cli.TestCLI
Tests run: 1, Failures: 0, Errors: 0, Skipped: 0, Time elapsed: 0.717 sec - in org.apache.hadoop.cli.TestCLI
Running org.apache.hadoop.metrics.ganglia.TestGangliaContext
Tests run: 5, Failures: 0, Errors: 0, Skipped: 0, Time elapsed: 0.19 sec - in org.apache.hadoop.metrics.ganglia.TestGangliaContext
Running org.apache.hadoop.metrics.spi.TestOutputRecord
Tests run: 1, Failures: 0, Errors: 0, Skipped: 0, Time elapsed: 0.057 sec - in org.apache.hadoop.metrics.spi.TestOutputRecord
Running org.apache.hadoop.metrics.TestMetricsServlet
Tests run: 3, Failures: 0, Errors: 0, Skipped: 0, Time elapsed: 0.107 sec - in org.apache.hadoop.metrics.TestMetricsServlet
Results :
Failed tests:
TestDNS.testLookupWithoutHostsFallback:231
Expected: is "-DUMMY_HOSTNAME"
but: was "localhost"
Tests run: 3217, Failures: 1, Errors: 0, Skipped: 86
[INFO] ------------------------------------------------------------------------
[INFO] Reactor Summary:
[INFO]
[INFO] Apache Hadoop Annotations ......................... SUCCESS [ 8.915 s]
[INFO] Apache Hadoop MiniKDC ............................. SUCCESS [ 20.767 s]
[INFO] Apache Hadoop Auth ................................ SUCCESS [03:47 min]
[INFO] Apache Hadoop Auth Examples ....................... SUCCESS [ 3.763 s]
[INFO] Apache Hadoop Common .............................. FAILURE [23:14 min]
[INFO] Apache Hadoop NFS ................................. SKIPPED
[INFO] Apache Hadoop KMS ................................. SKIPPED
[INFO] Apache Hadoop Common Project ...................... SKIPPED
[INFO] ------------------------------------------------------------------------
[INFO] BUILD FAILURE
[INFO] ------------------------------------------------------------------------
[INFO] Total time: 27:37 min
[INFO] Finished at: 2016-01-14T15:47:59+00:00
[INFO] Final Memory: 82M/992M
[INFO] ------------------------------------------------------------------------
[ERROR] Failed to execute goal org.apache.maven.plugins:maven-surefire-plugin:2.17:test (default-test) on project hadoop-common: There are test failures.
[ERROR]
[ERROR] Please refer to <https://builds.apache.org/job/Hadoop-Common-trunk/ws/hadoop-common-project/hadoop-common/target/surefire-reports> for the individual test results.
[ERROR] -> [Help 1]
[ERROR]
[ERROR] To see the full stack trace of the errors, re-run Maven with the -e switch.
[ERROR] Re-run Maven using the -X switch to enable full debug logging.
[ERROR]
[ERROR] For more information about the errors and possible solutions, please read the following articles:
[ERROR] [Help 1] http://cwiki.apache.org/confluence/display/MAVEN/MojoFailureException
[ERROR]
[ERROR] After correcting the problems, you can resume the build with the command
[ERROR] mvn <goals> -rf :hadoop-common
result: 1
################
# mvn -eaf test -Pclover -DcloverLicenseLocation=/home/jenkins/tools/clover/latest/lib/clover.license
################
Build step 'Execute shell' marked build as failure
Archiving artifacts
Recording test results
Jenkins build is back to normal : Hadoop-Common-trunk #2230
Posted by Apache Jenkins Server <je...@builds.apache.org>.
See <https://builds.apache.org/job/Hadoop-Common-trunk/2230/changes>
Build failed in Jenkins: Hadoop-Common-trunk #2229
Posted by Apache Jenkins Server <je...@builds.apache.org>.
See <https://builds.apache.org/job/Hadoop-Common-trunk/2229/changes>
Changes:
[aajisaka] HADOOP-12700. Remove unused import in TestCompressorDecompressor.java.
[aajisaka] MAPREDUCE-6601. Fix typo in Job#setUseNewAPI. Contributed by Kai Sasaki.
------------------------------------------
[...truncated 8566 lines...]
[javadoc] Loading source files for package org.apache.hadoop.metrics...
[javadoc] Loading source files for package org.apache.hadoop.metrics.ganglia...
[javadoc] Loading source files for package org.apache.hadoop.metrics.jvm...
[javadoc] Loading source files for package org.apache.hadoop.metrics.spi...
[javadoc] Loading source files for package org.apache.hadoop.metrics.util...
[javadoc] Loading source files for package org.apache.hadoop.metrics2...
[javadoc] Loading source files for package org.apache.hadoop.metrics2.annotation...
[javadoc] Loading source files for package org.apache.hadoop.metrics2.filter...
[javadoc] Loading source files for package org.apache.hadoop.metrics2.impl...
[javadoc] Loading source files for package org.apache.hadoop.metrics2.lib...
[javadoc] Loading source files for package org.apache.hadoop.metrics2.sink...
[javadoc] Loading source files for package org.apache.hadoop.metrics2.sink.ganglia...
[javadoc] Loading source files for package org.apache.hadoop.metrics2.source...
[javadoc] Loading source files for package org.apache.hadoop.metrics2.util...
[javadoc] Loading source files for package org.apache.hadoop.net...
[javadoc] Loading source files for package org.apache.hadoop.net.unix...
[javadoc] Loading source files for package org.apache.hadoop.security...
[javadoc] Loading source files for package org.apache.hadoop.security.alias...
[javadoc] Loading source files for package org.apache.hadoop.security.authorize...
[javadoc] Loading source files for package org.apache.hadoop.security.http...
[javadoc] Loading source files for package org.apache.hadoop.security.protocolPB...
[javadoc] Loading source files for package org.apache.hadoop.security.ssl...
[javadoc] Loading source files for package org.apache.hadoop.security.token...
[javadoc] Loading source files for package org.apache.hadoop.security.token.delegation...
[javadoc] Loading source files for package org.apache.hadoop.security.token.delegation.web...
[javadoc] Loading source files for package org.apache.hadoop.service...
[javadoc] Loading source files for package org.apache.hadoop.tools...
[javadoc] Loading source files for package org.apache.hadoop.tools.protocolPB...
[javadoc] Loading source files for package org.apache.hadoop.tracing...
[javadoc] Loading source files for package org.apache.hadoop.util...
[javadoc] Loading source files for package org.apache.hadoop.util.bloom...
[javadoc] Loading source files for package org.apache.hadoop.util.curator...
[javadoc] Loading source files for package org.apache.hadoop.util.hash...
[javadoc] Constructing Javadoc information...
[javadoc] <https://builds.apache.org/job/Hadoop-Common-trunk/ws/hadoop-common-project/hadoop-common/src/main/java/org/apache/hadoop/io/FastByteComparisons.java>:25: warning: Unsafe is internal proprietary API and may be removed in a future release
[javadoc] import sun.misc.Unsafe;
[javadoc] ^
[javadoc] <https://builds.apache.org/job/Hadoop-Common-trunk/ws/hadoop-common-project/hadoop-common/src/main/java/org/apache/hadoop/io/nativeio/NativeIO.java>:46: warning: Unsafe is internal proprietary API and may be removed in a future release
[javadoc] import sun.misc.Unsafe;
[javadoc] ^
[javadoc] <https://builds.apache.org/job/Hadoop-Common-trunk/ws/hadoop-common-project/hadoop-common/src/main/java/org/apache/hadoop/security/SecurityUtil.java>:54: warning: ResolverConfiguration is internal proprietary API and may be removed in a future release
[javadoc] import sun.net.dns.ResolverConfiguration;
[javadoc] ^
[javadoc] <https://builds.apache.org/job/Hadoop-Common-trunk/ws/hadoop-common-project/hadoop-common/src/main/java/org/apache/hadoop/security/SecurityUtil.java>:55: warning: IPAddressUtil is internal proprietary API and may be removed in a future release
[javadoc] import sun.net.util.IPAddressUtil;
[javadoc] ^
[javadoc] <https://builds.apache.org/job/Hadoop-Common-trunk/ws/hadoop-common-project/hadoop-common/src/main/java/org/apache/hadoop/util/SignalLogger.java>:21: warning: Signal is internal proprietary API and may be removed in a future release
[javadoc] import sun.misc.Signal;
[javadoc] ^
[javadoc] <https://builds.apache.org/job/Hadoop-Common-trunk/ws/hadoop-common-project/hadoop-common/src/main/java/org/apache/hadoop/util/SignalLogger.java>:22: warning: SignalHandler is internal proprietary API and may be removed in a future release
[javadoc] import sun.misc.SignalHandler;
[javadoc] ^
[javadoc] <https://builds.apache.org/job/Hadoop-Common-trunk/ws/hadoop-common-project/hadoop-common/src/main/java/org/apache/hadoop/util/SignalLogger.java>:44: warning: SignalHandler is internal proprietary API and may be removed in a future release
[javadoc] private static class Handler implements SignalHandler {
[javadoc] ^
[javadoc] ExcludePrivateAnnotationsJDiffDoclet
[javadoc] JDiff: doclet started ...
[javadoc] JDiff: reading the old API in from file '<https://builds.apache.org/job/Hadoop-Common-trunk/ws/hadoop-common-project/hadoop-common/dev-support/jdiff/Apache_Hadoop_Common_2.6.0.xml'...Warning>: API identifier in the XML file (hadoop-core 2.6.0) differs from the name of the file 'Apache_Hadoop_Common_2.6.0.xml'
[javadoc] Warning: incorrectly formatted @link in text: Retrieve the Bloom filter used by this instance of the Reader.
[javadoc] @return a Bloom filter (see {@link Filter})
[javadoc] Warning: incorrectly formatted @link in text: Helper class to shutdown {@link Thread}s and {@link ExecutorService}s.
[javadoc] Warning: incorrectly formatted @link in text: Constructor
[javadoc] @param vectorSize The vector size of <i>this</i> filter.
[javadoc] @param nbHash The number of hash function to consider.
[javadoc] @param hashType type of the hashing function (see
[javadoc] {@link org.apache.hadoop.util.hash.Hash}).
[javadoc] Warning: incorrectly formatted @link in text: Constructor
[javadoc] @param vectorSize The vector size of <i>this</i> filter.
[javadoc] @param nbHash The number of hash function to consider.
[javadoc] @param hashType type of the hashing function (see
[javadoc] {@link org.apache.hadoop.util.hash.Hash}).
[javadoc] Warning: incorrectly formatted @link in text: Constructor.
[javadoc] <p>
[javadoc] Builds a hash function that must obey to a given maximum number of returned values and a highest value.
[javadoc] @param maxValue The maximum highest returned value.
[javadoc] @param nbHash The number of resulting hashed values.
[javadoc] @param hashType type of the hashing function (see {@link Hash}).
[javadoc] Warning: incorrectly formatted @link in text: Constructor
[javadoc] @param vectorSize The vector size of <i>this</i> filter.
[javadoc] @param nbHash The number of hash function to consider.
[javadoc] @param hashType type of the hashing function (see
[javadoc] {@link org.apache.hadoop.util.hash.Hash}).
[javadoc] finished
[javadoc] JDiff: reading the new API in from file '<https://builds.apache.org/job/Hadoop-Common-trunk/ws/hadoop-common-project/hadoop-common/target/site/jdiff/xml/Apache_Hadoop_Common_3.0.0-SNAPSHOT.xml'...Warning>: incorrectly formatted @link in text: Options to be used by the {@link Find} command and its {@link Expression}s.
[javadoc] Warning: incorrectly formatted @link in text: Retrieve the Bloom filter used by this instance of the Reader.
[javadoc] @return a Bloom filter (see {@link Filter})
[javadoc] Error: duplicate comment id: org.apache.hadoop.metrics2.MetricsSystem.register_changed(java.lang.String, java.lang.String, T)
[xslt] Processing <https://builds.apache.org/job/Hadoop-Common-trunk/ws/hadoop-common-project/hadoop-common/target/findbugsXml.xml> to <https://builds.apache.org/job/Hadoop-Common-trunk/ws/hadoop-common-project/hadoop-common/target/site/findbugs.html>
[xslt] Loading stylesheet /home/jenkins/tools/findbugs/latest/src/xsl/default.xsl
[INFO] Executed tasks
[INFO]
[INFO] --- maven-antrun-plugin:1.7:run (pre-dist) @ hadoop-common ---
[INFO] Executing tasks
main:
[exec] The required option isal.lib isn't given, bundling ISA-L skipped
[INFO] Executed tasks
[INFO]
[INFO] >>> maven-javadoc-plugin:2.8.1:javadoc (default) @ hadoop-common >>>
[INFO]
[INFO] --- maven-enforcer-plugin:1.3.1:enforce (enforce-os) @ hadoop-common ---
[INFO]
[INFO] --- maven-antrun-plugin:1.7:run (create-testdirs) @ hadoop-common ---
[INFO] Executing tasks
main:
[INFO] Executed tasks
[INFO]
[INFO] --- hadoop-maven-plugins:3.0.0-SNAPSHOT:protoc (compile-protoc) @ hadoop-common ---
[INFO] No changes detected in protoc files, skipping generation.
[INFO]
[INFO] <<< maven-javadoc-plugin:2.8.1:javadoc (default) @ hadoop-common <<<
[INFO]
[INFO] --- maven-javadoc-plugin:2.8.1:javadoc (default) @ hadoop-common ---
[INFO]
ExcludePrivateAnnotationsStandardDoclet
13 warnings
[WARNING] Javadoc Warnings
[WARNING] <https://builds.apache.org/job/Hadoop-Common-trunk/ws/hadoop-common-project/hadoop-common/src/main/java/org/apache/hadoop/security/SecurityUtil.java>:54: warning: ResolverConfiguration is internal proprietary API and may be removed in a future release
[WARNING] import sun.net.dns.ResolverConfiguration;
[WARNING] ^
[WARNING] <https://builds.apache.org/job/Hadoop-Common-trunk/ws/hadoop-common-project/hadoop-common/src/main/java/org/apache/hadoop/security/SecurityUtil.java>:55: warning: IPAddressUtil is internal proprietary API and may be removed in a future release
[WARNING] import sun.net.util.IPAddressUtil;
[WARNING] ^
[WARNING] <https://builds.apache.org/job/Hadoop-Common-trunk/ws/hadoop-common-project/hadoop-common/src/main/java/org/apache/hadoop/util/SignalLogger.java>:21: warning: Signal is internal proprietary API and may be removed in a future release
[WARNING] import sun.misc.Signal;
[WARNING] ^
[WARNING] <https://builds.apache.org/job/Hadoop-Common-trunk/ws/hadoop-common-project/hadoop-common/src/main/java/org/apache/hadoop/util/SignalLogger.java>:22: warning: SignalHandler is internal proprietary API and may be removed in a future release
[WARNING] import sun.misc.SignalHandler;
[WARNING] ^
[WARNING] <https://builds.apache.org/job/Hadoop-Common-trunk/ws/hadoop-common-project/hadoop-common/src/main/java/org/apache/hadoop/util/SignalLogger.java>:44: warning: SignalHandler is internal proprietary API and may be removed in a future release
[WARNING] private static class Handler implements SignalHandler {
[WARNING] ^
[WARNING] <https://builds.apache.org/job/Hadoop-Common-trunk/ws/hadoop-common-project/hadoop-common/src/main/java/org/apache/hadoop/io/FastByteComparisons.java>:25: warning: Unsafe is internal proprietary API and may be removed in a future release
[WARNING] import sun.misc.Unsafe;
[WARNING] ^
[WARNING] <https://builds.apache.org/job/Hadoop-Common-trunk/ws/hadoop-common-project/hadoop-common/src/main/java/org/apache/hadoop/io/nativeio/NativeIO.java>:46: warning: Unsafe is internal proprietary API and may be removed in a future release
[WARNING] import sun.misc.Unsafe;
[WARNING] ^
[WARNING] <https://builds.apache.org/job/Hadoop-Common-trunk/ws/hadoop-common-project/hadoop-common/src/main/java/org/apache/hadoop/fs/DelegationTokenRenewer.java>:122: warning - @return tag has no arguments.
[WARNING] <https://builds.apache.org/job/Hadoop-Common-trunk/ws/hadoop-common-project/hadoop-common/src/main/java/org/apache/hadoop/fs/FileContext.java>:2163: warning - @return tag has no arguments.
[WARNING] <https://builds.apache.org/job/Hadoop-Common-trunk/ws/hadoop-common-project/hadoop-common/src/main/java/org/apache/hadoop/fs/FileContext.java>:2705: warning - @param argument "src" is not a parameter name.
[WARNING] <https://builds.apache.org/job/Hadoop-Common-trunk/ws/hadoop-common-project/hadoop-common/src/main/java/org/apache/hadoop/fs/ftp/FTPFileSystem.java>:184: warning - @return tag has no arguments.
[WARNING] <https://builds.apache.org/job/Hadoop-Common-trunk/ws/hadoop-common-project/hadoop-common/src/main/java/org/apache/hadoop/fs/ftp/FTPFileSystem.java>:578: warning - @return tag has no arguments.
[WARNING] <https://builds.apache.org/job/Hadoop-Common-trunk/ws/hadoop-common-project/hadoop-common/src/main/java/org/apache/hadoop/io/file/tfile/TFile.java>:985: warning - @return tag has no arguments.
[INFO]
[INFO] --- maven-assembly-plugin:2.4:single (dist) @ hadoop-common ---
[WARNING] The following patterns were never triggered in this artifact exclusion filter:
o 'org.apache.ant:*:jar'
o 'jdiff:jdiff:jar'
[INFO] Copying files to <https://builds.apache.org/job/Hadoop-Common-trunk/ws/hadoop-common-project/hadoop-common/target/hadoop-common-3.0.0-SNAPSHOT>
[INFO]
[INFO] --- maven-jar-plugin:2.5:jar (default-jar) @ hadoop-common ---
[INFO]
[INFO] --- maven-source-plugin:2.3:jar-no-fork (hadoop-java-sources) @ hadoop-common ---
[INFO]
[INFO] --- maven-source-plugin:2.3:test-jar-no-fork (hadoop-java-sources) @ hadoop-common ---
[INFO]
[INFO] --- maven-enforcer-plugin:1.3.1:enforce (dist-enforce) @ hadoop-common ---
[INFO]
[INFO] --- maven-site-plugin:3.4:attach-descriptor (attach-descriptor) @ hadoop-common ---
[INFO]
[INFO] --- maven-antrun-plugin:1.7:run (tar) @ hadoop-common ---
[INFO] Executing tasks
main:
[INFO] Executed tasks
[INFO]
[INFO] --- maven-javadoc-plugin:2.8.1:jar (module-javadocs) @ hadoop-common ---
[INFO]
ExcludePrivateAnnotationsStandardDoclet
13 warnings
[WARNING] Javadoc Warnings
[WARNING] <https://builds.apache.org/job/Hadoop-Common-trunk/ws/hadoop-common-project/hadoop-common/src/main/java/org/apache/hadoop/security/SecurityUtil.java>:54: warning: ResolverConfiguration is internal proprietary API and may be removed in a future release
[WARNING] import sun.net.dns.ResolverConfiguration;
[WARNING] ^
[WARNING] <https://builds.apache.org/job/Hadoop-Common-trunk/ws/hadoop-common-project/hadoop-common/src/main/java/org/apache/hadoop/security/SecurityUtil.java>:55: warning: IPAddressUtil is internal proprietary API and may be removed in a future release
[WARNING] import sun.net.util.IPAddressUtil;
[WARNING] ^
[WARNING] <https://builds.apache.org/job/Hadoop-Common-trunk/ws/hadoop-common-project/hadoop-common/src/main/java/org/apache/hadoop/util/SignalLogger.java>:21: warning: Signal is internal proprietary API and may be removed in a future release
[WARNING] import sun.misc.Signal;
[WARNING] ^
[WARNING] <https://builds.apache.org/job/Hadoop-Common-trunk/ws/hadoop-common-project/hadoop-common/src/main/java/org/apache/hadoop/util/SignalLogger.java>:22: warning: SignalHandler is internal proprietary API and may be removed in a future release
[WARNING] import sun.misc.SignalHandler;
[WARNING] ^
[WARNING] <https://builds.apache.org/job/Hadoop-Common-trunk/ws/hadoop-common-project/hadoop-common/src/main/java/org/apache/hadoop/util/SignalLogger.java>:44: warning: SignalHandler is internal proprietary API and may be removed in a future release
[WARNING] private static class Handler implements SignalHandler {
[WARNING] ^
[WARNING] <https://builds.apache.org/job/Hadoop-Common-trunk/ws/hadoop-common-project/hadoop-common/src/main/java/org/apache/hadoop/io/FastByteComparisons.java>:25: warning: Unsafe is internal proprietary API and may be removed in a future release
[WARNING] import sun.misc.Unsafe;
[WARNING] ^
[WARNING] <https://builds.apache.org/job/Hadoop-Common-trunk/ws/hadoop-common-project/hadoop-common/src/main/java/org/apache/hadoop/io/nativeio/NativeIO.java>:46: warning: Unsafe is internal proprietary API and may be removed in a future release
[WARNING] import sun.misc.Unsafe;
[WARNING] ^
[WARNING] <https://builds.apache.org/job/Hadoop-Common-trunk/ws/hadoop-common-project/hadoop-common/src/main/java/org/apache/hadoop/fs/DelegationTokenRenewer.java>:122: warning - @return tag has no arguments.
[WARNING] <https://builds.apache.org/job/Hadoop-Common-trunk/ws/hadoop-common-project/hadoop-common/src/main/java/org/apache/hadoop/fs/FileContext.java>:2163: warning - @return tag has no arguments.
[WARNING] <https://builds.apache.org/job/Hadoop-Common-trunk/ws/hadoop-common-project/hadoop-common/src/main/java/org/apache/hadoop/fs/FileContext.java>:2705: warning - @param argument "src" is not a parameter name.
[WARNING] <https://builds.apache.org/job/Hadoop-Common-trunk/ws/hadoop-common-project/hadoop-common/src/main/java/org/apache/hadoop/fs/ftp/FTPFileSystem.java>:184: warning - @return tag has no arguments.
[WARNING] <https://builds.apache.org/job/Hadoop-Common-trunk/ws/hadoop-common-project/hadoop-common/src/main/java/org/apache/hadoop/fs/ftp/FTPFileSystem.java>:578: warning - @return tag has no arguments.
[WARNING] <https://builds.apache.org/job/Hadoop-Common-trunk/ws/hadoop-common-project/hadoop-common/src/main/java/org/apache/hadoop/io/file/tfile/TFile.java>:985: warning - @return tag has no arguments.
[INFO] Building jar: <https://builds.apache.org/job/Hadoop-Common-trunk/ws/hadoop-common-project/hadoop-common/target/hadoop-common-3.0.0-SNAPSHOT-javadoc.jar>
[INFO]
[INFO] ------------------------------------------------------------------------
[INFO] Building Apache Hadoop NFS 3.0.0-SNAPSHOT
[INFO] ------------------------------------------------------------------------
[INFO]
[INFO] --- maven-clean-plugin:2.5:clean (default-clean) @ hadoop-nfs ---
[INFO] Deleting <https://builds.apache.org/job/Hadoop-Common-trunk/ws/hadoop-common-project/hadoop-nfs/target>
[INFO]
[INFO] --- findbugs-maven-plugin:3.0.0:findbugs (default-cli) @ hadoop-nfs ---
[INFO]
[INFO] --- maven-checkstyle-plugin:2.15:checkstyle (default-cli) @ hadoop-nfs ---
[INFO] ------------------------------------------------------------------------
[INFO] Reactor Summary:
[INFO]
[INFO] Apache Hadoop Annotations ......................... SUCCESS [ 8.816 s]
[INFO] Apache Hadoop MiniKDC ............................. SUCCESS [ 23.111 s]
[INFO] Apache Hadoop Auth ................................ SUCCESS [04:02 min]
[INFO] Apache Hadoop Auth Examples ....................... SUCCESS [ 3.975 s]
[INFO] Apache Hadoop Common .............................. SUCCESS [28:50 min]
[INFO] Apache Hadoop NFS ................................. FAILURE [ 0.082 s]
[INFO] Apache Hadoop KMS ................................. SKIPPED
[INFO] Apache Hadoop Common Project ...................... SKIPPED
[INFO] ------------------------------------------------------------------------
[INFO] BUILD FAILURE
[INFO] ------------------------------------------------------------------------
[INFO] Total time: 33:30 min
[INFO] Finished at: 2016-01-14T17:01:55+00:00
[INFO] Final Memory: 92M/871M
[INFO] ------------------------------------------------------------------------
[ERROR] Failed to execute goal org.apache.maven.plugins:maven-checkstyle-plugin:2.15:checkstyle (default-cli) on project hadoop-nfs: An error has occurred in Checkstyle report generation. Failed during checkstyle execution: Unable to find configuration file at location: checkstyle/checkstyle.xml: Could not find resource 'checkstyle/checkstyle.xml'. -> [Help 1]
[ERROR]
[ERROR] To see the full stack trace of the errors, re-run Maven with the -e switch.
[ERROR] Re-run Maven using the -X switch to enable full debug logging.
[ERROR]
[ERROR] For more information about the errors and possible solutions, please read the following articles:
[ERROR] [Help 1] http://cwiki.apache.org/confluence/display/MAVEN/MojoExecutionException
[ERROR]
[ERROR] After correcting the problems, you can resume the build with the command
[ERROR] mvn <goals> -rf :hadoop-nfs
result: 1
################
# mvn -eaf test -Pclover -DcloverLicenseLocation=/home/jenkins/tools/clover/latest/lib/clover.license
################
Build step 'Execute shell' marked build as failure
Archiving artifacts
Recording test results