You are viewing a plain text version of this content. The canonical link for it is here.
Posted to builds@hbase.apache.org by Apache Jenkins Server <je...@builds.apache.org> on 2017/10/13 12:22:26 UTC
Build failed in Jenkins: HBase-Trunk_matrix » JDK 1.8 (latest),Hadoop #3879
See <https://builds.apache.org/job/HBase-Trunk_matrix/jdk=JDK%201.8%20(latest),label=Hadoop/3879/display/redirect>
------------------------------------------
[...truncated 1.26 MB...]
[INFO] Total time: 1.244s
[INFO] Finished at: Fri Oct 13 12:14:19 UTC 2017
[INFO] Final Memory: 20M/724M
[INFO] ------------------------------------------------------------------------
[INFO] Archetype project created in <https://builds.apache.org/job/HBase-Trunk_matrix/jdk=JDK%201.8%20(latest),label=Hadoop/ws/hbase-archetypes/hbase-client-project/target/build-archetype/target/generated-sources/archetype>
[INFO] ------------------------------------------------------------------------
[INFO] BUILD SUCCESS
[INFO] ------------------------------------------------------------------------
[INFO] Total time: 4.004s
[INFO] Finished at: Fri Oct 13 12:14:19 UTC 2017
[INFO] Final Memory: 21M/724M
[INFO] ------------------------------------------------------------------------
[INFO] Scanning for projects...
[INFO]
[INFO] ------------------------------------------------------------------------
[INFO] Building Apache HBase - Exemplar for hbase-shaded-client archetype 3.0.0-SNAPSHOT
[INFO] ------------------------------------------------------------------------
[INFO]
[INFO] >>> maven-archetype-plugin:2.4:create-from-project (default-cli) @ hbase-shaded-client-project >>>
[INFO]
[INFO] <<< maven-archetype-plugin:2.4:create-from-project (default-cli) @ hbase-shaded-client-project <<<
[INFO]
[INFO] --- maven-archetype-plugin:2.4:create-from-project (default-cli) @ hbase-shaded-client-project ---
[INFO] Setting default groupId: org.apache.hbase
[INFO] Setting default artifactId: hbase-shaded-client-project
[INFO] Setting default version: 3.0.0-SNAPSHOT
[INFO] Setting default package: org.apache.hbase.archetypes.exemplars.shaded_client
[INFO] Scanning for projects...
[INFO]
[INFO] ------------------------------------------------------------------------
[INFO] Building hbase-shaded-client-project-archetype 3.0.0-SNAPSHOT
[INFO] ------------------------------------------------------------------------
[INFO]
[INFO] --- maven-resources-plugin:3.0.1:resources (default-resources) @ hbase-shaded-client-project-archetype ---
[WARNING] Using platform encoding (ISO-8859-1 actually) to copy filtered resources, i.e. build is platform dependent!
[INFO] Copying 6 resources
[INFO]
[INFO] --- maven-resources-plugin:3.0.1:testResources (default-testResources) @ hbase-shaded-client-project-archetype ---
[WARNING] Using platform encoding (ISO-8859-1 actually) to copy filtered resources, i.e. build is platform dependent!
[INFO] Copying 2 resources
[INFO]
[INFO] --- maven-archetype-plugin:2.4:jar (default-jar) @ hbase-shaded-client-project-archetype ---
[INFO] Building archetype jar: <https://builds.apache.org/job/HBase-Trunk_matrix/jdk=JDK%201.8%20(latest),label=Hadoop/ws/hbase-archetypes/hbase-shaded-client-project/target/build-archetype/target/generated-sources/archetype/target/hbase-shaded-client-project-archetype-3.0.0-SNAPSHOT>
[INFO] ------------------------------------------------------------------------
[INFO] BUILD SUCCESS
[INFO] ------------------------------------------------------------------------
[INFO] Total time: 1.379s
[INFO] Finished at: Fri Oct 13 12:14:25 UTC 2017
[INFO] Final Memory: 20M/724M
[INFO] ------------------------------------------------------------------------
[INFO] Archetype project created in <https://builds.apache.org/job/HBase-Trunk_matrix/jdk=JDK%201.8%20(latest),label=Hadoop/ws/hbase-archetypes/hbase-shaded-client-project/target/build-archetype/target/generated-sources/archetype>
[INFO] ------------------------------------------------------------------------
[INFO] BUILD SUCCESS
[INFO] ------------------------------------------------------------------------
[INFO] Total time: 4.586s
[INFO] Finished at: Fri Oct 13 12:14:26 UTC 2017
[INFO] Final Memory: 21M/724M
[INFO] ------------------------------------------------------------------------
[INFO]
[INFO] --- maven-resources-plugin:2.7:copy-resources (hbase-client-ARCHETYPE__copy-pom-to-temp-for-xslt-processing) @ hbase-archetype-builder ---
[INFO] Using 'UTF-8' encoding to copy filtered resources.
[INFO] Copying 1 resource
[INFO]
[INFO] --- maven-resources-plugin:2.7:copy-resources (hbase-shaded-client-ARCHETYPE__copy-pom-to-temp-for-xslt-processing) @ hbase-archetype-builder ---
[INFO] Using 'UTF-8' encoding to copy filtered resources.
[INFO] Copying 1 resource
[INFO]
[INFO] --- xml-maven-plugin:1.0.1:transform (modify-archetype-pom-files-via-xslt) @ hbase-archetype-builder ---
[INFO] Transforming file: <https://builds.apache.org/job/HBase-Trunk_matrix/jdk=JDK%201.8%20(latest),label=Hadoop/3879/artifact/hbase-archetypes/hbase-archetype-builder/../hbase-client-project/target/temp-arch/pom.xml>
[INFO] Transformed 1 file(s).
[INFO] Transforming file: <https://builds.apache.org/job/HBase-Trunk_matrix/jdk=JDK%201.8%20(latest),label=Hadoop/3879/artifact/hbase-archetypes/hbase-archetype-builder/../hbase-shaded-client-project/target/temp-arch/pom.xml>
[INFO] Transformed 1 file(s).
[INFO]
[INFO] --- maven-install-plugin:2.5.2:install (default-install) @ hbase-archetype-builder ---
[INFO] Installing <https://builds.apache.org/job/HBase-Trunk_matrix/jdk=JDK%201.8%20(latest),label=Hadoop/3879/artifact/hbase-archetypes/hbase-archetype-builder/pom.xml> to /home/jenkins/.m2/repository/org/apache/hbase/hbase-archetype-builder/3.0.0-SNAPSHOT/hbase-archetype-builder-3.0.0-SNAPSHOT.pom
[INFO]
[INFO] --- exec-maven-plugin:1.6.0:exec (run-installArchetypes-script) @ hbase-archetype-builder ---
[INFO] Scanning for projects...
[INFO]
[INFO] ------------------------------------------------------------------------
[INFO] Building hbase-client-project-archetype 3.0.0-SNAPSHOT
[INFO] ------------------------------------------------------------------------
[INFO]
[INFO] --- maven-resources-plugin:3.0.1:resources (default-resources) @ hbase-client-project-archetype ---
[INFO] Using 'UTF-8' encoding to copy filtered resources.
[INFO] Copying 6 resources
[INFO]
[INFO] --- maven-resources-plugin:3.0.1:testResources (default-testResources) @ hbase-client-project-archetype ---
[INFO] Using 'UTF-8' encoding to copy filtered resources.
[INFO] Copying 2 resources
[INFO]
[INFO] --- maven-archetype-plugin:2.4:jar (default-jar) @ hbase-client-project-archetype ---
[INFO] Building archetype jar: <https://builds.apache.org/job/HBase-Trunk_matrix/jdk=JDK%201.8%20(latest),label=Hadoop/ws/hbase-archetypes/hbase-client-project/target/build-archetype/target/generated-sources/archetype/target/hbase-client-project-archetype-3.0.0-SNAPSHOT>
[INFO]
[INFO] --- maven-archetype-plugin:2.4:integration-test (default-integration-test) @ hbase-client-project-archetype ---
[INFO] Processing Archetype IT project: basic
[INFO] ----------------------------------------------------------------------------
[INFO] Using following parameters for creating project from Archetype: hbase-client-project-archetype:3.0.0-SNAPSHOT
[INFO] ----------------------------------------------------------------------------
[INFO] Parameter: groupId, Value: archetype.it
[INFO] Parameter: artifactId, Value: basic
[INFO] Parameter: version, Value: 0.1-SNAPSHOT
[INFO] Parameter: package, Value: it.pkg
[INFO] Parameter: packageInPathFormat, Value: it/pkg
[INFO] Parameter: version, Value: 0.1-SNAPSHOT
[INFO] Parameter: package, Value: it.pkg
[INFO] Parameter: groupId, Value: archetype.it
[INFO] Parameter: artifactId, Value: basic
[INFO] project created from Archetype in dir: <https://builds.apache.org/job/HBase-Trunk_matrix/jdk=JDK%201.8%20(latest),label=Hadoop/ws/hbase-archetypes/hbase-client-project/target/build-archetype/target/generated-sources/archetype/target/test-classes/projects/basic/project/basic>
[INFO]
[INFO] --- maven-install-plugin:2.5.2:install (default-install) @ hbase-client-project-archetype ---
[INFO] Installing <https://builds.apache.org/job/HBase-Trunk_matrix/jdk=JDK%201.8%20(latest),label=Hadoop/ws/hbase-archetypes/hbase-client-project/target/build-archetype/target/generated-sources/archetype/target/hbase-client-project-archetype-3.0.0-SNAPSHOT.jar> to /home/jenkins/.m2/repository/org/apache/hbase/hbase-client-project-archetype/3.0.0-SNAPSHOT/hbase-client-project-archetype-3.0.0-SNAPSHOT.jar
[INFO] Installing <https://builds.apache.org/job/HBase-Trunk_matrix/jdk=JDK%201.8%20(latest),label=Hadoop/3879/artifact/hbase-archetypes/hbase-client-project/target/build-archetype/target/generated-sources/archetype/pom.xml> to /home/jenkins/.m2/repository/org/apache/hbase/hbase-client-project-archetype/3.0.0-SNAPSHOT/hbase-client-project-archetype-3.0.0-SNAPSHOT.pom
[INFO]
[INFO] --- maven-archetype-plugin:2.4:update-local-catalog (default-update-local-catalog) @ hbase-client-project-archetype ---
[INFO] ------------------------------------------------------------------------
[INFO] BUILD SUCCESS
[INFO] ------------------------------------------------------------------------
[INFO] Total time: 1.395s
[INFO] Finished at: Fri Oct 13 12:14:29 UTC 2017
[INFO] Final Memory: 21M/724M
[INFO] ------------------------------------------------------------------------
[INFO] Scanning for projects...
[INFO]
[INFO] ------------------------------------------------------------------------
[INFO] Building hbase-shaded-client-project-archetype 3.0.0-SNAPSHOT
[INFO] ------------------------------------------------------------------------
[INFO]
[INFO] --- maven-resources-plugin:3.0.1:resources (default-resources) @ hbase-shaded-client-project-archetype ---
[INFO] Using 'UTF-8' encoding to copy filtered resources.
[INFO] Copying 6 resources
[INFO]
[INFO] --- maven-resources-plugin:3.0.1:testResources (default-testResources) @ hbase-shaded-client-project-archetype ---
[INFO] Using 'UTF-8' encoding to copy filtered resources.
[INFO] Copying 2 resources
[INFO]
[INFO] --- maven-archetype-plugin:2.4:jar (default-jar) @ hbase-shaded-client-project-archetype ---
[INFO] Building archetype jar: <https://builds.apache.org/job/HBase-Trunk_matrix/jdk=JDK%201.8%20(latest),label=Hadoop/ws/hbase-archetypes/hbase-shaded-client-project/target/build-archetype/target/generated-sources/archetype/target/hbase-shaded-client-project-archetype-3.0.0-SNAPSHOT>
[INFO]
[INFO] --- maven-archetype-plugin:2.4:integration-test (default-integration-test) @ hbase-shaded-client-project-archetype ---
[INFO] Processing Archetype IT project: basic
[INFO] ----------------------------------------------------------------------------
[INFO] Using following parameters for creating project from Archetype: hbase-shaded-client-project-archetype:3.0.0-SNAPSHOT
[INFO] ----------------------------------------------------------------------------
[INFO] Parameter: groupId, Value: archetype.it
[INFO] Parameter: artifactId, Value: basic
[INFO] Parameter: version, Value: 0.1-SNAPSHOT
[INFO] Parameter: package, Value: it.pkg
[INFO] Parameter: packageInPathFormat, Value: it/pkg
[INFO] Parameter: version, Value: 0.1-SNAPSHOT
[INFO] Parameter: package, Value: it.pkg
[INFO] Parameter: groupId, Value: archetype.it
[INFO] Parameter: artifactId, Value: basic
[INFO] project created from Archetype in dir: <https://builds.apache.org/job/HBase-Trunk_matrix/jdk=JDK%201.8%20(latest),label=Hadoop/ws/hbase-archetypes/hbase-shaded-client-project/target/build-archetype/target/generated-sources/archetype/target/test-classes/projects/basic/project/basic>
[INFO]
[INFO] --- maven-install-plugin:2.5.2:install (default-install) @ hbase-shaded-client-project-archetype ---
[INFO] Installing <https://builds.apache.org/job/HBase-Trunk_matrix/jdk=JDK%201.8%20(latest),label=Hadoop/ws/hbase-archetypes/hbase-shaded-client-project/target/build-archetype/target/generated-sources/archetype/target/hbase-shaded-client-project-archetype-3.0.0-SNAPSHOT.jar> to /home/jenkins/.m2/repository/org/apache/hbase/hbase-shaded-client-project-archetype/3.0.0-SNAPSHOT/hbase-shaded-client-project-archetype-3.0.0-SNAPSHOT.jar
[INFO] Installing <https://builds.apache.org/job/HBase-Trunk_matrix/jdk=JDK%201.8%20(latest),label=Hadoop/3879/artifact/hbase-archetypes/hbase-shaded-client-project/target/build-archetype/target/generated-sources/archetype/pom.xml> to /home/jenkins/.m2/repository/org/apache/hbase/hbase-shaded-client-project-archetype/3.0.0-SNAPSHOT/hbase-shaded-client-project-archetype-3.0.0-SNAPSHOT.pom
[INFO]
[INFO] --- maven-archetype-plugin:2.4:update-local-catalog (default-update-local-catalog) @ hbase-shaded-client-project-archetype ---
[INFO] ------------------------------------------------------------------------
[INFO] BUILD SUCCESS
[INFO] ------------------------------------------------------------------------
[INFO] Total time: 1.906s
[INFO] Finished at: Fri Oct 13 12:14:32 UTC 2017
[INFO] Final Memory: 21M/724M
[INFO] ------------------------------------------------------------------------
[INFO] ------------------------------------------------------------------------
[INFO] Reactor Summary:
[INFO]
[INFO] Apache HBase ...................................... SUCCESS [2.214s]
[INFO] Apache HBase - Checkstyle ......................... SUCCESS [0.574s]
[INFO] Apache HBase - Build Support ...................... SUCCESS [0.076s]
[INFO] Apache HBase - Error Prone Rules .................. SUCCESS [0.247s]
[INFO] Apache HBase - Annotations ........................ SUCCESS [0.178s]
[INFO] Apache HBase - Build Configuration ................ SUCCESS [0.080s]
[INFO] Apache HBase - Shaded Protocol .................... SUCCESS [25.558s]
[INFO] Apache HBase - Common ............................. SUCCESS [2:10.895s]
[INFO] Apache HBase - Metrics API ........................ SUCCESS [1.634s]
[INFO] Apache HBase - Hadoop Compatibility ............... SUCCESS [13.189s]
[INFO] Apache HBase - Metrics Implementation ............. SUCCESS [7.013s]
[INFO] Apache HBase - Hadoop Two Compatibility ........... SUCCESS [16.178s]
[INFO] Apache HBase - Protocol ........................... SUCCESS [7.781s]
[INFO] Apache HBase - Client ............................. SUCCESS [2:13.859s]
[INFO] Apache HBase - Replication ........................ SUCCESS [1.201s]
[INFO] Apache HBase - Prefix Tree ........................ SUCCESS [14.444s]
[INFO] Apache HBase - Procedure .......................... SUCCESS [2:49.233s]
[INFO] Apache HBase - Resource Bundle .................... SUCCESS [0.208s]
[INFO] Apache HBase - Server ............................. FAILURE [2:01:58.707s]
[INFO] Apache HBase - MapReduce .......................... SKIPPED
[INFO] Apache HBase - Testing Util ....................... SKIPPED
[INFO] Apache HBase - Thrift ............................. SKIPPED
[INFO] Apache HBase - RSGroup ............................ SKIPPED
[INFO] Apache HBase - Shell .............................. SKIPPED
[INFO] Apache HBase - Coprocessor Endpoint ............... SKIPPED
[INFO] Apache HBase - Backup ............................. SKIPPED
[INFO] Apache HBase - Integration Tests .................. SKIPPED
[INFO] Apache HBase - Examples ........................... SKIPPED
[INFO] Apache HBase - Rest ............................... SKIPPED
[INFO] Apache HBase - External Block Cache ............... SKIPPED
[INFO] Apache HBase - Spark .............................. SKIPPED
[INFO] Apache HBase - Spark Integration Tests ............ SKIPPED
[INFO] Apache HBase - Assembly ........................... SKIPPED
[INFO] Apache HBase - Shaded ............................. SUCCESS [0.318s]
[INFO] Apache HBase - Shaded - Client .................... SUCCESS [1.300s]
[INFO] Apache HBase - Shaded - MapReduce ................. SKIPPED
[INFO] Apache HBase Shaded Packaging Invariants .......... SKIPPED
[INFO] Apache HBase - Archetypes ......................... SUCCESS [0.056s]
[INFO] Apache HBase - Exemplar for hbase-client archetype SKIPPED
[INFO] Apache HBase - Exemplar for hbase-shaded-client archetype SKIPPED
[INFO] Apache HBase - Archetype builder .................. SUCCESS [18.693s]
[INFO] ------------------------------------------------------------------------
[INFO] BUILD FAILURE
[INFO] ------------------------------------------------------------------------
[INFO] Total time: 2:11:05.084s
[INFO] Finished at: Fri Oct 13 12:14:32 UTC 2017
[INFO] Final Memory: 101M/3991M
[INFO] ------------------------------------------------------------------------
[ERROR] Failed to execute goal org.apache.maven.plugins:maven-surefire-plugin:2.19.1:test (secondPartTestsExecution) on project hbase-server: There are test failures.
[ERROR]
[ERROR] Please refer to <https://builds.apache.org/job/HBase-Trunk_matrix/jdk=JDK%201.8%20(latest),label=Hadoop/ws/hbase-server/target/surefire-reports> for the individual test results.
[ERROR] -> [Help 1]
[ERROR]
[ERROR] To see the full stack trace of the errors, re-run Maven with the -e switch.
[ERROR] Re-run Maven using the -X switch to enable full debug logging.
[ERROR]
[ERROR] For more information about the errors and possible solutions, please read the following articles:
[ERROR] [Help 1] http://cwiki.apache.org/confluence/display/MAVEN/MojoFailureException
[ERROR]
[ERROR] After correcting the problems, you can resume the build with the command
[ERROR] mvn <goals> -rf :hbase-server
Build step 'Invoke top-level Maven targets' marked build as failure
Performing Post build task...
Match found for :.* : True
Logical operation result is TRUE
Running script : # Run zombie detector script
./dev-support/zombie-detector.sh --jenkins ${BUILD_ID}
[a3159d73] $ /bin/bash -xe /tmp/jenkins7436341881160248361.sh
+ ./dev-support/zombie-detector.sh --jenkins 3879
Fri Oct 13 12:14:34 UTC 2017 We're ok: there is no zombie test
{color:green}+1 zombies{color}. No zombie tests found running at the end of the build.
POST BUILD TASK : SUCCESS
END OF POST BUILD TASK : 0
Archiving artifacts
Recording test results
[FINDBUGS] Skipping publisher since build result is FAILURE
[CHECKSTYLE] Skipping publisher since build result is FAILURE
Build failed in Jenkins: HBase-Trunk_matrix » JDK 1.8 (latest),Hadoop #3883
Posted by Apache Jenkins Server <je...@builds.apache.org>.
See <https://builds.apache.org/job/HBase-Trunk_matrix/jdk=JDK%201.8%20(latest),label=Hadoop/3883/display/redirect?page=changes>
Changes:
[hsun] HBASE-18355 Enable export snapshot tests that were disabled by Proc-V2
[tedyu] HBASE-18843 Add DistCp support to incremental backup with bulk loading
[zhangduo] HBASE-18747 Introduce new example and helper classes to tell CP users
------------------------------------------
[...truncated 1.26 MB...]
[INFO] Total time: 1.157s
[INFO] Finished at: Sat Oct 14 04:33:10 UTC 2017
[INFO] Final Memory: 20M/724M
[INFO] ------------------------------------------------------------------------
[INFO] Archetype project created in <https://builds.apache.org/job/HBase-Trunk_matrix/jdk=JDK%201.8%20(latest),label=Hadoop/ws/hbase-archetypes/hbase-client-project/target/build-archetype/target/generated-sources/archetype>
[INFO] ------------------------------------------------------------------------
[INFO] BUILD SUCCESS
[INFO] ------------------------------------------------------------------------
[INFO] Total time: 3.992s
[INFO] Finished at: Sat Oct 14 04:33:10 UTC 2017
[INFO] Final Memory: 21M/724M
[INFO] ------------------------------------------------------------------------
[INFO] Scanning for projects...
[INFO]
[INFO] ------------------------------------------------------------------------
[INFO] Building Apache HBase - Exemplar for hbase-shaded-client archetype 3.0.0-SNAPSHOT
[INFO] ------------------------------------------------------------------------
[INFO]
[INFO] >>> maven-archetype-plugin:2.4:create-from-project (default-cli) @ hbase-shaded-client-project >>>
[INFO]
[INFO] <<< maven-archetype-plugin:2.4:create-from-project (default-cli) @ hbase-shaded-client-project <<<
[INFO]
[INFO] --- maven-archetype-plugin:2.4:create-from-project (default-cli) @ hbase-shaded-client-project ---
[INFO] Setting default groupId: org.apache.hbase
[INFO] Setting default artifactId: hbase-shaded-client-project
[INFO] Setting default version: 3.0.0-SNAPSHOT
[INFO] Setting default package: org.apache.hbase.archetypes.exemplars.shaded_client
[INFO] Scanning for projects...
[INFO]
[INFO] ------------------------------------------------------------------------
[INFO] Building hbase-shaded-client-project-archetype 3.0.0-SNAPSHOT
[INFO] ------------------------------------------------------------------------
[INFO]
[INFO] --- maven-resources-plugin:3.0.1:resources (default-resources) @ hbase-shaded-client-project-archetype ---
[WARNING] Using platform encoding (ISO-8859-1 actually) to copy filtered resources, i.e. build is platform dependent!
[INFO] Copying 6 resources
[INFO]
[INFO] --- maven-resources-plugin:3.0.1:testResources (default-testResources) @ hbase-shaded-client-project-archetype ---
[WARNING] Using platform encoding (ISO-8859-1 actually) to copy filtered resources, i.e. build is platform dependent!
[INFO] Copying 2 resources
[INFO]
[INFO] --- maven-archetype-plugin:2.4:jar (default-jar) @ hbase-shaded-client-project-archetype ---
[INFO] Building archetype jar: <https://builds.apache.org/job/HBase-Trunk_matrix/jdk=JDK%201.8%20(latest),label=Hadoop/ws/hbase-archetypes/hbase-shaded-client-project/target/build-archetype/target/generated-sources/archetype/target/hbase-shaded-client-project-archetype-3.0.0-SNAPSHOT>
[INFO] ------------------------------------------------------------------------
[INFO] BUILD SUCCESS
[INFO] ------------------------------------------------------------------------
[INFO] Total time: 1.098s
[INFO] Finished at: Sat Oct 14 04:33:15 UTC 2017
[INFO] Final Memory: 20M/724M
[INFO] ------------------------------------------------------------------------
[INFO] Archetype project created in <https://builds.apache.org/job/HBase-Trunk_matrix/jdk=JDK%201.8%20(latest),label=Hadoop/ws/hbase-archetypes/hbase-shaded-client-project/target/build-archetype/target/generated-sources/archetype>
[INFO] ------------------------------------------------------------------------
[INFO] BUILD SUCCESS
[INFO] ------------------------------------------------------------------------
[INFO] Total time: 3.474s
[INFO] Finished at: Sat Oct 14 04:33:15 UTC 2017
[INFO] Final Memory: 21M/724M
[INFO] ------------------------------------------------------------------------
[INFO]
[INFO] --- maven-resources-plugin:2.7:copy-resources (hbase-client-ARCHETYPE__copy-pom-to-temp-for-xslt-processing) @ hbase-archetype-builder ---
[INFO] Using 'UTF-8' encoding to copy filtered resources.
[INFO] Copying 1 resource
[INFO]
[INFO] --- maven-resources-plugin:2.7:copy-resources (hbase-shaded-client-ARCHETYPE__copy-pom-to-temp-for-xslt-processing) @ hbase-archetype-builder ---
[INFO] Using 'UTF-8' encoding to copy filtered resources.
[INFO] Copying 1 resource
[INFO]
[INFO] --- xml-maven-plugin:1.0.1:transform (modify-archetype-pom-files-via-xslt) @ hbase-archetype-builder ---
[INFO] Transforming file: <https://builds.apache.org/job/HBase-Trunk_matrix/jdk=JDK%201.8%20(latest),label=Hadoop/3883/artifact/hbase-archetypes/hbase-archetype-builder/../hbase-client-project/target/temp-arch/pom.xml>
[INFO] Transformed 1 file(s).
[INFO] Transforming file: <https://builds.apache.org/job/HBase-Trunk_matrix/jdk=JDK%201.8%20(latest),label=Hadoop/3883/artifact/hbase-archetypes/hbase-archetype-builder/../hbase-shaded-client-project/target/temp-arch/pom.xml>
[INFO] Transformed 1 file(s).
[INFO]
[INFO] --- maven-install-plugin:2.5.2:install (default-install) @ hbase-archetype-builder ---
[INFO] Installing <https://builds.apache.org/job/HBase-Trunk_matrix/jdk=JDK%201.8%20(latest),label=Hadoop/3883/artifact/hbase-archetypes/hbase-archetype-builder/pom.xml> to /home/jenkins/.m2/repository/org/apache/hbase/hbase-archetype-builder/3.0.0-SNAPSHOT/hbase-archetype-builder-3.0.0-SNAPSHOT.pom
[INFO]
[INFO] --- exec-maven-plugin:1.6.0:exec (run-installArchetypes-script) @ hbase-archetype-builder ---
[INFO] Scanning for projects...
[INFO]
[INFO] ------------------------------------------------------------------------
[INFO] Building hbase-client-project-archetype 3.0.0-SNAPSHOT
[INFO] ------------------------------------------------------------------------
[INFO]
[INFO] --- maven-resources-plugin:3.0.1:resources (default-resources) @ hbase-client-project-archetype ---
[INFO] Using 'UTF-8' encoding to copy filtered resources.
[INFO] Copying 6 resources
[INFO]
[INFO] --- maven-resources-plugin:3.0.1:testResources (default-testResources) @ hbase-client-project-archetype ---
[INFO] Using 'UTF-8' encoding to copy filtered resources.
[INFO] Copying 2 resources
[INFO]
[INFO] --- maven-archetype-plugin:2.4:jar (default-jar) @ hbase-client-project-archetype ---
[INFO] Building archetype jar: <https://builds.apache.org/job/HBase-Trunk_matrix/jdk=JDK%201.8%20(latest),label=Hadoop/ws/hbase-archetypes/hbase-client-project/target/build-archetype/target/generated-sources/archetype/target/hbase-client-project-archetype-3.0.0-SNAPSHOT>
[INFO]
[INFO] --- maven-archetype-plugin:2.4:integration-test (default-integration-test) @ hbase-client-project-archetype ---
[INFO] Processing Archetype IT project: basic
[INFO] ----------------------------------------------------------------------------
[INFO] Using following parameters for creating project from Archetype: hbase-client-project-archetype:3.0.0-SNAPSHOT
[INFO] ----------------------------------------------------------------------------
[INFO] Parameter: groupId, Value: archetype.it
[INFO] Parameter: artifactId, Value: basic
[INFO] Parameter: version, Value: 0.1-SNAPSHOT
[INFO] Parameter: package, Value: it.pkg
[INFO] Parameter: packageInPathFormat, Value: it/pkg
[INFO] Parameter: version, Value: 0.1-SNAPSHOT
[INFO] Parameter: package, Value: it.pkg
[INFO] Parameter: groupId, Value: archetype.it
[INFO] Parameter: artifactId, Value: basic
[INFO] project created from Archetype in dir: <https://builds.apache.org/job/HBase-Trunk_matrix/jdk=JDK%201.8%20(latest),label=Hadoop/ws/hbase-archetypes/hbase-client-project/target/build-archetype/target/generated-sources/archetype/target/test-classes/projects/basic/project/basic>
[INFO]
[INFO] --- maven-install-plugin:2.5.2:install (default-install) @ hbase-client-project-archetype ---
[INFO] Installing <https://builds.apache.org/job/HBase-Trunk_matrix/jdk=JDK%201.8%20(latest),label=Hadoop/ws/hbase-archetypes/hbase-client-project/target/build-archetype/target/generated-sources/archetype/target/hbase-client-project-archetype-3.0.0-SNAPSHOT.jar> to /home/jenkins/.m2/repository/org/apache/hbase/hbase-client-project-archetype/3.0.0-SNAPSHOT/hbase-client-project-archetype-3.0.0-SNAPSHOT.jar
[INFO] Installing <https://builds.apache.org/job/HBase-Trunk_matrix/jdk=JDK%201.8%20(latest),label=Hadoop/3883/artifact/hbase-archetypes/hbase-client-project/target/build-archetype/target/generated-sources/archetype/pom.xml> to /home/jenkins/.m2/repository/org/apache/hbase/hbase-client-project-archetype/3.0.0-SNAPSHOT/hbase-client-project-archetype-3.0.0-SNAPSHOT.pom
[INFO]
[INFO] --- maven-archetype-plugin:2.4:update-local-catalog (default-update-local-catalog) @ hbase-client-project-archetype ---
[INFO] ------------------------------------------------------------------------
[INFO] BUILD SUCCESS
[INFO] ------------------------------------------------------------------------
[INFO] Total time: 1.371s
[INFO] Finished at: Sat Oct 14 04:33:18 UTC 2017
[INFO] Final Memory: 21M/724M
[INFO] ------------------------------------------------------------------------
[INFO] Scanning for projects...
[INFO]
[INFO] ------------------------------------------------------------------------
[INFO] Building hbase-shaded-client-project-archetype 3.0.0-SNAPSHOT
[INFO] ------------------------------------------------------------------------
[INFO]
[INFO] --- maven-resources-plugin:3.0.1:resources (default-resources) @ hbase-shaded-client-project-archetype ---
[INFO] Using 'UTF-8' encoding to copy filtered resources.
[INFO] Copying 6 resources
[INFO]
[INFO] --- maven-resources-plugin:3.0.1:testResources (default-testResources) @ hbase-shaded-client-project-archetype ---
[INFO] Using 'UTF-8' encoding to copy filtered resources.
[INFO] Copying 2 resources
[INFO]
[INFO] --- maven-archetype-plugin:2.4:jar (default-jar) @ hbase-shaded-client-project-archetype ---
[INFO] Building archetype jar: <https://builds.apache.org/job/HBase-Trunk_matrix/jdk=JDK%201.8%20(latest),label=Hadoop/ws/hbase-archetypes/hbase-shaded-client-project/target/build-archetype/target/generated-sources/archetype/target/hbase-shaded-client-project-archetype-3.0.0-SNAPSHOT>
[INFO]
[INFO] --- maven-archetype-plugin:2.4:integration-test (default-integration-test) @ hbase-shaded-client-project-archetype ---
[INFO] Processing Archetype IT project: basic
[INFO] ----------------------------------------------------------------------------
[INFO] Using following parameters for creating project from Archetype: hbase-shaded-client-project-archetype:3.0.0-SNAPSHOT
[INFO] ----------------------------------------------------------------------------
[INFO] Parameter: groupId, Value: archetype.it
[INFO] Parameter: artifactId, Value: basic
[INFO] Parameter: version, Value: 0.1-SNAPSHOT
[INFO] Parameter: package, Value: it.pkg
[INFO] Parameter: packageInPathFormat, Value: it/pkg
[INFO] Parameter: version, Value: 0.1-SNAPSHOT
[INFO] Parameter: package, Value: it.pkg
[INFO] Parameter: groupId, Value: archetype.it
[INFO] Parameter: artifactId, Value: basic
[INFO] project created from Archetype in dir: <https://builds.apache.org/job/HBase-Trunk_matrix/jdk=JDK%201.8%20(latest),label=Hadoop/ws/hbase-archetypes/hbase-shaded-client-project/target/build-archetype/target/generated-sources/archetype/target/test-classes/projects/basic/project/basic>
[INFO]
[INFO] --- maven-install-plugin:2.5.2:install (default-install) @ hbase-shaded-client-project-archetype ---
[INFO] Installing <https://builds.apache.org/job/HBase-Trunk_matrix/jdk=JDK%201.8%20(latest),label=Hadoop/ws/hbase-archetypes/hbase-shaded-client-project/target/build-archetype/target/generated-sources/archetype/target/hbase-shaded-client-project-archetype-3.0.0-SNAPSHOT.jar> to /home/jenkins/.m2/repository/org/apache/hbase/hbase-shaded-client-project-archetype/3.0.0-SNAPSHOT/hbase-shaded-client-project-archetype-3.0.0-SNAPSHOT.jar
[INFO] Installing <https://builds.apache.org/job/HBase-Trunk_matrix/jdk=JDK%201.8%20(latest),label=Hadoop/3883/artifact/hbase-archetypes/hbase-shaded-client-project/target/build-archetype/target/generated-sources/archetype/pom.xml> to /home/jenkins/.m2/repository/org/apache/hbase/hbase-shaded-client-project-archetype/3.0.0-SNAPSHOT/hbase-shaded-client-project-archetype-3.0.0-SNAPSHOT.pom
[INFO]
[INFO] --- maven-archetype-plugin:2.4:update-local-catalog (default-update-local-catalog) @ hbase-shaded-client-project-archetype ---
[INFO] ------------------------------------------------------------------------
[INFO] BUILD SUCCESS
[INFO] ------------------------------------------------------------------------
[INFO] Total time: 1.334s
[INFO] Finished at: Sat Oct 14 04:33:21 UTC 2017
[INFO] Final Memory: 21M/724M
[INFO] ------------------------------------------------------------------------
[INFO] ------------------------------------------------------------------------
[INFO] Reactor Summary:
[INFO]
[INFO] Apache HBase ...................................... SUCCESS [6.763s]
[INFO] Apache HBase - Checkstyle ......................... SUCCESS [1.567s]
[INFO] Apache HBase - Build Support ...................... SUCCESS [0.155s]
[INFO] Apache HBase - Error Prone Rules .................. SUCCESS [0.707s]
[INFO] Apache HBase - Annotations ........................ SUCCESS [0.734s]
[INFO] Apache HBase - Build Configuration ................ SUCCESS [0.164s]
[INFO] Apache HBase - Shaded Protocol .................... SUCCESS [45.342s]
[INFO] Apache HBase - Common ............................. SUCCESS [4:02.708s]
[INFO] Apache HBase - Metrics API ........................ SUCCESS [3.986s]
[INFO] Apache HBase - Hadoop Compatibility ............... SUCCESS [26.655s]
[INFO] Apache HBase - Metrics Implementation ............. SUCCESS [14.981s]
[INFO] Apache HBase - Hadoop Two Compatibility ........... SUCCESS [33.084s]
[INFO] Apache HBase - Protocol ........................... SUCCESS [13.543s]
[INFO] Apache HBase - Client ............................. SUCCESS [3:40.238s]
[INFO] Apache HBase - Replication ........................ SUCCESS [2.222s]
[INFO] Apache HBase - Prefix Tree ........................ SUCCESS [35.991s]
[INFO] Apache HBase - Procedure .......................... SUCCESS [4:46.758s]
[INFO] Apache HBase - Resource Bundle .................... SUCCESS [0.436s]
[INFO] Apache HBase - Server ............................. FAILURE [2:12:03.782s]
[INFO] Apache HBase - MapReduce .......................... SKIPPED
[INFO] Apache HBase - Testing Util ....................... SKIPPED
[INFO] Apache HBase - Thrift ............................. SKIPPED
[INFO] Apache HBase - RSGroup ............................ SKIPPED
[INFO] Apache HBase - Shell .............................. SKIPPED
[INFO] Apache HBase - Coprocessor Endpoint ............... SKIPPED
[INFO] Apache HBase - Backup ............................. SKIPPED
[INFO] Apache HBase - Integration Tests .................. SKIPPED
[INFO] Apache HBase - Examples ........................... SKIPPED
[INFO] Apache HBase - Rest ............................... SKIPPED
[INFO] Apache HBase - External Block Cache ............... SKIPPED
[INFO] Apache HBase - Spark .............................. SKIPPED
[INFO] Apache HBase - Spark Integration Tests ............ SKIPPED
[INFO] Apache HBase - Assembly ........................... SKIPPED
[INFO] Apache HBase - Shaded ............................. SUCCESS [0.333s]
[INFO] Apache HBase - Shaded - Client .................... SUCCESS [1.232s]
[INFO] Apache HBase - Shaded - MapReduce ................. SKIPPED
[INFO] Apache HBase Shaded Packaging Invariants .......... SKIPPED
[INFO] Apache HBase - Archetypes ......................... SUCCESS [0.086s]
[INFO] Apache HBase - Exemplar for hbase-client archetype SKIPPED
[INFO] Apache HBase - Exemplar for hbase-shaded-client archetype SKIPPED
[INFO] Apache HBase - Archetype builder .................. SUCCESS [15.971s]
[INFO] ------------------------------------------------------------------------
[INFO] BUILD FAILURE
[INFO] ------------------------------------------------------------------------
[INFO] Total time: 2:28:02.029s
[INFO] Finished at: Sat Oct 14 04:33:21 UTC 2017
[INFO] Final Memory: 99M/3687M
[INFO] ------------------------------------------------------------------------
[ERROR] Failed to execute goal org.apache.maven.plugins:maven-surefire-plugin:2.19.1:test (secondPartTestsExecution) on project hbase-server: There are test failures.
[ERROR]
[ERROR] Please refer to <https://builds.apache.org/job/HBase-Trunk_matrix/jdk=JDK%201.8%20(latest),label=Hadoop/ws/hbase-server/target/surefire-reports> for the individual test results.
[ERROR] -> [Help 1]
[ERROR]
[ERROR] To see the full stack trace of the errors, re-run Maven with the -e switch.
[ERROR] Re-run Maven using the -X switch to enable full debug logging.
[ERROR]
[ERROR] For more information about the errors and possible solutions, please read the following articles:
[ERROR] [Help 1] http://cwiki.apache.org/confluence/display/MAVEN/MojoFailureException
[ERROR]
[ERROR] After correcting the problems, you can resume the build with the command
[ERROR] mvn <goals> -rf :hbase-server
Build step 'Invoke top-level Maven targets' marked build as failure
Performing Post build task...
Match found for :.* : True
Logical operation result is TRUE
Running script : # Run zombie detector script
./dev-support/zombie-detector.sh --jenkins ${BUILD_ID}
[a3159d73] $ /bin/bash -xe /tmp/jenkins4537521467327415856.sh
+ ./dev-support/zombie-detector.sh --jenkins 3883
Sat Oct 14 04:33:23 UTC 2017 We're ok: there is no zombie test
{color:green}+1 zombies{color}. No zombie tests found running at the end of the build.
POST BUILD TASK : SUCCESS
END OF POST BUILD TASK : 0
Archiving artifacts
Recording test results
[FINDBUGS] Skipping publisher since build result is FAILURE
[CHECKSTYLE] Skipping publisher since build result is FAILURE
Build failed in Jenkins: HBase-Trunk_matrix » JDK 1.8 (latest),Hadoop #3882
Posted by Apache Jenkins Server <je...@builds.apache.org>.
See <https://builds.apache.org/job/HBase-Trunk_matrix/jdk=JDK%201.8%20(latest),label=Hadoop/3882/display/redirect?page=changes>
Changes:
[tedyu] HBASE-15410 Utilize the max seek value when all Filters in MUST_PASS_ALL
------------------------------------------
[...truncated 1.48 MB...]
[INFO] Apache HBase - Error Prone Rules .................. SUCCESS [0.275s]
[INFO] Apache HBase - Annotations ........................ SUCCESS [0.216s]
[INFO] Apache HBase - Build Configuration ................ SUCCESS [0.088s]
[INFO] Apache HBase - Shaded Protocol .................... SUCCESS [27.067s]
[INFO] Apache HBase - Common ............................. SUCCESS [2:16.576s]
[INFO] Apache HBase - Metrics API ........................ SUCCESS [1.620s]
[INFO] Apache HBase - Hadoop Compatibility ............... SUCCESS [12.992s]
[INFO] Apache HBase - Metrics Implementation ............. SUCCESS [6.954s]
[INFO] Apache HBase - Hadoop Two Compatibility ........... SUCCESS [16.119s]
[INFO] Apache HBase - Protocol ........................... SUCCESS [8.165s]
[INFO] Apache HBase - Client ............................. SUCCESS [2:15.548s]
[INFO] Apache HBase - Replication ........................ SUCCESS [1.320s]
[INFO] Apache HBase - Prefix Tree ........................ SUCCESS [16.101s]
[INFO] Apache HBase - Procedure .......................... SUCCESS [2:46.988s]
[INFO] Apache HBase - Resource Bundle .................... SUCCESS [0.170s]
[INFO] Apache HBase - Server ............................. SUCCESS [1:36:17.709s]
[INFO] Apache HBase - MapReduce .......................... SUCCESS [7:03.338s]
[INFO] Apache HBase - Testing Util ....................... SUCCESS [3.087s]
[INFO] Apache HBase - Thrift ............................. SUCCESS [1:28.841s]
[INFO] Apache HBase - RSGroup ............................ SUCCESS [9.440s]
[INFO] Apache HBase - Shell .............................. SUCCESS [6:55.569s]
[INFO] Apache HBase - Coprocessor Endpoint ............... SUCCESS [2:17.951s]
[INFO] Apache HBase - Backup ............................. SUCCESS [8:42.162s]
[INFO] Apache HBase - Integration Tests .................. SUCCESS [5.883s]
[INFO] Apache HBase - Examples ........................... SUCCESS [35.690s]
[INFO] Apache HBase - Rest ............................... SUCCESS [2:56.692s]
[INFO] Apache HBase - External Block Cache ............... SUCCESS [3.073s]
[INFO] Apache HBase - Spark .............................. SUCCESS [3:13.561s]
[INFO] Apache HBase - Spark Integration Tests ............ SUCCESS [3.273s]
[INFO] Apache HBase - Assembly ........................... SUCCESS [5.413s]
[INFO] Apache HBase - Shaded ............................. SUCCESS [0.171s]
[INFO] Apache HBase - Shaded - Client .................... SUCCESS [1.150s]
[INFO] Apache HBase - Shaded - MapReduce ................. SUCCESS [1.839s]
[INFO] Apache HBase Shaded Packaging Invariants .......... SUCCESS [2.262s]
[INFO] Apache HBase - Archetypes ......................... SUCCESS [0.070s]
[INFO] Apache HBase - Exemplar for hbase-client archetype SUCCESS [26.284s]
[INFO] Apache HBase - Exemplar for hbase-shaded-client archetype SUCCESS [24.539s]
[INFO] Apache HBase - Archetype builder .................. SUCCESS [16.323s]
[INFO] ------------------------------------------------------------------------
[INFO] BUILD SUCCESS
[INFO] ------------------------------------------------------------------------
[INFO] Total time: 2:20:09.450s
[INFO] Finished at: Sat Oct 14 00:57:08 UTC 2017
[INFO] Final Memory: 213M/3094M
[INFO] ------------------------------------------------------------------------
Performing Post build task...
Match found for :.* : True
Logical operation result is TRUE
Running script : # Run zombie detector script
./dev-support/zombie-detector.sh --jenkins ${BUILD_ID}
[a3159d73] $ /bin/bash -xe /tmp/jenkins106033306905279281.sh
+ ./dev-support/zombie-detector.sh --jenkins 3882
Sat Oct 14 00:57:10 UTC 2017 We're ok: there is no zombie test
{color:green}+1 zombies{color}. No zombie tests found running at the end of the build.
POST BUILD TASK : SUCCESS
END OF POST BUILD TASK : 0
Archiving artifacts
Recording test results
[FINDBUGS] Collecting findbugs analysis files...
[FINDBUGS] Searching for all files in <https://builds.apache.org/job/HBase-Trunk_matrix/jdk=JDK%201.8%20(latest),label=Hadoop/ws/> that match the pattern **/findbugs.xml,**/findbugsXml.xml
[FINDBUGS] Parsing 48 files in <https://builds.apache.org/job/HBase-Trunk_matrix/jdk=JDK%201.8%20(latest),label=Hadoop/ws/>
[FINDBUGS] Successfully parsed file <https://builds.apache.org/job/HBase-Trunk_matrix/jdk=JDK%201.8%20(latest),label=Hadoop/3882/artifact/hbase-archetypes/hbase-client-project/target/findbugs.xml> with 0 unique warnings and 0 duplicates.
[FINDBUGS] Successfully parsed file <https://builds.apache.org/job/HBase-Trunk_matrix/jdk=JDK%201.8%20(latest),label=Hadoop/3882/artifact/hbase-archetypes/hbase-client-project/target/findbugsXml.xml> with 0 unique warnings and 0 duplicates.
[FINDBUGS] Successfully parsed file <https://builds.apache.org/job/HBase-Trunk_matrix/jdk=JDK%201.8%20(latest),label=Hadoop/3882/artifact/hbase-archetypes/hbase-shaded-client-project/target/findbugs.xml> with 0 unique warnings and 0 duplicates.
[FINDBUGS] Successfully parsed file <https://builds.apache.org/job/HBase-Trunk_matrix/jdk=JDK%201.8%20(latest),label=Hadoop/3882/artifact/hbase-archetypes/hbase-shaded-client-project/target/findbugsXml.xml> with 0 unique warnings and 0 duplicates.
[FINDBUGS] Successfully parsed file <https://builds.apache.org/job/HBase-Trunk_matrix/jdk=JDK%201.8%20(latest),label=Hadoop/3882/artifact/hbase-backup/target/findbugs.xml> with 0 unique warnings and 0 duplicates.
[FINDBUGS] Successfully parsed file <https://builds.apache.org/job/HBase-Trunk_matrix/jdk=JDK%201.8%20(latest),label=Hadoop/3882/artifact/hbase-backup/target/findbugsXml.xml> with 0 unique warnings and 0 duplicates.
[FINDBUGS] Successfully parsed file <https://builds.apache.org/job/HBase-Trunk_matrix/jdk=JDK%201.8%20(latest),label=Hadoop/3882/artifact/hbase-build-support/hbase-error-prone/target/findbugs.xml> with 0 unique warnings and 0 duplicates.
[FINDBUGS] Successfully parsed file <https://builds.apache.org/job/HBase-Trunk_matrix/jdk=JDK%201.8%20(latest),label=Hadoop/3882/artifact/hbase-build-support/hbase-error-prone/target/findbugsXml.xml> with 0 unique warnings and 0 duplicates.
[FINDBUGS] Successfully parsed file <https://builds.apache.org/job/HBase-Trunk_matrix/jdk=JDK%201.8%20(latest),label=Hadoop/3882/artifact/hbase-client/target/findbugs.xml> with 0 unique warnings and 0 duplicates.
[FINDBUGS] Successfully parsed file <https://builds.apache.org/job/HBase-Trunk_matrix/jdk=JDK%201.8%20(latest),label=Hadoop/3882/artifact/hbase-client/target/findbugsXml.xml> with 0 unique warnings and 0 duplicates.
[FINDBUGS] Successfully parsed file <https://builds.apache.org/job/HBase-Trunk_matrix/jdk=JDK%201.8%20(latest),label=Hadoop/3882/artifact/hbase-common/target/findbugs.xml> with 0 unique warnings and 0 duplicates.
[FINDBUGS] Successfully parsed file <https://builds.apache.org/job/HBase-Trunk_matrix/jdk=JDK%201.8%20(latest),label=Hadoop/3882/artifact/hbase-common/target/findbugsXml.xml> with 0 unique warnings and 0 duplicates.
[FINDBUGS] Successfully parsed file <https://builds.apache.org/job/HBase-Trunk_matrix/jdk=JDK%201.8%20(latest),label=Hadoop/3882/artifact/hbase-endpoint/target/findbugs.xml> with 0 unique warnings and 0 duplicates.
[FINDBUGS] Successfully parsed file <https://builds.apache.org/job/HBase-Trunk_matrix/jdk=JDK%201.8%20(latest),label=Hadoop/3882/artifact/hbase-endpoint/target/findbugsXml.xml> with 0 unique warnings and 0 duplicates.
[FINDBUGS] Successfully parsed file <https://builds.apache.org/job/HBase-Trunk_matrix/jdk=JDK%201.8%20(latest),label=Hadoop/3882/artifact/hbase-examples/target/findbugs.xml> with 0 unique warnings and 0 duplicates.
[FINDBUGS] Successfully parsed file <https://builds.apache.org/job/HBase-Trunk_matrix/jdk=JDK%201.8%20(latest),label=Hadoop/3882/artifact/hbase-examples/target/findbugsXml.xml> with 0 unique warnings and 0 duplicates.
[FINDBUGS] Successfully parsed file <https://builds.apache.org/job/HBase-Trunk_matrix/jdk=JDK%201.8%20(latest),label=Hadoop/3882/artifact/hbase-external-blockcache/target/findbugs.xml> with 0 unique warnings and 0 duplicates.
[FINDBUGS] Successfully parsed file <https://builds.apache.org/job/HBase-Trunk_matrix/jdk=JDK%201.8%20(latest),label=Hadoop/3882/artifact/hbase-external-blockcache/target/findbugsXml.xml> with 0 unique warnings and 0 duplicates.
[FINDBUGS] Successfully parsed file <https://builds.apache.org/job/HBase-Trunk_matrix/jdk=JDK%201.8%20(latest),label=Hadoop/3882/artifact/hbase-hadoop-compat/target/findbugs.xml> with 0 unique warnings and 0 duplicates.
[FINDBUGS] Successfully parsed file <https://builds.apache.org/job/HBase-Trunk_matrix/jdk=JDK%201.8%20(latest),label=Hadoop/3882/artifact/hbase-hadoop-compat/target/findbugsXml.xml> with 0 unique warnings and 0 duplicates.
[FINDBUGS] Successfully parsed file <https://builds.apache.org/job/HBase-Trunk_matrix/jdk=JDK%201.8%20(latest),label=Hadoop/3882/artifact/hbase-hadoop2-compat/target/findbugs.xml> with 0 unique warnings and 0 duplicates.
[FINDBUGS] Successfully parsed file <https://builds.apache.org/job/HBase-Trunk_matrix/jdk=JDK%201.8%20(latest),label=Hadoop/3882/artifact/hbase-hadoop2-compat/target/findbugsXml.xml> with 0 unique warnings and 0 duplicates.
[FINDBUGS] Successfully parsed file <https://builds.apache.org/job/HBase-Trunk_matrix/jdk=JDK%201.8%20(latest),label=Hadoop/3882/artifact/hbase-mapreduce/target/findbugs.xml> with 0 unique warnings and 0 duplicates.
[FINDBUGS] Successfully parsed file <https://builds.apache.org/job/HBase-Trunk_matrix/jdk=JDK%201.8%20(latest),label=Hadoop/3882/artifact/hbase-mapreduce/target/findbugsXml.xml> with 0 unique warnings and 0 duplicates.
[FINDBUGS] Successfully parsed file <https://builds.apache.org/job/HBase-Trunk_matrix/jdk=JDK%201.8%20(latest),label=Hadoop/3882/artifact/hbase-metrics-api/target/findbugs.xml> with 0 unique warnings and 0 duplicates.
[FINDBUGS] Successfully parsed file <https://builds.apache.org/job/HBase-Trunk_matrix/jdk=JDK%201.8%20(latest),label=Hadoop/3882/artifact/hbase-metrics-api/target/findbugsXml.xml> with 0 unique warnings and 0 duplicates.
[FINDBUGS] Successfully parsed file <https://builds.apache.org/job/HBase-Trunk_matrix/jdk=JDK%201.8%20(latest),label=Hadoop/3882/artifact/hbase-metrics/target/findbugs.xml> with 0 unique warnings and 0 duplicates.
[FINDBUGS] Successfully parsed file <https://builds.apache.org/job/HBase-Trunk_matrix/jdk=JDK%201.8%20(latest),label=Hadoop/3882/artifact/hbase-metrics/target/findbugsXml.xml> with 0 unique warnings and 0 duplicates.
[FINDBUGS] Successfully parsed file <https://builds.apache.org/job/HBase-Trunk_matrix/jdk=JDK%201.8%20(latest),label=Hadoop/3882/artifact/hbase-prefix-tree/target/findbugs.xml> with 0 unique warnings and 0 duplicates.
[FINDBUGS] Successfully parsed file <https://builds.apache.org/job/HBase-Trunk_matrix/jdk=JDK%201.8%20(latest),label=Hadoop/3882/artifact/hbase-prefix-tree/target/findbugsXml.xml> with 0 unique warnings and 0 duplicates.
[FINDBUGS] Successfully parsed file <https://builds.apache.org/job/HBase-Trunk_matrix/jdk=JDK%201.8%20(latest),label=Hadoop/3882/artifact/hbase-procedure/target/findbugs.xml> with 0 unique warnings and 0 duplicates.
[FINDBUGS] Successfully parsed file <https://builds.apache.org/job/HBase-Trunk_matrix/jdk=JDK%201.8%20(latest),label=Hadoop/3882/artifact/hbase-procedure/target/findbugsXml.xml> with 0 unique warnings and 0 duplicates.
[FINDBUGS] Successfully parsed file <https://builds.apache.org/job/HBase-Trunk_matrix/jdk=JDK%201.8%20(latest),label=Hadoop/3882/artifact/hbase-protocol-shaded/target/findbugs.xml> with 0 unique warnings and 0 duplicates.
[FINDBUGS] Successfully parsed file <https://builds.apache.org/job/HBase-Trunk_matrix/jdk=JDK%201.8%20(latest),label=Hadoop/3882/artifact/hbase-protocol-shaded/target/findbugsXml.xml> with 0 unique warnings and 0 duplicates.
[FINDBUGS] Successfully parsed file <https://builds.apache.org/job/HBase-Trunk_matrix/jdk=JDK%201.8%20(latest),label=Hadoop/3882/artifact/hbase-protocol/target/findbugs.xml> with 0 unique warnings and 0 duplicates.
[FINDBUGS] Successfully parsed file <https://builds.apache.org/job/HBase-Trunk_matrix/jdk=JDK%201.8%20(latest),label=Hadoop/3882/artifact/hbase-protocol/target/findbugsXml.xml> with 0 unique warnings and 0 duplicates.
[FINDBUGS] Successfully parsed file <https://builds.apache.org/job/HBase-Trunk_matrix/jdk=JDK%201.8%20(latest),label=Hadoop/3882/artifact/hbase-replication/target/findbugs.xml> with 0 unique warnings and 0 duplicates.
[FINDBUGS] Successfully parsed file <https://builds.apache.org/job/HBase-Trunk_matrix/jdk=JDK%201.8%20(latest),label=Hadoop/3882/artifact/hbase-replication/target/findbugsXml.xml> with 0 unique warnings and 0 duplicates.
[FINDBUGS] Successfully parsed file <https://builds.apache.org/job/HBase-Trunk_matrix/jdk=JDK%201.8%20(latest),label=Hadoop/3882/artifact/hbase-rest/target/findbugs.xml> with 0 unique warnings and 0 duplicates.
[FINDBUGS] Successfully parsed file <https://builds.apache.org/job/HBase-Trunk_matrix/jdk=JDK%201.8%20(latest),label=Hadoop/3882/artifact/hbase-rest/target/findbugsXml.xml> with 0 unique warnings and 0 duplicates.
[FINDBUGS] Successfully parsed file <https://builds.apache.org/job/HBase-Trunk_matrix/jdk=JDK%201.8%20(latest),label=Hadoop/3882/artifact/hbase-rsgroup/target/findbugs.xml> with 0 unique warnings and 0 duplicates.
[FINDBUGS] Successfully parsed file <https://builds.apache.org/job/HBase-Trunk_matrix/jdk=JDK%201.8%20(latest),label=Hadoop/3882/artifact/hbase-rsgroup/target/findbugsXml.xml> with 0 unique warnings and 0 duplicates.
[FINDBUGS] Successfully parsed file <https://builds.apache.org/job/HBase-Trunk_matrix/jdk=JDK%201.8%20(latest),label=Hadoop/3882/artifact/hbase-server/target/findbugs.xml> with 0 unique warnings and 0 duplicates.
[FINDBUGS] Successfully parsed file <https://builds.apache.org/job/HBase-Trunk_matrix/jdk=JDK%201.8%20(latest),label=Hadoop/3882/artifact/hbase-server/target/findbugsXml.xml> with 0 unique warnings and 0 duplicates.
[FINDBUGS] Successfully parsed file <https://builds.apache.org/job/HBase-Trunk_matrix/jdk=JDK%201.8%20(latest),label=Hadoop/3882/artifact/hbase-spark/target/findbugs.xml> with 0 unique warnings and 0 duplicates.
[FINDBUGS] Successfully parsed file <https://builds.apache.org/job/HBase-Trunk_matrix/jdk=JDK%201.8%20(latest),label=Hadoop/3882/artifact/hbase-spark/target/findbugsXml.xml> with 0 unique warnings and 0 duplicates.
[FINDBUGS] Successfully parsed file <https://builds.apache.org/job/HBase-Trunk_matrix/jdk=JDK%201.8%20(latest),label=Hadoop/3882/artifact/hbase-thrift/target/findbugs.xml> with 0 unique warnings and 0 duplicates.
[FINDBUGS] Successfully parsed file <https://builds.apache.org/job/HBase-Trunk_matrix/jdk=JDK%201.8%20(latest),label=Hadoop/3882/artifact/hbase-thrift/target/findbugsXml.xml> with 0 unique warnings and 0 duplicates.
<Git Blamer> Using GitBlamer to create author and commit information for all warnings.
<Git Blamer> GIT_COMMIT=ffdc0e6851e7172bfd3a31a0d78a92fa712ece0e, workspace=<https://builds.apache.org/job/HBase-Trunk_matrix/jdk=JDK%201.8%20(latest),label=Hadoop/ws/>
[FINDBUGS] Computing warning deltas based on reference build #3869
[CHECKSTYLE] Collecting checkstyle analysis files...
[CHECKSTYLE] Searching for all files in <https://builds.apache.org/job/HBase-Trunk_matrix/jdk=JDK%201.8%20(latest),label=Hadoop/ws/> that match the pattern **/checkstyle-result.xml
[CHECKSTYLE] Parsing 41 files in <https://builds.apache.org/job/HBase-Trunk_matrix/jdk=JDK%201.8%20(latest),label=Hadoop/ws/>
[CHECKSTYLE] Successfully parsed file <https://builds.apache.org/job/HBase-Trunk_matrix/jdk=JDK%201.8%20(latest),label=Hadoop/3882/artifact/hbase-annotations/target/checkstyle-result.xml> with 0 unique warnings and 0 duplicates.
[CHECKSTYLE] Successfully parsed file <https://builds.apache.org/job/HBase-Trunk_matrix/jdk=JDK%201.8%20(latest),label=Hadoop/3882/artifact/hbase-archetypes/hbase-archetype-builder/target/checkstyle-result.xml> with 0 unique warnings and 0 duplicates.
[CHECKSTYLE] Successfully parsed file <https://builds.apache.org/job/HBase-Trunk_matrix/jdk=JDK%201.8%20(latest),label=Hadoop/3882/artifact/hbase-archetypes/hbase-client-project/target/checkstyle-result.xml> with 0 unique warnings and 0 duplicates.
[CHECKSTYLE] Successfully parsed file <https://builds.apache.org/job/HBase-Trunk_matrix/jdk=JDK%201.8%20(latest),label=Hadoop/3882/artifact/hbase-archetypes/hbase-shaded-client-project/target/checkstyle-result.xml> with 0 unique warnings and 0 duplicates.
[CHECKSTYLE] Successfully parsed file <https://builds.apache.org/job/HBase-Trunk_matrix/jdk=JDK%201.8%20(latest),label=Hadoop/3882/artifact/hbase-archetypes/target/checkstyle-result.xml> with 0 unique warnings and 0 duplicates.
[CHECKSTYLE] Successfully parsed file <https://builds.apache.org/job/HBase-Trunk_matrix/jdk=JDK%201.8%20(latest),label=Hadoop/3882/artifact/hbase-assembly/target/checkstyle-result.xml> with 0 unique warnings and 0 duplicates.
[CHECKSTYLE] Successfully parsed file <https://builds.apache.org/job/HBase-Trunk_matrix/jdk=JDK%201.8%20(latest),label=Hadoop/3882/artifact/hbase-backup/target/checkstyle-result.xml> with 183 unique warnings and 0 duplicates.
[CHECKSTYLE] Successfully parsed file <https://builds.apache.org/job/HBase-Trunk_matrix/jdk=JDK%201.8%20(latest),label=Hadoop/3882/artifact/hbase-build-configuration/target/checkstyle-result.xml> with 183 unique warnings and 0 duplicates.
[CHECKSTYLE] Successfully parsed file <https://builds.apache.org/job/HBase-Trunk_matrix/jdk=JDK%201.8%20(latest),label=Hadoop/3882/artifact/hbase-build-support/hbase-error-prone/target/checkstyle-result.xml> with 187 unique warnings and 0 duplicates.
[CHECKSTYLE] Successfully parsed file <https://builds.apache.org/job/HBase-Trunk_matrix/jdk=JDK%201.8%20(latest),label=Hadoop/3882/artifact/hbase-build-support/target/checkstyle-result.xml> with 187 unique warnings and 0 duplicates.
[CHECKSTYLE] Successfully parsed file <https://builds.apache.org/job/HBase-Trunk_matrix/jdk=JDK%201.8%20(latest),label=Hadoop/3882/artifact/hbase-checkstyle/target/checkstyle-result.xml> with 187 unique warnings and 0 duplicates.
[CHECKSTYLE] Successfully parsed file <https://builds.apache.org/job/HBase-Trunk_matrix/jdk=JDK%201.8%20(latest),label=Hadoop/3882/artifact/hbase-client/target/checkstyle-result.xml> with 3691 unique warnings and 0 duplicates.
[CHECKSTYLE] Successfully parsed file <https://builds.apache.org/job/HBase-Trunk_matrix/jdk=JDK%201.8%20(latest),label=Hadoop/3882/artifact/hbase-common/target/checkstyle-result.xml> with 5164 unique warnings and 0 duplicates.
[CHECKSTYLE] Successfully parsed file <https://builds.apache.org/job/HBase-Trunk_matrix/jdk=JDK%201.8%20(latest),label=Hadoop/3882/artifact/hbase-endpoint/target/checkstyle-result.xml> with 5304 unique warnings and 0 duplicates.
[CHECKSTYLE] Successfully parsed file <https://builds.apache.org/job/HBase-Trunk_matrix/jdk=JDK%201.8%20(latest),label=Hadoop/3882/artifact/hbase-examples/target/checkstyle-result.xml> with 5593 unique warnings and 0 duplicates.
[CHECKSTYLE] Successfully parsed file <https://builds.apache.org/job/HBase-Trunk_matrix/jdk=JDK%201.8%20(latest),label=Hadoop/3882/artifact/hbase-external-blockcache/target/checkstyle-result.xml> with 5595 unique warnings and 0 duplicates.
[CHECKSTYLE] Successfully parsed file <https://builds.apache.org/job/HBase-Trunk_matrix/jdk=JDK%201.8%20(latest),label=Hadoop/3882/artifact/hbase-hadoop-compat/target/checkstyle-result.xml> with 5617 unique warnings and 0 duplicates.
[CHECKSTYLE] Successfully parsed file <https://builds.apache.org/job/HBase-Trunk_matrix/jdk=JDK%201.8%20(latest),label=Hadoop/3882/artifact/hbase-hadoop2-compat/target/checkstyle-result.xml> with 5753 unique warnings and 0 duplicates.
[CHECKSTYLE] Successfully parsed file <https://builds.apache.org/job/HBase-Trunk_matrix/jdk=JDK%201.8%20(latest),label=Hadoop/3882/artifact/hbase-it/target/checkstyle-result.xml> with 5753 unique warnings and 0 duplicates.
[CHECKSTYLE] Successfully parsed file <https://builds.apache.org/job/HBase-Trunk_matrix/jdk=JDK%201.8%20(latest),label=Hadoop/3882/artifact/hbase-mapreduce/target/checkstyle-result.xml> with 6259 unique warnings and 0 duplicates.
[CHECKSTYLE] Successfully parsed file <https://builds.apache.org/job/HBase-Trunk_matrix/jdk=JDK%201.8%20(latest),label=Hadoop/3882/artifact/hbase-metrics-api/target/checkstyle-result.xml> with 6263 unique warnings and 0 duplicates.
[CHECKSTYLE] Successfully parsed file <https://builds.apache.org/job/HBase-Trunk_matrix/jdk=JDK%201.8%20(latest),label=Hadoop/3882/artifact/hbase-metrics/target/checkstyle-result.xml> with 6272 unique warnings and 0 duplicates.
[CHECKSTYLE] Successfully parsed file <https://builds.apache.org/job/HBase-Trunk_matrix/jdk=JDK%201.8%20(latest),label=Hadoop/3882/artifact/hbase-prefix-tree/target/checkstyle-result.xml> with 6433 unique warnings and 0 duplicates.
[CHECKSTYLE] Successfully parsed file <https://builds.apache.org/job/HBase-Trunk_matrix/jdk=JDK%201.8%20(latest),label=Hadoop/3882/artifact/hbase-procedure/target/checkstyle-result.xml> with 6557 unique warnings and 0 duplicates.
[CHECKSTYLE] Successfully parsed file <https://builds.apache.org/job/HBase-Trunk_matrix/jdk=JDK%201.8%20(latest),label=Hadoop/3882/artifact/hbase-protocol-shaded/target/checkstyle-result.xml> with 6560 unique warnings and 0 duplicates.
[CHECKSTYLE] Successfully parsed file <https://builds.apache.org/job/HBase-Trunk_matrix/jdk=JDK%201.8%20(latest),label=Hadoop/3882/artifact/hbase-protocol/target/checkstyle-result.xml> with 6563 unique warnings and 0 duplicates.
[CHECKSTYLE] Successfully parsed file <https://builds.apache.org/job/HBase-Trunk_matrix/jdk=JDK%201.8%20(latest),label=Hadoop/3882/artifact/hbase-replication/target/checkstyle-result.xml> with 6639 unique warnings and 0 duplicates.
[CHECKSTYLE] Successfully parsed file <https://builds.apache.org/job/HBase-Trunk_matrix/jdk=JDK%201.8%20(latest),label=Hadoop/3882/artifact/hbase-resource-bundle/target/checkstyle-result.xml> with 6639 unique warnings and 0 duplicates.
[CHECKSTYLE] Successfully parsed file <https://builds.apache.org/job/HBase-Trunk_matrix/jdk=JDK%201.8%20(latest),label=Hadoop/3882/artifact/hbase-rest/target/checkstyle-result.xml> with 7248 unique warnings and 0 duplicates.
[CHECKSTYLE] Successfully parsed file <https://builds.apache.org/job/HBase-Trunk_matrix/jdk=JDK%201.8%20(latest),label=Hadoop/3882/artifact/hbase-rsgroup/target/checkstyle-result.xml> with 7284 unique warnings and 0 duplicates.
[CHECKSTYLE] Successfully parsed file <https://builds.apache.org/job/HBase-Trunk_matrix/jdk=JDK%201.8%20(latest),label=Hadoop/3882/artifact/hbase-server/target/checkstyle-result.xml> with 13430 unique warnings and 0 duplicates.
[CHECKSTYLE] Successfully parsed file <https://builds.apache.org/job/HBase-Trunk_matrix/jdk=JDK%201.8%20(latest),label=Hadoop/3882/artifact/hbase-shaded/hbase-shaded-check-invariants/target/checkstyle-result.xml> with 13430 unique warnings and 0 duplicates.
[CHECKSTYLE] Successfully parsed file <https://builds.apache.org/job/HBase-Trunk_matrix/jdk=JDK%201.8%20(latest),label=Hadoop/3882/artifact/hbase-shaded/hbase-shaded-client/target/checkstyle-result.xml> with 13430 unique warnings and 0 duplicates.
[CHECKSTYLE] Successfully parsed file <https://builds.apache.org/job/HBase-Trunk_matrix/jdk=JDK%201.8%20(latest),label=Hadoop/3882/artifact/hbase-shaded/hbase-shaded-mapreduce/target/checkstyle-result.xml> with 13430 unique warnings and 0 duplicates.
[CHECKSTYLE] Successfully parsed file <https://builds.apache.org/job/HBase-Trunk_matrix/jdk=JDK%201.8%20(latest),label=Hadoop/3882/artifact/hbase-shaded/target/checkstyle-result.xml> with 13430 unique warnings and 0 duplicates.
[CHECKSTYLE] Successfully parsed file <https://builds.apache.org/job/HBase-Trunk_matrix/jdk=JDK%201.8%20(latest),label=Hadoop/3882/artifact/hbase-shell/target/checkstyle-result.xml> with 13430 unique warnings and 0 duplicates.
[CHECKSTYLE] Successfully parsed file <https://builds.apache.org/job/HBase-Trunk_matrix/jdk=JDK%201.8%20(latest),label=Hadoop/3882/artifact/hbase-spark-it/target/checkstyle-result.xml> with 13430 unique warnings and 0 duplicates.
[CHECKSTYLE] Successfully parsed file <https://builds.apache.org/job/HBase-Trunk_matrix/jdk=JDK%201.8%20(latest),label=Hadoop/3882/artifact/hbase-spark/target/checkstyle-result.xml> with 13459 unique warnings and 0 duplicates.
[CHECKSTYLE] Successfully parsed file <https://builds.apache.org/job/HBase-Trunk_matrix/jdk=JDK%201.8%20(latest),label=Hadoop/3882/artifact/hbase-testing-util/target/checkstyle-result.xml> with 13459 unique warnings and 0 duplicates.
[CHECKSTYLE] Successfully parsed file <https://builds.apache.org/job/HBase-Trunk_matrix/jdk=JDK%201.8%20(latest),label=Hadoop/3882/artifact/hbase-thrift/target/checkstyle-result.xml> with 13594 unique warnings and 0 duplicates.
[CHECKSTYLE] Successfully parsed file <https://builds.apache.org/job/HBase-Trunk_matrix/jdk=JDK%201.8%20(latest),label=Hadoop/3882/artifact/target/checkstyle-result.xml> with 13594 unique warnings and 0 duplicates.
<Git Blamer> Using GitBlamer to create author and commit information for all warnings.
<Git Blamer> GIT_COMMIT=ffdc0e6851e7172bfd3a31a0d78a92fa712ece0e, workspace=<https://builds.apache.org/job/HBase-Trunk_matrix/jdk=JDK%201.8%20(latest),label=Hadoop/ws/>
> git rev-parse ffdc0e6851e7172bfd3a31a0d78a92fa712ece0e^{commit} # timeout=10
ERROR: Build step failed with exception
java.lang.OutOfMemoryError: GC overhead limit exceeded
at org.eclipse.jgit.internal.storage.file.PackFile.load(PackFile.java:878)
at org.eclipse.jgit.internal.storage.file.PackFile.get(PackFile.java:273)
at org.eclipse.jgit.internal.storage.file.ObjectDirectory.openPackedObject(ObjectDirectory.java:421)
at org.eclipse.jgit.internal.storage.file.ObjectDirectory.openPackedFromSelfOrAlternate(ObjectDirectory.java:390)
at org.eclipse.jgit.internal.storage.file.ObjectDirectory.openObject(ObjectDirectory.java:382)
at org.eclipse.jgit.internal.storage.file.WindowCursor.open(WindowCursor.java:154)
at org.eclipse.jgit.treewalk.CanonicalTreeParser.reset(CanonicalTreeParser.java:214)
at org.eclipse.jgit.treewalk.TreeWalk.reset(TreeWalk.java:645)
at org.eclipse.jgit.blame.BlameGenerator.find(BlameGenerator.java:954)
at org.eclipse.jgit.blame.BlameGenerator.processOne(BlameGenerator.java:603)
at org.eclipse.jgit.blame.BlameGenerator.next(BlameGenerator.java:496)
at org.eclipse.jgit.blame.BlameResult.computeAll(BlameResult.java:239)
at org.eclipse.jgit.blame.BlameGenerator.computeBlameResult(BlameGenerator.java:450)
at org.eclipse.jgit.api.BlameCommand.call(BlameCommand.java:230)
at hudson.plugins.analysis.util.GitBlamer$BlameCallback.invoke(GitBlamer.java:130)
at hudson.plugins.analysis.util.GitBlamer$BlameCallback.invoke(GitBlamer.java:104)
at org.jenkinsci.plugins.gitclient.AbstractGitAPIImpl.withRepository(AbstractGitAPIImpl.java:29)
at org.jenkinsci.plugins.gitclient.CliGitAPIImpl.withRepository(CliGitAPIImpl.java:71)
at hudson.plugins.analysis.util.GitBlamer.loadBlameResultsForFiles(GitBlamer.java:61)
at hudson.plugins.analysis.util.GitBlamer.blame(GitBlamer.java:54)
at hudson.plugins.analysis.util.AbstractBlamer$1.invoke(AbstractBlamer.java:62)
at hudson.plugins.analysis.util.AbstractBlamer$1.invoke(AbstractBlamer.java:59)
at hudson.FilePath$FileCallableWrapper.call(FilePath.java:2750)
at hudson.remoting.UserRequest.perform(UserRequest.java:181)
at hudson.remoting.UserRequest.perform(UserRequest.java:52)
at hudson.remoting.Request$2.run(Request.java:336)
at hudson.remoting.InterceptingExecutorService$1.call(InterceptingExecutorService.java:68)
at java.util.concurrent.FutureTask.run(FutureTask.java:266)
at java.util.concurrent.ThreadPoolExecutor.runWorker(ThreadPoolExecutor.java:1142)
at java.util.concurrent.ThreadPoolExecutor$Worker.run(ThreadPoolExecutor.java:617)
at java.lang.Thread.run(Thread.java:748)
Caused: org.eclipse.jgit.errors.LargeObjectException$OutOfMemory: Out of memory loading unknown object
at org.eclipse.jgit.internal.storage.file.PackFile.load(PackFile.java:881)
at org.eclipse.jgit.internal.storage.file.PackFile.get(PackFile.java:273)
at org.eclipse.jgit.internal.storage.file.ObjectDirectory.openPackedObject(ObjectDirectory.java:421)
at org.eclipse.jgit.internal.storage.file.ObjectDirectory.openPackedFromSelfOrAlternate(ObjectDirectory.java:390)
at org.eclipse.jgit.internal.storage.file.ObjectDirectory.openObject(ObjectDirectory.java:382)
at org.eclipse.jgit.internal.storage.file.WindowCursor.open(WindowCursor.java:154)
at org.eclipse.jgit.treewalk.CanonicalTreeParser.reset(CanonicalTreeParser.java:214)
at org.eclipse.jgit.treewalk.TreeWalk.reset(TreeWalk.java:645)
at org.eclipse.jgit.blame.BlameGenerator.find(BlameGenerator.java:954)
at org.eclipse.jgit.blame.BlameGenerator.processOne(BlameGenerator.java:603)
at org.eclipse.jgit.blame.BlameGenerator.next(BlameGenerator.java:496)
at org.eclipse.jgit.blame.BlameResult.computeAll(BlameResult.java:239)
at org.eclipse.jgit.blame.BlameGenerator.computeBlameResult(BlameGenerator.java:450)
at org.eclipse.jgit.api.BlameCommand.call(BlameCommand.java:230)
at hudson.plugins.analysis.util.GitBlamer$BlameCallback.invoke(GitBlamer.java:130)
at hudson.plugins.analysis.util.GitBlamer$BlameCallback.invoke(GitBlamer.java:104)
at org.jenkinsci.plugins.gitclient.AbstractGitAPIImpl.withRepository(AbstractGitAPIImpl.java:29)
at org.jenkinsci.plugins.gitclient.CliGitAPIImpl.withRepository(CliGitAPIImpl.java:71)
at hudson.plugins.analysis.util.GitBlamer.loadBlameResultsForFiles(GitBlamer.java:61)
at hudson.plugins.analysis.util.GitBlamer.blame(GitBlamer.java:54)
at hudson.plugins.analysis.util.AbstractBlamer$1.invoke(AbstractBlamer.java:62)
at hudson.plugins.analysis.util.AbstractBlamer$1.invoke(AbstractBlamer.java:59)
at hudson.FilePath$FileCallableWrapper.call(FilePath.java:2750)
at hudson.remoting.UserRequest.perform(UserRequest.java:181)
at hudson.remoting.UserRequest.perform(UserRequest.java:52)
at hudson.remoting.Request$2.run(Request.java:336)
at hudson.remoting.InterceptingExecutorService$1.call(InterceptingExecutorService.java:68)
at java.util.concurrent.FutureTask.run(FutureTask.java:266)
at java.util.concurrent.ThreadPoolExecutor.runWorker(ThreadPoolExecutor.java:1142)
at java.util.concurrent.ThreadPoolExecutor$Worker.run(ThreadPoolExecutor.java:617)
at java.lang.Thread.run(Thread.java:748)
at ......remote call to H0(Native Method)
at hudson.remoting.Channel.attachCallSiteStackTrace(Channel.java:1554)
at hudson.remoting.UserResponse.retrieve(UserRequest.java:281)
at hudson.remoting.Channel.call(Channel.java:839)
at hudson.FilePath.act(FilePath.java:987)
at hudson.FilePath.act(FilePath.java:976)
at hudson.plugins.analysis.util.AbstractBlamer.invokeBlamer(AbstractBlamer.java:59)
at hudson.plugins.analysis.util.AbstractBlamer.blame(AbstractBlamer.java:45)
at hudson.plugins.analysis.core.HealthAwarePublisher.blame(HealthAwarePublisher.java:109)
at hudson.plugins.checkstyle.CheckStylePublisher.perform(CheckStylePublisher.java:81)
at hudson.plugins.analysis.core.HealthAwarePublisher.perform(HealthAwarePublisher.java:69)
at hudson.plugins.analysis.core.HealthAwareRecorder.perform(HealthAwareRecorder.java:298)
at hudson.tasks.BuildStepCompatibilityLayer.perform(BuildStepCompatibilityLayer.java:81)
at hudson.tasks.BuildStepMonitor$1.perform(BuildStepMonitor.java:20)
at hudson.model.AbstractBuild$AbstractBuildExecution.perform(AbstractBuild.java:736)
at hudson.model.AbstractBuild$AbstractBuildExecution.performAllBuildSteps(AbstractBuild.java:682)
at hudson.model.Build$BuildExecution.post2(Build.java:186)
at hudson.model.AbstractBuild$AbstractBuildExecution.post(AbstractBuild.java:627)
at hudson.model.Run.execute(Run.java:1762)
at hudson.matrix.MatrixRun.run(MatrixRun.java:146)
at hudson.model.ResourceController.execute(ResourceController.java:97)
at hudson.model.Executor.run(Executor.java:419)
Build step 'Publish Checkstyle analysis results' marked build as failure
Build failed in Jenkins: HBase-Trunk_matrix » JDK 1.8 (latest),Hadoop #3881
Posted by Apache Jenkins Server <je...@builds.apache.org>.
See <https://builds.apache.org/job/HBase-Trunk_matrix/jdk=JDK%201.8%20(latest),label=Hadoop/3881/display/redirect?page=changes>
Changes:
[tedyu] HBASE-18998 processor.getRowsToLock() always assumes there is some row
[mdrob] HBASE-18505 Yetus only run root when all modules changed
------------------------------------------
[...truncated 1.26 MB...]
[INFO] Total time: 1.189s
[INFO] Finished at: Fri Oct 13 20:50:10 UTC 2017
[INFO] Final Memory: 20M/724M
[INFO] ------------------------------------------------------------------------
[INFO] Archetype project created in <https://builds.apache.org/job/HBase-Trunk_matrix/jdk=JDK%201.8%20(latest),label=Hadoop/ws/hbase-archetypes/hbase-client-project/target/build-archetype/target/generated-sources/archetype>
[INFO] ------------------------------------------------------------------------
[INFO] BUILD SUCCESS
[INFO] ------------------------------------------------------------------------
[INFO] Total time: 3.624s
[INFO] Finished at: Fri Oct 13 20:50:10 UTC 2017
[INFO] Final Memory: 21M/724M
[INFO] ------------------------------------------------------------------------
[INFO] Scanning for projects...
[INFO]
[INFO] ------------------------------------------------------------------------
[INFO] Building Apache HBase - Exemplar for hbase-shaded-client archetype 3.0.0-SNAPSHOT
[INFO] ------------------------------------------------------------------------
[INFO]
[INFO] >>> maven-archetype-plugin:2.4:create-from-project (default-cli) @ hbase-shaded-client-project >>>
[INFO]
[INFO] <<< maven-archetype-plugin:2.4:create-from-project (default-cli) @ hbase-shaded-client-project <<<
[INFO]
[INFO] --- maven-archetype-plugin:2.4:create-from-project (default-cli) @ hbase-shaded-client-project ---
[INFO] Setting default groupId: org.apache.hbase
[INFO] Setting default artifactId: hbase-shaded-client-project
[INFO] Setting default version: 3.0.0-SNAPSHOT
[INFO] Setting default package: org.apache.hbase.archetypes.exemplars.shaded_client
[INFO] Scanning for projects...
[INFO]
[INFO] ------------------------------------------------------------------------
[INFO] Building hbase-shaded-client-project-archetype 3.0.0-SNAPSHOT
[INFO] ------------------------------------------------------------------------
[INFO]
[INFO] --- maven-resources-plugin:3.0.1:resources (default-resources) @ hbase-shaded-client-project-archetype ---
[WARNING] Using platform encoding (ISO-8859-1 actually) to copy filtered resources, i.e. build is platform dependent!
[INFO] Copying 6 resources
[INFO]
[INFO] --- maven-resources-plugin:3.0.1:testResources (default-testResources) @ hbase-shaded-client-project-archetype ---
[WARNING] Using platform encoding (ISO-8859-1 actually) to copy filtered resources, i.e. build is platform dependent!
[INFO] Copying 2 resources
[INFO]
[INFO] --- maven-archetype-plugin:2.4:jar (default-jar) @ hbase-shaded-client-project-archetype ---
[INFO] Building archetype jar: <https://builds.apache.org/job/HBase-Trunk_matrix/jdk=JDK%201.8%20(latest),label=Hadoop/ws/hbase-archetypes/hbase-shaded-client-project/target/build-archetype/target/generated-sources/archetype/target/hbase-shaded-client-project-archetype-3.0.0-SNAPSHOT>
[INFO] ------------------------------------------------------------------------
[INFO] BUILD SUCCESS
[INFO] ------------------------------------------------------------------------
[INFO] Total time: 1.134s
[INFO] Finished at: Fri Oct 13 20:50:15 UTC 2017
[INFO] Final Memory: 20M/724M
[INFO] ------------------------------------------------------------------------
[INFO] Archetype project created in <https://builds.apache.org/job/HBase-Trunk_matrix/jdk=JDK%201.8%20(latest),label=Hadoop/ws/hbase-archetypes/hbase-shaded-client-project/target/build-archetype/target/generated-sources/archetype>
[INFO] ------------------------------------------------------------------------
[INFO] BUILD SUCCESS
[INFO] ------------------------------------------------------------------------
[INFO] Total time: 3.492s
[INFO] Finished at: Fri Oct 13 20:50:15 UTC 2017
[INFO] Final Memory: 21M/724M
[INFO] ------------------------------------------------------------------------
[INFO]
[INFO] --- maven-resources-plugin:2.7:copy-resources (hbase-client-ARCHETYPE__copy-pom-to-temp-for-xslt-processing) @ hbase-archetype-builder ---
[INFO] Using 'UTF-8' encoding to copy filtered resources.
[INFO] Copying 1 resource
[INFO]
[INFO] --- maven-resources-plugin:2.7:copy-resources (hbase-shaded-client-ARCHETYPE__copy-pom-to-temp-for-xslt-processing) @ hbase-archetype-builder ---
[INFO] Using 'UTF-8' encoding to copy filtered resources.
[INFO] Copying 1 resource
[INFO]
[INFO] --- xml-maven-plugin:1.0.1:transform (modify-archetype-pom-files-via-xslt) @ hbase-archetype-builder ---
[INFO] Transforming file: <https://builds.apache.org/job/HBase-Trunk_matrix/jdk=JDK%201.8%20(latest),label=Hadoop/3881/artifact/hbase-archetypes/hbase-archetype-builder/../hbase-client-project/target/temp-arch/pom.xml>
[INFO] Transformed 1 file(s).
[INFO] Transforming file: <https://builds.apache.org/job/HBase-Trunk_matrix/jdk=JDK%201.8%20(latest),label=Hadoop/3881/artifact/hbase-archetypes/hbase-archetype-builder/../hbase-shaded-client-project/target/temp-arch/pom.xml>
[INFO] Transformed 1 file(s).
[INFO]
[INFO] --- maven-install-plugin:2.5.2:install (default-install) @ hbase-archetype-builder ---
[INFO] Installing <https://builds.apache.org/job/HBase-Trunk_matrix/jdk=JDK%201.8%20(latest),label=Hadoop/3881/artifact/hbase-archetypes/hbase-archetype-builder/pom.xml> to /home/jenkins/.m2/repository/org/apache/hbase/hbase-archetype-builder/3.0.0-SNAPSHOT/hbase-archetype-builder-3.0.0-SNAPSHOT.pom
[INFO]
[INFO] --- exec-maven-plugin:1.6.0:exec (run-installArchetypes-script) @ hbase-archetype-builder ---
[INFO] Scanning for projects...
[INFO]
[INFO] ------------------------------------------------------------------------
[INFO] Building hbase-client-project-archetype 3.0.0-SNAPSHOT
[INFO] ------------------------------------------------------------------------
[INFO]
[INFO] --- maven-resources-plugin:3.0.1:resources (default-resources) @ hbase-client-project-archetype ---
[INFO] Using 'UTF-8' encoding to copy filtered resources.
[INFO] Copying 6 resources
[INFO]
[INFO] --- maven-resources-plugin:3.0.1:testResources (default-testResources) @ hbase-client-project-archetype ---
[INFO] Using 'UTF-8' encoding to copy filtered resources.
[INFO] Copying 2 resources
[INFO]
[INFO] --- maven-archetype-plugin:2.4:jar (default-jar) @ hbase-client-project-archetype ---
[INFO] Building archetype jar: <https://builds.apache.org/job/HBase-Trunk_matrix/jdk=JDK%201.8%20(latest),label=Hadoop/ws/hbase-archetypes/hbase-client-project/target/build-archetype/target/generated-sources/archetype/target/hbase-client-project-archetype-3.0.0-SNAPSHOT>
[INFO]
[INFO] --- maven-archetype-plugin:2.4:integration-test (default-integration-test) @ hbase-client-project-archetype ---
[INFO] Processing Archetype IT project: basic
[INFO] ----------------------------------------------------------------------------
[INFO] Using following parameters for creating project from Archetype: hbase-client-project-archetype:3.0.0-SNAPSHOT
[INFO] ----------------------------------------------------------------------------
[INFO] Parameter: groupId, Value: archetype.it
[INFO] Parameter: artifactId, Value: basic
[INFO] Parameter: version, Value: 0.1-SNAPSHOT
[INFO] Parameter: package, Value: it.pkg
[INFO] Parameter: packageInPathFormat, Value: it/pkg
[INFO] Parameter: version, Value: 0.1-SNAPSHOT
[INFO] Parameter: package, Value: it.pkg
[INFO] Parameter: groupId, Value: archetype.it
[INFO] Parameter: artifactId, Value: basic
[INFO] project created from Archetype in dir: <https://builds.apache.org/job/HBase-Trunk_matrix/jdk=JDK%201.8%20(latest),label=Hadoop/ws/hbase-archetypes/hbase-client-project/target/build-archetype/target/generated-sources/archetype/target/test-classes/projects/basic/project/basic>
[INFO]
[INFO] --- maven-install-plugin:2.5.2:install (default-install) @ hbase-client-project-archetype ---
[INFO] Installing <https://builds.apache.org/job/HBase-Trunk_matrix/jdk=JDK%201.8%20(latest),label=Hadoop/ws/hbase-archetypes/hbase-client-project/target/build-archetype/target/generated-sources/archetype/target/hbase-client-project-archetype-3.0.0-SNAPSHOT.jar> to /home/jenkins/.m2/repository/org/apache/hbase/hbase-client-project-archetype/3.0.0-SNAPSHOT/hbase-client-project-archetype-3.0.0-SNAPSHOT.jar
[INFO] Installing <https://builds.apache.org/job/HBase-Trunk_matrix/jdk=JDK%201.8%20(latest),label=Hadoop/3881/artifact/hbase-archetypes/hbase-client-project/target/build-archetype/target/generated-sources/archetype/pom.xml> to /home/jenkins/.m2/repository/org/apache/hbase/hbase-client-project-archetype/3.0.0-SNAPSHOT/hbase-client-project-archetype-3.0.0-SNAPSHOT.pom
[INFO]
[INFO] --- maven-archetype-plugin:2.4:update-local-catalog (default-update-local-catalog) @ hbase-client-project-archetype ---
[INFO] ------------------------------------------------------------------------
[INFO] BUILD SUCCESS
[INFO] ------------------------------------------------------------------------
[INFO] Total time: 1.306s
[INFO] Finished at: Fri Oct 13 20:50:17 UTC 2017
[INFO] Final Memory: 21M/724M
[INFO] ------------------------------------------------------------------------
[INFO] Scanning for projects...
[INFO]
[INFO] ------------------------------------------------------------------------
[INFO] Building hbase-shaded-client-project-archetype 3.0.0-SNAPSHOT
[INFO] ------------------------------------------------------------------------
[INFO]
[INFO] --- maven-resources-plugin:3.0.1:resources (default-resources) @ hbase-shaded-client-project-archetype ---
[INFO] Using 'UTF-8' encoding to copy filtered resources.
[INFO] Copying 6 resources
[INFO]
[INFO] --- maven-resources-plugin:3.0.1:testResources (default-testResources) @ hbase-shaded-client-project-archetype ---
[INFO] Using 'UTF-8' encoding to copy filtered resources.
[INFO] Copying 2 resources
[INFO]
[INFO] --- maven-archetype-plugin:2.4:jar (default-jar) @ hbase-shaded-client-project-archetype ---
[INFO] Building archetype jar: <https://builds.apache.org/job/HBase-Trunk_matrix/jdk=JDK%201.8%20(latest),label=Hadoop/ws/hbase-archetypes/hbase-shaded-client-project/target/build-archetype/target/generated-sources/archetype/target/hbase-shaded-client-project-archetype-3.0.0-SNAPSHOT>
[INFO]
[INFO] --- maven-archetype-plugin:2.4:integration-test (default-integration-test) @ hbase-shaded-client-project-archetype ---
[INFO] Processing Archetype IT project: basic
[INFO] ----------------------------------------------------------------------------
[INFO] Using following parameters for creating project from Archetype: hbase-shaded-client-project-archetype:3.0.0-SNAPSHOT
[INFO] ----------------------------------------------------------------------------
[INFO] Parameter: groupId, Value: archetype.it
[INFO] Parameter: artifactId, Value: basic
[INFO] Parameter: version, Value: 0.1-SNAPSHOT
[INFO] Parameter: package, Value: it.pkg
[INFO] Parameter: packageInPathFormat, Value: it/pkg
[INFO] Parameter: version, Value: 0.1-SNAPSHOT
[INFO] Parameter: package, Value: it.pkg
[INFO] Parameter: groupId, Value: archetype.it
[INFO] Parameter: artifactId, Value: basic
[INFO] project created from Archetype in dir: <https://builds.apache.org/job/HBase-Trunk_matrix/jdk=JDK%201.8%20(latest),label=Hadoop/ws/hbase-archetypes/hbase-shaded-client-project/target/build-archetype/target/generated-sources/archetype/target/test-classes/projects/basic/project/basic>
[INFO]
[INFO] --- maven-install-plugin:2.5.2:install (default-install) @ hbase-shaded-client-project-archetype ---
[INFO] Installing <https://builds.apache.org/job/HBase-Trunk_matrix/jdk=JDK%201.8%20(latest),label=Hadoop/ws/hbase-archetypes/hbase-shaded-client-project/target/build-archetype/target/generated-sources/archetype/target/hbase-shaded-client-project-archetype-3.0.0-SNAPSHOT.jar> to /home/jenkins/.m2/repository/org/apache/hbase/hbase-shaded-client-project-archetype/3.0.0-SNAPSHOT/hbase-shaded-client-project-archetype-3.0.0-SNAPSHOT.jar
[INFO] Installing <https://builds.apache.org/job/HBase-Trunk_matrix/jdk=JDK%201.8%20(latest),label=Hadoop/3881/artifact/hbase-archetypes/hbase-shaded-client-project/target/build-archetype/target/generated-sources/archetype/pom.xml> to /home/jenkins/.m2/repository/org/apache/hbase/hbase-shaded-client-project-archetype/3.0.0-SNAPSHOT/hbase-shaded-client-project-archetype-3.0.0-SNAPSHOT.pom
[INFO]
[INFO] --- maven-archetype-plugin:2.4:update-local-catalog (default-update-local-catalog) @ hbase-shaded-client-project-archetype ---
[INFO] ------------------------------------------------------------------------
[INFO] BUILD SUCCESS
[INFO] ------------------------------------------------------------------------
[INFO] Total time: 1.348s
[INFO] Finished at: Fri Oct 13 20:50:20 UTC 2017
[INFO] Final Memory: 21M/724M
[INFO] ------------------------------------------------------------------------
[INFO] ------------------------------------------------------------------------
[INFO] Reactor Summary:
[INFO]
[INFO] Apache HBase ...................................... SUCCESS [2.496s]
[INFO] Apache HBase - Checkstyle ......................... SUCCESS [0.545s]
[INFO] Apache HBase - Build Support ...................... SUCCESS [0.076s]
[INFO] Apache HBase - Error Prone Rules .................. SUCCESS [0.243s]
[INFO] Apache HBase - Annotations ........................ SUCCESS [0.184s]
[INFO] Apache HBase - Build Configuration ................ SUCCESS [0.102s]
[INFO] Apache HBase - Shaded Protocol .................... SUCCESS [26.049s]
[INFO] Apache HBase - Common ............................. SUCCESS [2:12.190s]
[INFO] Apache HBase - Metrics API ........................ SUCCESS [1.718s]
[INFO] Apache HBase - Hadoop Compatibility ............... SUCCESS [13.402s]
[INFO] Apache HBase - Metrics Implementation ............. SUCCESS [7.087s]
[INFO] Apache HBase - Hadoop Two Compatibility ........... SUCCESS [16.250s]
[INFO] Apache HBase - Protocol ........................... SUCCESS [7.787s]
[INFO] Apache HBase - Client ............................. SUCCESS [2:18.030s]
[INFO] Apache HBase - Replication ........................ SUCCESS [1.135s]
[INFO] Apache HBase - Prefix Tree ........................ SUCCESS [15.691s]
[INFO] Apache HBase - Procedure .......................... SUCCESS [2:50.263s]
[INFO] Apache HBase - Resource Bundle .................... SUCCESS [0.183s]
[INFO] Apache HBase - Server ............................. FAILURE [2:07:16.453s]
[INFO] Apache HBase - MapReduce .......................... SKIPPED
[INFO] Apache HBase - Testing Util ....................... SKIPPED
[INFO] Apache HBase - Thrift ............................. SKIPPED
[INFO] Apache HBase - RSGroup ............................ SKIPPED
[INFO] Apache HBase - Shell .............................. SKIPPED
[INFO] Apache HBase - Coprocessor Endpoint ............... SKIPPED
[INFO] Apache HBase - Backup ............................. SKIPPED
[INFO] Apache HBase - Integration Tests .................. SKIPPED
[INFO] Apache HBase - Examples ........................... SKIPPED
[INFO] Apache HBase - Rest ............................... SKIPPED
[INFO] Apache HBase - External Block Cache ............... SKIPPED
[INFO] Apache HBase - Spark .............................. SKIPPED
[INFO] Apache HBase - Spark Integration Tests ............ SKIPPED
[INFO] Apache HBase - Assembly ........................... SKIPPED
[INFO] Apache HBase - Shaded ............................. SUCCESS [0.299s]
[INFO] Apache HBase - Shaded - Client .................... SUCCESS [1.248s]
[INFO] Apache HBase - Shaded - MapReduce ................. SKIPPED
[INFO] Apache HBase Shaded Packaging Invariants .......... SKIPPED
[INFO] Apache HBase - Archetypes ......................... SUCCESS [0.065s]
[INFO] Apache HBase - Exemplar for hbase-client archetype SKIPPED
[INFO] Apache HBase - Exemplar for hbase-shaded-client archetype SKIPPED
[INFO] Apache HBase - Archetype builder .................. SUCCESS [16.152s]
[INFO] ------------------------------------------------------------------------
[INFO] BUILD FAILURE
[INFO] ------------------------------------------------------------------------
[INFO] Total time: 2:16:29.176s
[INFO] Finished at: Fri Oct 13 20:50:20 UTC 2017
[INFO] Final Memory: 96M/3268M
[INFO] ------------------------------------------------------------------------
[ERROR] Failed to execute goal org.apache.maven.plugins:maven-surefire-plugin:2.19.1:test (secondPartTestsExecution) on project hbase-server: There are test failures.
[ERROR]
[ERROR] Please refer to <https://builds.apache.org/job/HBase-Trunk_matrix/jdk=JDK%201.8%20(latest),label=Hadoop/ws/hbase-server/target/surefire-reports> for the individual test results.
[ERROR] -> [Help 1]
[ERROR]
[ERROR] To see the full stack trace of the errors, re-run Maven with the -e switch.
[ERROR] Re-run Maven using the -X switch to enable full debug logging.
[ERROR]
[ERROR] For more information about the errors and possible solutions, please read the following articles:
[ERROR] [Help 1] http://cwiki.apache.org/confluence/display/MAVEN/MojoFailureException
[ERROR]
[ERROR] After correcting the problems, you can resume the build with the command
[ERROR] mvn <goals> -rf :hbase-server
Build step 'Invoke top-level Maven targets' marked build as failure
Performing Post build task...
Match found for :.* : True
Logical operation result is TRUE
Running script : # Run zombie detector script
./dev-support/zombie-detector.sh --jenkins ${BUILD_ID}
[a3159d73] $ /bin/bash -xe /tmp/jenkins496765396782177090.sh
+ ./dev-support/zombie-detector.sh --jenkins 3881
Fri Oct 13 20:50:23 UTC 2017 We're ok: there is no zombie test
{color:green}+1 zombies{color}. No zombie tests found running at the end of the build.
POST BUILD TASK : SUCCESS
END OF POST BUILD TASK : 0
Archiving artifacts
Recording test results
[FINDBUGS] Skipping publisher since build result is FAILURE
[CHECKSTYLE] Skipping publisher since build result is FAILURE
Build failed in Jenkins: HBase-Trunk_matrix » JDK 1.8 (latest),Hadoop #3880
Posted by Apache Jenkins Server <je...@builds.apache.org>.
See <https://builds.apache.org/job/HBase-Trunk_matrix/jdk=JDK%201.8%20(latest),label=Hadoop/3880/display/redirect>
------------------------------------------
[...truncated 581.10 KB...]
[INFO] ------------------------------------------------------------------------
[INFO] Building Apache HBase - Build Configuration 3.0.0-SNAPSHOT
[INFO] ------------------------------------------------------------------------
[INFO]
[INFO] --- build-helper-maven-plugin:3.0.0:bsh-property (negate-license-bundles-property) @ hbase-build-configuration ---
[INFO]
[INFO] --- maven-enforcer-plugin:3.0.0-M1:enforce (min-maven-min-java-banned-xerces) @ hbase-build-configuration ---
[INFO]
[INFO] --- maven-enforcer-plugin:3.0.0-M1:enforce (banned-jsr305) @ hbase-build-configuration ---
[INFO]
[INFO] --- maven-enforcer-plugin:3.0.0-M1:enforce (banned-scala) @ hbase-build-configuration ---
[INFO]
[INFO] --- maven-enforcer-plugin:3.0.0-M1:enforce (banned-hbase-spark) @ hbase-build-configuration ---
[INFO]
[INFO] --- buildnumber-maven-plugin:1.4:create-timestamp (default) @ hbase-build-configuration ---
[INFO]
[INFO] --- maven-remote-resources-plugin:1.5:process (process-resource-bundles) @ hbase-build-configuration ---
[INFO]
[INFO] --- maven-enforcer-plugin:3.0.0-M1:enforce (check-aggregate-license) @ hbase-build-configuration ---
[INFO] Skipping Rule Enforcement.
[INFO]
[INFO] --- maven-checkstyle-plugin:2.17:checkstyle (default-cli) @ hbase-build-configuration ---
[INFO]
[INFO] ------------------------------------------------------------------------
[INFO] Building Apache HBase - Shaded Protocol 3.0.0-SNAPSHOT
[INFO] ------------------------------------------------------------------------
[INFO]
[INFO] --- build-helper-maven-plugin:3.0.0:bsh-property (negate-license-bundles-property) @ hbase-protocol-shaded ---
[INFO]
[INFO] --- maven-enforcer-plugin:3.0.0-M1:enforce (min-maven-min-java-banned-xerces) @ hbase-protocol-shaded ---
[INFO]
[INFO] --- maven-enforcer-plugin:3.0.0-M1:enforce (banned-jsr305) @ hbase-protocol-shaded ---
[INFO]
[INFO] --- maven-enforcer-plugin:3.0.0-M1:enforce (banned-scala) @ hbase-protocol-shaded ---
[INFO]
[INFO] --- maven-enforcer-plugin:3.0.0-M1:enforce (banned-hbase-spark) @ hbase-protocol-shaded ---
[INFO]
[INFO] --- buildnumber-maven-plugin:1.4:create-timestamp (default) @ hbase-protocol-shaded ---
[INFO]
[INFO] --- protobuf-maven-plugin:0.5.0:compile (compile-protoc) @ hbase-protocol-shaded ---
[INFO] Skipping compilation because target directory newer than sources.
[INFO]
[INFO] --- replacer:1.5.3:replace (default) @ hbase-protocol-shaded ---
[INFO] Replacement run on 32 files.
[INFO]
[INFO] --- maven-remote-resources-plugin:1.5:process (process-resource-bundles) @ hbase-protocol-shaded ---
[INFO]
[INFO] --- maven-resources-plugin:2.7:resources (default-resources) @ hbase-protocol-shaded ---
[INFO] Using 'UTF-8' encoding to copy filtered resources.
[INFO] skip non existing resourceDirectory <https://builds.apache.org/job/HBase-Trunk_matrix/jdk=JDK%201.8%20(latest),label=Hadoop/ws/hbase-protocol-shaded/src/main/resources>
[INFO] Copying 3 resources
[INFO]
[INFO] --- maven-enforcer-plugin:3.0.0-M1:enforce (check-aggregate-license) @ hbase-protocol-shaded ---
[INFO] Skipping Rule Enforcement.
[INFO]
[INFO] --- maven-compiler-plugin:3.6.1:compile (default-compile) @ hbase-protocol-shaded ---
[INFO] Compiling 32 source files to <https://builds.apache.org/job/HBase-Trunk_matrix/jdk=JDK%201.8%20(latest),label=Hadoop/ws/hbase-protocol-shaded/target/classes>
[INFO] <https://builds.apache.org/job/HBase-Trunk_matrix/jdk=JDK%201.8%20(latest),label=Hadoop/ws/hbase-protocol-shaded/target/generated-sources/protobuf/java/org/apache/hadoop/hbase/shaded/protobuf/generated/SnapshotProtos.java>: Some input files use or override a deprecated API.
[INFO] <https://builds.apache.org/job/HBase-Trunk_matrix/jdk=JDK%201.8%20(latest),label=Hadoop/ws/hbase-protocol-shaded/target/generated-sources/protobuf/java/org/apache/hadoop/hbase/shaded/protobuf/generated/SnapshotProtos.java>: Recompile with -Xlint:deprecation for details.
[INFO]
[INFO] --- maven-resources-plugin:2.7:testResources (default-testResources) @ hbase-protocol-shaded ---
[INFO] Using 'UTF-8' encoding to copy filtered resources.
[INFO] skip non existing resourceDirectory <https://builds.apache.org/job/HBase-Trunk_matrix/jdk=JDK%201.8%20(latest),label=Hadoop/ws/hbase-protocol-shaded/src/test/resources>
[INFO] Copying 3 resources
[INFO]
[INFO] --- maven-compiler-plugin:3.6.1:testCompile (default-testCompile) @ hbase-protocol-shaded ---
[INFO] No sources to compile
[INFO]
[INFO] --- maven-surefire-plugin:2.19.1:test (default-test) @ hbase-protocol-shaded ---
[INFO] Tests are skipped.
[INFO]
[INFO] --- maven-surefire-plugin:2.19.1:test (secondPartTestsExecution) @ hbase-protocol-shaded ---
[INFO] Tests are skipped.
[INFO]
[INFO] --- maven-source-plugin:3.0.0:jar-no-fork (attach-sources) @ hbase-protocol-shaded ---
[INFO] Building jar: <https://builds.apache.org/job/HBase-Trunk_matrix/jdk=JDK%201.8%20(latest),label=Hadoop/ws/hbase-protocol-shaded/target/hbase-protocol-shaded-3.0.0-SNAPSHOT-sources.jar>
[INFO]
[INFO] --- maven-jar-plugin:3.0.0:test-jar (default) @ hbase-protocol-shaded ---
[INFO] Building jar: <https://builds.apache.org/job/HBase-Trunk_matrix/jdk=JDK%201.8%20(latest),label=Hadoop/ws/hbase-protocol-shaded/target/hbase-protocol-shaded-3.0.0-SNAPSHOT-tests.jar>
[INFO]
[INFO] --- maven-jar-plugin:3.0.0:jar (default-jar) @ hbase-protocol-shaded ---
[INFO] Building jar: <https://builds.apache.org/job/HBase-Trunk_matrix/jdk=JDK%201.8%20(latest),label=Hadoop/ws/hbase-protocol-shaded/target/hbase-protocol-shaded-3.0.0-SNAPSHOT.jar>
[INFO]
[INFO] --- maven-shade-plugin:3.0.0:shade (default) @ hbase-protocol-shaded ---
[INFO] Excluding org.apache.hbase.thirdparty:hbase-shaded-protobuf:jar:1.0.1 from the shaded jar.
[INFO] Excluding org.apache.yetus:audience-annotations:jar:0.5.0 from the shaded jar.
[INFO] Minimizing jar org.apache.hbase:hbase-protocol-shaded:jar:3.0.0-SNAPSHOT
[INFO] Minimized 2033 -> 2033 (100%)
[INFO] Replacing original artifact with shaded artifact.
[INFO] Replacing <https://builds.apache.org/job/HBase-Trunk_matrix/jdk=JDK%201.8%20(latest),label=Hadoop/ws/hbase-protocol-shaded/target/hbase-protocol-shaded-3.0.0-SNAPSHOT.jar> with <https://builds.apache.org/job/HBase-Trunk_matrix/jdk=JDK%201.8%20(latest),label=Hadoop/ws/hbase-protocol-shaded/target/hbase-protocol-shaded-3.0.0-SNAPSHOT-shaded.jar>
[INFO]
[INFO] --- maven-checkstyle-plugin:2.17:checkstyle (default-cli) @ hbase-protocol-shaded ---
[INFO] There are 3 errors reported by Checkstyle 6.18 with hbase/checkstyle.xml ruleset.
[WARNING] Unable to locate Source XRef to link to - DISABLED
[INFO]
[INFO] ------------------------------------------------------------------------
[INFO] Building Apache HBase - Common 3.0.0-SNAPSHOT
[INFO] ------------------------------------------------------------------------
[INFO]
[INFO] --- build-helper-maven-plugin:3.0.0:bsh-property (negate-license-bundles-property) @ hbase-common ---
[INFO]
[INFO] --- maven-enforcer-plugin:3.0.0-M1:enforce (min-maven-min-java-banned-xerces) @ hbase-common ---
[INFO]
[INFO] --- maven-enforcer-plugin:3.0.0-M1:enforce (banned-jsr305) @ hbase-common ---
[INFO]
[INFO] --- maven-enforcer-plugin:3.0.0-M1:enforce (banned-scala) @ hbase-common ---
[INFO]
[INFO] --- maven-enforcer-plugin:3.0.0-M1:enforce (banned-hbase-spark) @ hbase-common ---
[INFO]
[INFO] --- buildnumber-maven-plugin:1.4:create-timestamp (default) @ hbase-common ---
[INFO]
[INFO] --- build-helper-maven-plugin:3.0.0:add-source (versionInfo-source) @ hbase-common ---
[INFO] Source directory: <https://builds.apache.org/job/HBase-Trunk_matrix/jdk=JDK%201.8%20(latest),label=Hadoop/ws/hbase-common/target/generated-sources/java> added.
[INFO]
[INFO] --- maven-antrun-plugin:1.8:run (generate) @ hbase-common ---
[INFO] Executing tasks
main:
[exec] ~/jenkins-slave/workspace/HBase-Trunk_matrix/a3159d73/hbase-common ~/jenkins-slave/workspace/HBase-Trunk_matrix/a3159d73/hbase-common
[exec] ~/jenkins-slave/workspace/HBase-Trunk_matrix/a3159d73/hbase-common
[INFO] Executed tasks
[INFO]
[INFO] --- maven-remote-resources-plugin:1.5:process (process-resource-bundles) @ hbase-common ---
[INFO]
[INFO] --- maven-resources-plugin:2.7:resources (default-resources) @ hbase-common ---
[INFO] Using 'UTF-8' encoding to copy filtered resources.
[INFO] Copying 1 resource
[INFO] Copying 3 resources
[INFO]
[INFO] --- maven-enforcer-plugin:3.0.0-M1:enforce (check-aggregate-license) @ hbase-common ---
[INFO] Skipping Rule Enforcement.
[INFO]
[INFO] --- maven-antrun-plugin:1.8:run (default) @ hbase-common ---
[INFO] Executing tasks
main:
[INFO] Executed tasks
[INFO]
[INFO] --- maven-compiler-plugin:3.6.1:compile (default-compile) @ hbase-common ---
[INFO] Compiling 2 source files to <https://builds.apache.org/job/HBase-Trunk_matrix/jdk=JDK%201.8%20(latest),label=Hadoop/ws/hbase-common/target/classes>
[INFO]
[INFO] --- maven-dependency-plugin:3.0.1:build-classpath (create-mrapp-generated-classpath) @ hbase-common ---
[INFO] Skipped writing classpath file '<https://builds.apache.org/job/HBase-Trunk_matrix/jdk=JDK%201.8%20(latest),label=Hadoop/ws/hbase-common/target/test-classes/mrapp-generated-classpath'.> No changes found.
[INFO]
[INFO] --- maven-resources-plugin:2.7:testResources (default-testResources) @ hbase-common ---
[INFO] Using 'UTF-8' encoding to copy filtered resources.
[INFO] Copying 1 resource to META-INF/
[INFO] Copying 3 resources
[INFO]
[INFO] --- maven-compiler-plugin:3.6.1:testCompile (default-testCompile) @ hbase-common ---
[INFO] Nothing to compile - all classes are up to date
[INFO]
[INFO] --- maven-surefire-plugin:2.19.1:test (default-test) @ hbase-common ---
[INFO] Tests are skipped.
[INFO]
[INFO] --- maven-surefire-plugin:2.19.1:test (secondPartTestsExecution) @ hbase-common ---
[INFO] Tests are skipped.
[INFO]
[INFO] --- maven-source-plugin:3.0.0:jar-no-fork (attach-sources) @ hbase-common ---
[INFO] Building jar: <https://builds.apache.org/job/HBase-Trunk_matrix/jdk=JDK%201.8%20(latest),label=Hadoop/ws/hbase-common/target/hbase-common-3.0.0-SNAPSHOT-sources.jar>
[INFO]
[INFO] --- maven-jar-plugin:3.0.0:test-jar (default) @ hbase-common ---
[INFO] Building jar: <https://builds.apache.org/job/HBase-Trunk_matrix/jdk=JDK%201.8%20(latest),label=Hadoop/ws/hbase-common/target/hbase-common-3.0.0-SNAPSHOT-tests.jar>
[INFO]
[INFO] --- maven-jar-plugin:3.0.0:jar (default-jar) @ hbase-common ---
[INFO] Building jar: <https://builds.apache.org/job/HBase-Trunk_matrix/jdk=JDK%201.8%20(latest),label=Hadoop/ws/hbase-common/target/hbase-common-3.0.0-SNAPSHOT.jar>
[INFO]
[INFO] --- maven-checkstyle-plugin:2.17:checkstyle (default-cli) @ hbase-common ---
[INFO] ------------------------------------------------------------------------
[INFO] Reactor Summary:
[INFO]
[INFO] Apache HBase ...................................... SUCCESS [4.352s]
[INFO] Apache HBase - Checkstyle ......................... SUCCESS [1.129s]
[INFO] Apache HBase - Build Support ...................... SUCCESS [0.381s]
[INFO] Apache HBase - Error Prone Rules .................. SUCCESS [0.675s]
[INFO] Apache HBase - Annotations ........................ SUCCESS [0.481s]
[INFO] Apache HBase - Build Configuration ................ SUCCESS [0.340s]
[INFO] Apache HBase - Shaded Protocol .................... SUCCESS [3:47.158s]
[INFO] Apache HBase - Common ............................. FAILURE [2.404s]
[INFO] Apache HBase - Metrics API ........................ SKIPPED
[INFO] Apache HBase - Hadoop Compatibility ............... SKIPPED
[INFO] Apache HBase - Metrics Implementation ............. SKIPPED
[INFO] Apache HBase - Hadoop Two Compatibility ........... SKIPPED
[INFO] Apache HBase - Protocol ........................... SKIPPED
[INFO] Apache HBase - Client ............................. SKIPPED
[INFO] Apache HBase - Replication ........................ SKIPPED
[INFO] Apache HBase - Prefix Tree ........................ SKIPPED
[INFO] Apache HBase - Procedure .......................... SKIPPED
[INFO] Apache HBase - Resource Bundle .................... SKIPPED
[INFO] Apache HBase - Server ............................. SKIPPED
[INFO] Apache HBase - MapReduce .......................... SKIPPED
[INFO] Apache HBase - Testing Util ....................... SKIPPED
[INFO] Apache HBase - Thrift ............................. SKIPPED
[INFO] Apache HBase - RSGroup ............................ SKIPPED
[INFO] Apache HBase - Shell .............................. SKIPPED
[INFO] Apache HBase - Coprocessor Endpoint ............... SKIPPED
[INFO] Apache HBase - Backup ............................. SKIPPED
[INFO] Apache HBase - Integration Tests .................. SKIPPED
[INFO] Apache HBase - Examples ........................... SKIPPED
[INFO] Apache HBase - Rest ............................... SKIPPED
[INFO] Apache HBase - External Block Cache ............... SKIPPED
[INFO] Apache HBase - Spark .............................. SKIPPED
[INFO] Apache HBase - Spark Integration Tests ............ SKIPPED
[INFO] Apache HBase - Assembly ........................... SKIPPED
[INFO] Apache HBase - Shaded ............................. SKIPPED
[INFO] Apache HBase - Shaded - Client .................... SKIPPED
[INFO] Apache HBase - Shaded - MapReduce ................. SKIPPED
[INFO] Apache HBase Shaded Packaging Invariants .......... SKIPPED
[INFO] Apache HBase - Archetypes ......................... SKIPPED
[INFO] Apache HBase - Exemplar for hbase-client archetype SKIPPED
[INFO] Apache HBase - Exemplar for hbase-shaded-client archetype SKIPPED
[INFO] Apache HBase - Archetype builder .................. SKIPPED
[INFO] ------------------------------------------------------------------------
[INFO] BUILD FAILURE
[INFO] ------------------------------------------------------------------------
[INFO] Total time: 3:58.732s
[INFO] Finished at: Fri Oct 13 13:44:59 UTC 2017
[INFO] Final Memory: 136M/4581M
[INFO] ------------------------------------------------------------------------
[ERROR] Failed to execute goal org.apache.maven.plugins:maven-checkstyle-plugin:2.17:checkstyle (default-cli) on project hbase-common: An error has occurred in Checkstyle report generation. Failed during checkstyle execution: Unable to process suppressions file location: hbase/checkstyle-suppressions.xml: Cannot create file-based resource:invalid block type -> [Help 1]
[ERROR]
[ERROR] To see the full stack trace of the errors, re-run Maven with the -e switch.
[ERROR] Re-run Maven using the -X switch to enable full debug logging.
[ERROR]
[ERROR] For more information about the errors and possible solutions, please read the following articles:
[ERROR] [Help 1] http://cwiki.apache.org/confluence/display/MAVEN/MojoExecutionException
[ERROR]
[ERROR] After correcting the problems, you can resume the build with the command
[ERROR] mvn <goals> -rf :hbase-common
Build step 'Invoke top-level Maven targets' marked build as failure
Performing Post build task...
Match found for :.* : True
Logical operation result is TRUE
Running script : # Run zombie detector script
./dev-support/zombie-detector.sh --jenkins ${BUILD_ID}
[a3159d73] $ /bin/bash -xe /tmp/jenkins4086126172296837522.sh
+ ./dev-support/zombie-detector.sh --jenkins 3880
Fri Oct 13 13:45:15 UTC 2017 We're ok: there is no zombie test
{color:green}+1 zombies{color}. No zombie tests found running at the end of the build.
POST BUILD TASK : SUCCESS
END OF POST BUILD TASK : 0
Archiving artifacts
[Fast Archiver] Compressed 4.78 MB of artifacts by 49.1% relative to #3869
Recording test results
ERROR: Step ?Publish JUnit test result report? failed: No test report files were found. Configuration error?
[FINDBUGS] Skipping publisher since build result is FAILURE
[CHECKSTYLE] Skipping publisher since build result is FAILURE