You are viewing a plain text version of this content. The canonical link for it is here.
Posted to notifications@jakarta.apache.org by Apache Hudson Server <hu...@hudson.apache.org> on 2011/03/22 01:00:48 UTC

Build failed in Jenkins: Cactus #775

See <https://hudson.apache.org/hudson/job/Cactus/775/>

------------------------------------------
Started by timer
Building remotely on ubuntu1
Updating http://svn.apache.org/repos/asf/jakarta/cactus/trunk
At revision 1084032
no change for http://svn.apache.org/repos/asf/jakarta/cactus/trunk since the previous build
Found mavenVersion 2.0.10 from file jar:file:/home/hudson/tools/maven/latest2/lib/maven-2.0.10-uber.jar!/META-INF/maven/org.apache.maven/maven-core/pom.properties
Parsing POMs
ERROR: Processing failed due to a bug in the code. Please report this to jenkins-users@googlegroups.com
java.lang.ClassCastException: cannot assign instance of hudson.model.StreamBuildListener to field hudson.maven.MavenModuleSetBuild$PomParser.listener of type hudson.model.BuildListener in instance of hudson.maven.MavenModuleSetBuild$PomParser
	at java.io.ObjectStreamClass$FieldReflector.setObjFieldValues(ObjectStreamClass.java:2056)
	at java.io.ObjectStreamClass.setObjFieldValues(ObjectStreamClass.java:1229)
	at java.io.ObjectInputStream.defaultReadFields(ObjectInputStream.java:1969)
	at java.io.ObjectInputStream.readSerialData(ObjectInputStream.java:1887)
	at java.io.ObjectInputStream.readOrdinaryObject(ObjectInputStream.java:1770)
	at java.io.ObjectInputStream.readObject0(ObjectInputStream.java:1346)
	at java.io.ObjectInputStream.defaultReadFields(ObjectInputStream.java:1963)
	at java.io.ObjectInputStream.readSerialData(ObjectInputStream.java:1887)
	at java.io.ObjectInputStream.readOrdinaryObject(ObjectInputStream.java:1770)
	at java.io.ObjectInputStream.readObject0(ObjectInputStream.java:1346)
	at java.io.ObjectInputStream.readObject(ObjectInputStream.java:368)
	at hudson.remoting.UserRequest.deserialize(UserRequest.java:178)
	at hudson.remoting.UserRequest.perform(UserRequest.java:98)
	at hudson.remoting.UserRequest.perform(UserRequest.java:48)
	at hudson.remoting.Request$2.run(Request.java:270)
	at java.util.concurrent.Executors$RunnableAdapter.call(Executors.java:471)
	at java.util.concurrent.FutureTask$Sync.innerRun(FutureTask.java:334)
	at java.util.concurrent.FutureTask.run(FutureTask.java:166)
	at java.util.concurrent.ThreadPoolExecutor.runWorker(ThreadPoolExecutor.java:1110)
	at java.util.concurrent.ThreadPoolExecutor$Worker.run(ThreadPoolExecutor.java:603)
	at java.lang.Thread.run(Thread.java:636)
project=hudson.maven.MavenModuleSet@4b743fba[Cactus]
project.getModules()=[hudson.maven.MavenModule@1b68dbcd[Cactus/org.apache.cactus:cactus][Cactus/org.apache.cactus:cactus][relativePath:], hudson.maven.MavenModule@3235186a[Cactus/org.apache.cactus:cactus-site][Cactus/org.apache.cactus:cactus-site][relativePath:cactus-site], hudson.maven.MavenModule@792e76db[Cactus/org.apache.cactus:cactus.build.tools][Cactus/org.apache.cactus:cactus.build.tools][relativePath:build-tools], hudson.maven.MavenModule@6aadfaec[Cactus/org.apache.cactus:cactus.core.framework][Cactus/org.apache.cactus:cactus.core.framework][relativePath:framework], hudson.maven.MavenModule@508a8b07[Cactus/org.apache.cactus:cactus.core.framework.javaEE.12-13-14][Cactus/org.apache.cactus:cactus.core.framework.javaEE.12-13-14][relativePath:framework/framework-12-13-14], hudson.maven.MavenModule@58caafcc[Cactus/org.apache.cactus:cactus.core.framework.javaEE.13-14][Cactus/org.apache.cactus:cactus.core.framework.javaEE.13-14][relativePath:framework/framework-13-14], hudson.maven.MavenModule@2ad965ea[Cactus/org.apache.cactus:cactus.core.framework.uberjar.javaEE.12][Cactus/org.apache.cactus:cactus.core.framework.uberjar.javaEE.12][relativePath:framework/framework-uberjars/javaEE-12-uberjar], hudson.maven.MavenModule@155a792d[Cactus/org.apache.cactus:cactus.core.framework.uberjar.javaEE.13][Cactus/org.apache.cactus:cactus.core.framework.uberjar.javaEE.13][relativePath:framework/framework-uberjars/javaEE-13-uberjar], hudson.maven.MavenModule@76115ae0[Cactus/org.apache.cactus:cactus.core.framework.uberjar.javaEE.14][Cactus/org.apache.cactus:cactus.core.framework.uberjar.javaEE.14][relativePath:framework/framework-uberjars/javaEE-14-uberjar], hudson.maven.MavenModule@6d4b8027[Cactus/org.apache.cactus:cactus.core.framework.uberjar.javaEE.15][Cactus/org.apache.cactus:cactus.core.framework.uberjar.javaEE.15][relativePath:framework/framework-uberjars/javaEE-15-uberjar], hudson.maven.MavenModule@5e902791[Cactus/org.apache.cactus:cactus.core.framework.uberjars][Cactus/org.apache.cactus:cactus.core.framework.uberjars][relativePath:framework/framework-uberjars], hudson.maven.MavenModule@168386ad[Cactus/org.apache.cactus:cactus.core.framework.wrapper.javaEE.12][Cactus/org.apache.cactus:cactus.core.framework.wrapper.javaEE.12][relativePath:framework/framework-wrappers/wrapper-javaEE-12], hudson.maven.MavenModule@5c5ce611[Cactus/org.apache.cactus:cactus.core.framework.wrapper.javaEE.13][Cactus/org.apache.cactus:cactus.core.framework.wrapper.javaEE.13][relativePath:framework/framework-wrappers/wrapper-javaEE-13], hudson.maven.MavenModule@5a0deddc[Cactus/org.apache.cactus:cactus.core.framework.wrapper.javaEE.14][Cactus/org.apache.cactus:cactus.core.framework.wrapper.javaEE.14][relativePath:framework/framework-wrappers/wrapper-javaEE-14], hudson.maven.MavenModule@1247de8f[Cactus/org.apache.cactus:cactus.core.framework.wrappers][Cactus/org.apache.cactus:cactus.core.framework.wrappers][relativePath:framework/framework-wrappers], hudson.maven.MavenModule@742d142a[Cactus/org.apache.cactus:cactus.integration][Cactus/org.apache.cactus:cactus.integration][relativePath:integration], hudson.maven.MavenModule@273abadc[Cactus/org.apache.cactus:cactus.integration.ant][Cactus/org.apache.cactus:cactus.integration.ant][relativePath:integration/ant], hudson.maven.MavenModule@13552393[Cactus/org.apache.cactus:cactus.integration.eclipse][Cactus/org.apache.cactus:cactus.integration.eclipse][relativePath:integration/eclipse], hudson.maven.MavenModule@69ae8935[Cactus/org.apache.cactus:cactus.integration.maven2][Cactus/org.apache.cactus:cactus.integration.maven2][relativePath:integration/maven2], hudson.maven.MavenModule@4b1e0ac[Cactus/org.apache.cactus:cactus.integration.shared.api][Cactus/org.apache.cactus:cactus.integration.shared.api][relativePath:integration/shared-api], hudson.maven.MavenModule@5ba78787[Cactus/org.apache.cactus:cactus.maven.skin][Cactus/org.apache.cactus:cactus.maven.skin][relativePath:cactus-maven-skin], hudson.maven.MavenModule@65289697[Cactus/org.apache.cactus:cactus.maven1.plugin][Cactus/org.apache.cactus:cactus.maven1.plugin][relativePath:integration/maven], hudson.maven.MavenModule@6063769d[Cactus/org.apache.cactus:cactus.samples][Cactus/org.apache.cactus:cactus.samples][relativePath:samples], hudson.maven.MavenModule@4128dca6[Cactus/org.apache.cactus:org.apache.cactus.eclipse.runner][Cactus/org.apache.cactus:org.apache.cactus.eclipse.runner][relativePath:integration/eclipse/org.apache.cactus.eclipse.runner], hudson.maven.MavenModule@7133919a[Cactus/org.apache.cactus:org.apache.cactus.eclipse.webapp][Cactus/org.apache.cactus:org.apache.cactus.eclipse.webapp][relativePath:integration/eclipse/org.apache.cactus.eclipse.webapp]]
project.getRootModule()=hudson.maven.MavenModule@1b68dbcd[Cactus/org.apache.cactus:cactus][Cactus/org.apache.cactus:cactus][relativePath:]
FATAL: cannot assign instance of hudson.model.StreamBuildListener to field hudson.maven.MavenModuleSetBuild$PomParser.listener of type hudson.model.BuildListener in instance of hudson.maven.MavenModuleSetBuild$PomParser
java.lang.ClassCastException: cannot assign instance of hudson.model.StreamBuildListener to field hudson.maven.MavenModuleSetBuild$PomParser.listener of type hudson.model.BuildListener in instance of hudson.maven.MavenModuleSetBuild$PomParser
	at java.io.ObjectStreamClass$FieldReflector.setObjFieldValues(ObjectStreamClass.java:2056)
	at java.io.ObjectStreamClass.setObjFieldValues(ObjectStreamClass.java:1229)
	at java.io.ObjectInputStream.defaultReadFields(ObjectInputStream.java:1969)
	at java.io.ObjectInputStream.readSerialData(ObjectInputStream.java:1887)
	at java.io.ObjectInputStream.readOrdinaryObject(ObjectInputStream.java:1770)
	at java.io.ObjectInputStream.readObject0(ObjectInputStream.java:1346)
	at java.io.ObjectInputStream.defaultReadFields(ObjectInputStream.java:1963)
	at java.io.ObjectInputStream.readSerialData(ObjectInputStream.java:1887)
	at java.io.ObjectInputStream.readOrdinaryObject(ObjectInputStream.java:1770)
	at java.io.ObjectInputStream.readObject0(ObjectInputStream.java:1346)
	at java.io.ObjectInputStream.readObject(ObjectInputStream.java:368)
	at hudson.remoting.UserRequest.deserialize(UserRequest.java:178)
	at hudson.remoting.UserRequest.perform(UserRequest.java:98)
	at hudson.remoting.UserRequest.perform(UserRequest.java:48)
	at hudson.remoting.Request$2.run(Request.java:270)
	at java.util.concurrent.Executors$RunnableAdapter.call(Executors.java:471)
	at java.util.concurrent.FutureTask$Sync.innerRun(FutureTask.java:334)
	at java.util.concurrent.FutureTask.run(FutureTask.java:166)
	at java.util.concurrent.ThreadPoolExecutor.runWorker(ThreadPoolExecutor.java:1110)
	at java.util.concurrent.ThreadPoolExecutor$Worker.run(ThreadPoolExecutor.java:603)
	at java.lang.Thread.run(Thread.java:636)


---------------------------------------------------------------------
To unsubscribe, e-mail: notifications-unsubscribe@jakarta.apache.org
For additional commands, e-mail: notifications-help@jakarta.apache.org


Build failed in Jenkins: Cactus #782

Posted by Apache Hudson Server <hu...@hudson.apache.org>.
See <https://hudson.apache.org/hudson/job/Cactus/782/>

------------------------------------------
Started by timer
Building remotely on solaris2
Updating http://svn.apache.org/repos/asf/jakarta/cactus/trunk
At revision 1086448
no change for http://svn.apache.org/repos/asf/jakarta/cactus/trunk since the previous build
Found mavenVersion 2.0.9 from file jar:file:/home/hudson/tools/maven/latest2/lib/maven-2.0.9-uber.jar!/META-INF/maven/org.apache.maven/maven-core/pom.properties
Parsing POMs
[Cactus] $ /home/hudson/tools/java/latest1.5/bin/java -cp /home/hudson/hudson-slave/maven-agent.jar:/home/hudson/hudson-slave/classworlds.jar hudson.maven.agent.Main /home/hudson/tools/maven/latest2 /zonestorage/hudson/home/hudson/hudson-slave/slave.jar /home/hudson/hudson-slave/maven-interceptor.jar 47520
<===[HUDSON REMOTING CAPACITY]===>   channel started
[INFO] Scanning for projects...
Executing Maven:  -B -f <https://hudson.apache.org/hudson/job/Cactus/ws/Cactus/pom.xml> clean install
[INFO] Reactor build order: 
[INFO]   Cactus Parent Project
[INFO]   Cactus Build Tools
[INFO]   Cactus Framework - Parent Project
[INFO]   Cactus Framework - shared all versions
[INFO]   Cactus Framework - shared Java EE 1.3 and 1.4
[INFO]   Cactus Wrappers - Parent Project
[INFO]   Cactus Wrappers - Java EE 1.2
[INFO]   Cactus Wrappers - Java EE 1.3
[INFO]   Cactus Wrappers - Java EE 1.4
[INFO]   Cactus Uberjars - Parent Project
[INFO]   Cactus Uberjar - Java EE 1.2
[INFO]   Cactus Uberjar - Java EE 1.3
[INFO]   Cactus Uberjar - Java EE 1.4
[INFO]   Cactus Uberjar - Java EE 1.5
[INFO]   Cactus Integration - Parent Project
[INFO]   Cactus Shared API for the integration
[INFO]   Cactus Ant Integration
[INFO]   Cactus Maven 1 Plugin
[INFO]   Cactus Integration Maven2 - Plugin Project
[INFO]   Cactus Eclipse Integration
[INFO]   Cactus Eclipse Integration - Webapp
[INFO]   Cactus Eclipse Integration - Runner
[INFO]   Cactus Samples - Parent Project
[INFO]   Apache Cactus
[INFO]   Cactus Site Skin
[INFO] ------------------------------------------------------------------------
[ERROR] BUILD ERROR
[INFO] ------------------------------------------------------------------------
[INFO] Error building POM (may not be this project's POM).


Project ID: org.apache.maven.plugins:maven-one-plugin

Reason: Error getting POM for 'org.apache.maven.plugins:maven-one-plugin' from the repository: Unable to read local copy of metadata: Cannot read metadata from '/export/home/hudson/.m2/repository/org/apache/maven/plugins/maven-one-plugin/1.3-SNAPSHOT/maven-metadata-local.xml': expected START_TAG or END_TAG not TEXT (position: TEXT seen ...<extension>jar</... @13:25) 
  org.apache.maven.plugins:maven-one-plugin:pom:1.3-SNAPSHOT

 for project org.apache.maven.plugins:maven-one-plugin


[INFO] ------------------------------------------------------------------------
[INFO] For more information, run Maven with the -e switch
[INFO] ------------------------------------------------------------------------
[INFO] Total time: 1 second
[INFO] Finished at: Mon Mar 28 20:02:47 EDT 2011
[INFO] Final Memory: 6M/184M
[INFO] ------------------------------------------------------------------------
channel stopped


---------------------------------------------------------------------
To unsubscribe, e-mail: notifications-unsubscribe@jakarta.apache.org
For additional commands, e-mail: notifications-help@jakarta.apache.org


Build failed in Jenkins: Cactus #781

Posted by Apache Hudson Server <hu...@hudson.apache.org>.
See <https://hudson.apache.org/hudson/job/Cactus/781/>

------------------------------------------
[...truncated 796 lines...]
[INFO] ------------------------------------------------------------------------
[INFO] [clean:clean]
[INFO] Deleting directory <https://hudson.apache.org/hudson/job/Cactus/ws/Cactus/integration/ant/target>
[INFO] [remote-resources:process {execution: default}]
[INFO] [resources:resources]
[WARNING] Using platform encoding (ANSI_X3.4-1968 actually) to copy filtered resources, i.e. build is platform dependent!
[INFO] Copying 1 resource
[INFO] Copying 3 resources
[INFO] [compiler:compile]
[INFO] Compiling 12 source files to <https://hudson.apache.org/hudson/job/Cactus/ws/Cactus/integration/ant/target/classes>
[INFO] [resources:testResources]
[WARNING] Using platform encoding (ANSI_X3.4-1968 actually) to copy filtered resources, i.e. build is platform dependent!
[INFO] skip non existing resourceDirectory <https://hudson.apache.org/hudson/job/Cactus/ws/Cactus/integration/ant/src/test/resources>
[INFO] Copying 3 resources
[INFO] [compiler:testCompile]
[INFO] Compiling 16 source files to <https://hudson.apache.org/hudson/job/Cactus/ws/Cactus/integration/ant/target/test-classes>
[INFO] [surefire:test]
[INFO] Surefire report directory: <https://hudson.apache.org/hudson/job/Cactus/ws/Cactus/integration/ant/target/surefire-reports>

-------------------------------------------------------
 T E S T S
-------------------------------------------------------
Running org.apache.cactus.integration.ant.deployment.TestJarArchive
Tests run: 5, Failures: 0, Errors: 0, Skipped: 0, Time elapsed: 0.089 sec
Running org.apache.cactus.integration.ant.TestCactusTask
Tests run: 7, Failures: 0, Errors: 0, Skipped: 0, Time elapsed: 0.449 sec
Running org.apache.cactus.integration.ant.deployment.TestAll
Tests run: 0, Failures: 0, Errors: 0, Skipped: 0, Time elapsed: 0.003 sec
Running org.apache.cactus.integration.ant.TestCactusTestTask
Tests run: 7, Failures: 0, Errors: 0, Skipped: 0, Time elapsed: 0.09 sec
Running org.apache.cactus.integration.ant.deployment.application.TestApplicationXmlVersion
Tests run: 8, Failures: 0, Errors: 0, Skipped: 0, Time elapsed: 0.03 sec
Running org.apache.cactus.integration.ant.deployment.TestEarParser
Tests run: 2, Failures: 0, Errors: 0, Skipped: 0, Time elapsed: 0.385 sec
Running org.apache.cactus.integration.ant.deployment.webapp.TestWebXml
Tests run: 54, Failures: 0, Errors: 0, Skipped: 0, Time elapsed: 0.221 sec
Running org.apache.cactus.integration.ant.TestAll
Tests run: 0, Failures: 0, Errors: 0, Skipped: 0, Time elapsed: 0.002 sec
Running org.apache.cactus.integration.ant.TestCactifyEarTask
Tests run: 3, Failures: 0, Errors: 0, Skipped: 0, Time elapsed: 0.644 sec
Running org.apache.cactus.integration.ant.deployment.webapp.TestWebXmlVersion
Tests run: 8, Failures: 0, Errors: 0, Skipped: 0, Time elapsed: 0.006 sec
Running org.apache.cactus.integration.ant.deployment.webapp.TestWarArchive
Tests run: 3, Failures: 0, Errors: 0, Skipped: 0, Time elapsed: 0.007 sec
Running org.apache.cactus.integration.ant.deployment.application.TestApplicationXml
Tests run: 7, Failures: 0, Errors: 0, Skipped: 0, Time elapsed: 0.015 sec
Running org.apache.cactus.integration.ant.TestRunServerTestsTask
Tests run: 6, Failures: 0, Errors: 0, Skipped: 0, Time elapsed: 0.537 sec
Running org.apache.cactus.integration.ant.TestCactifyWarTask
Tests run: 21, Failures: 0, Errors: 0, Skipped: 0, Time elapsed: 2.311 sec

Results :

Tests run: 131, Failures: 0, Errors: 0, Skipped: 0

[JENKINS] Recording test results
[INFO] [jar:jar]
[INFO] Building jar: <https://hudson.apache.org/hudson/job/Cactus/ws/Cactus/integration/ant/target/cactus.integration.ant-1.8.2-SNAPSHOT.jar>
[INFO] [rat:check {execution: default}]
[INFO] Preparing checkstyle:check
[JENKINS] Archiving <https://hudson.apache.org/hudson/job/Cactus/ws/Cactus/integration/ant/pom.xml> to /home/hudson/hudson/jobs/Cactus/modules/org.apache.cactus$cactus.integration.ant/builds/2011-03-28_00-02-34/archive/org.apache.cactus/cactus.integration.ant/1.8.2-SNAPSHOT/pom.xml
[JENKINS] Archiving <https://hudson.apache.org/hudson/job/Cactus/ws/Cactus/integration/ant/target/cactus.integration.ant-1.8.2-SNAPSHOT.jar> to /home/hudson/hudson/jobs/Cactus/modules/org.apache.cactus$cactus.integration.ant/builds/2011-03-28_00-02-34/archive/org.apache.cactus/cactus.integration.ant/1.8.2-SNAPSHOT/cactus.integration.ant-1.8.2-SNAPSHOT.jar
[INFO] [checkstyle:checkstyle]
[WARNING] File encoding has not been set, using platform encoding ANSI_X3.4-1968, i.e. build is platform dependent!
[INFO] Starting audit...
<https://hudson.apache.org/hudson/job/Cactus/ws/Cactus/integration/ant/src/main/java/org/apache/cactus/integration/ant/container/GenericContainer.java>:321:15: warning: Redundant 'final' modifier.
<https://hudson.apache.org/hudson/job/Cactus/ws/Cactus/integration/ant/src/main/java/org/apache/cactus/integration/ant/container/GenericContainer.java>:330:12: warning: Redundant 'final' modifier.
<https://hudson.apache.org/hudson/job/Cactus/ws/Cactus/integration/ant/src/main/java/org/apache/cactus/integration/ant/CactifyWarTask.java>:1: warning: Line does not match expected header line of '/* '.
<https://hudson.apache.org/hudson/job/Cactus/ws/Cactus/integration/ant/src/main/java/org/apache/cactus/integration/ant/CactifyWarTask.java>:74:20: warning: Name 'FILE_NAME' must match pattern '^[a-z][a-zA-Z0-9]*$'.
<https://hudson.apache.org/hudson/job/Cactus/ws/Cactus/integration/ant/src/main/java/org/apache/cactus/integration/ant/CactusTask.java>:95: warning: Comment matches to-do format 'TODO:'.
Audit done.

[INFO] [checkstyle:check {execution: default}]
[INFO] [install:install]
[INFO] Installing <https://hudson.apache.org/hudson/job/Cactus/ws/Cactus/integration/ant/target/cactus.integration.ant-1.8.2-SNAPSHOT.jar> to /home/hudson/.m2/repository/org/apache/cactus/cactus.integration.ant/1.8.2-SNAPSHOT/cactus.integration.ant-1.8.2-SNAPSHOT.jar
[INFO] ------------------------------------------------------------------------
[INFO] Building Cactus Maven 1 Plugin
[INFO]    task-segment: [clean, install]
[INFO] ------------------------------------------------------------------------
[INFO] [clean:clean]
[INFO] Deleting directory <https://hudson.apache.org/hudson/job/Cactus/ws/Cactus/integration/maven/target>
[INFO] [remote-resources:process {execution: default}]
[WARNING] Attempting to build MavenProject instance for Artifact (commons-jelly:commons-jelly:20030902.160215) of type: jar; constructing POM artifact instead.
[WARNING] Attempting to build MavenProject instance for Artifact (commons-discovery:commons-discovery:20030211.213356) of type: jar; constructing POM artifact instead.
[INFO] [resources:resources]
[WARNING] Using platform encoding (ANSI_X3.4-1968 actually) to copy filtered resources, i.e. build is platform dependent!
[INFO] skip non existing resourceDirectory <https://hudson.apache.org/hudson/job/Cactus/ws/Cactus/integration/maven/src/main/resources>
[INFO] Copying 3 resources
[INFO] [compiler:compile]
[INFO] Compiling 3 source files to <https://hudson.apache.org/hudson/job/Cactus/ws/Cactus/integration/maven/target/classes>
[INFO] [resources:testResources]
[WARNING] Using platform encoding (ANSI_X3.4-1968 actually) to copy filtered resources, i.e. build is platform dependent!
[INFO] skip non existing resourceDirectory <https://hudson.apache.org/hudson/job/Cactus/ws/Cactus/integration/maven/src/test/resources>
[INFO] Copying 3 resources
[INFO] [compiler:testCompile]
[INFO] No sources to compile
[INFO] [surefire:test]
[INFO] Surefire report directory: <https://hudson.apache.org/hudson/job/Cactus/ws/Cactus/integration/maven/target/surefire-reports>

-------------------------------------------------------
 T E S T S
-------------------------------------------------------
There are no tests to run.

Results :

Tests run: 0, Failures: 0, Errors: 0, Skipped: 0

[JENKINS] Recording test results
[INFO] snapshot org.apache.maven.shared:maven-model-converter:2.3-SNAPSHOT: checking for updates from apache.snapshots
[INFO] [one:maven-one-plugin]
[INFO] Building jar: <https://hudson.apache.org/hudson/job/Cactus/ws/Cactus/integration/maven/target/cactus.maven1.plugin-1.8.2-SNAPSHOT.jar>
[INFO] [rat:check {execution: default}]
[INFO] Preparing checkstyle:check
[JENKINS] Archiving <https://hudson.apache.org/hudson/job/Cactus/ws/Cactus/integration/maven/pom.xml> to /home/hudson/hudson/jobs/Cactus/modules/org.apache.cactus$cactus.maven1.plugin/builds/2011-03-28_00-02-34/archive/org.apache.cactus/cactus.maven1.plugin/1.8.2-SNAPSHOT/pom.xml
[JENKINS] Archiving <https://hudson.apache.org/hudson/job/Cactus/ws/Cactus/integration/maven/target/cactus.maven1.plugin-1.8.2-SNAPSHOT.jar> to /home/hudson/hudson/jobs/Cactus/modules/org.apache.cactus$cactus.maven1.plugin/builds/2011-03-28_00-02-34/archive/org.apache.cactus/cactus.maven1.plugin/1.8.2-SNAPSHOT/cactus.maven1.plugin-1.8.2-SNAPSHOT.jar
[INFO] [checkstyle:checkstyle]
[WARNING] File encoding has not been set, using platform encoding ANSI_X3.4-1968, i.e. build is platform dependent!
[INFO] Starting audit...
Audit done.

[INFO] [checkstyle:check {execution: default}]
[INFO] [install:install]
[INFO] Installing <https://hudson.apache.org/hudson/job/Cactus/ws/Cactus/integration/maven/target/cactus.maven1.plugin-1.8.2-SNAPSHOT.jar> to /home/hudson/.m2/repository/org/apache/cactus/cactus.maven1.plugin/1.8.2-SNAPSHOT/cactus.maven1.plugin-1.8.2-SNAPSHOT.jar
[INFO] [one:install-maven-one-repository {execution: default}]
[INFO] Installing <https://hudson.apache.org/hudson/job/Cactus/ws/Cactus/integration/maven/target/cactus.maven1.plugin-1.8.2-SNAPSHOT.jar> to /home/hudson/.maven/repository/org.apache.cactus/plugins/cactus.maven1.plugin-1.8.2-SNAPSHOT.jar
[INFO] ------------------------------------------------------------------------
[INFO] Building Cactus Integration Maven2 - Plugin Project
[INFO]    task-segment: [clean, install]
[INFO] ------------------------------------------------------------------------
[INFO] [clean:clean]
[INFO] Deleting directory <https://hudson.apache.org/hudson/job/Cactus/ws/Cactus/integration/maven2/target>
[INFO] [plugin:descriptor]
[WARNING] 

Goal prefix is specified as: 'cactus'. Maven currently expects it to be 'cactus.integration.2'.

[INFO] Using 2 extractors.
[INFO] Applying extractor for language: java
[INFO] Extractor for language: java found 2 mojo descriptors.
[INFO] Applying extractor for language: bsh
[INFO] Extractor for language: bsh found 0 mojo descriptors.
[INFO] [remote-resources:process {execution: default}]
[INFO] [resources:resources]
[WARNING] Using platform encoding (ANSI_X3.4-1968 actually) to copy filtered resources, i.e. build is platform dependent!
[INFO] skip non existing resourceDirectory <https://hudson.apache.org/hudson/job/Cactus/ws/Cactus/integration/maven2/src/main/resources>
[INFO] Copying 3 resources
[INFO] [compiler:compile]
[INFO] Compiling 7 source files to <https://hudson.apache.org/hudson/job/Cactus/ws/Cactus/integration/maven2/target/classes>
[INFO] [resources:testResources]
[WARNING] Using platform encoding (ANSI_X3.4-1968 actually) to copy filtered resources, i.e. build is platform dependent!
[INFO] Copying 10 resources
[INFO] Copying 3 resources
[INFO] [compiler:testCompile]
[INFO] Compiling 4 source files to <https://hudson.apache.org/hudson/job/Cactus/ws/Cactus/integration/maven2/target/test-classes>
[INFO] [surefire:test]
[INFO] Surefire report directory: <https://hudson.apache.org/hudson/job/Cactus/ws/Cactus/integration/maven2/target/surefire-reports>

-------------------------------------------------------
 T E S T S
-------------------------------------------------------
Running org.apache.cactus.integration.maven2.test.TestCactifyEarMojo
Tests run: 1, Failures: 0, Errors: 0, Skipped: 0, Time elapsed: 0.42 sec
Running org.apache.cactus.integration.maven2.test.TestCactifyWarMojo
[INFO] Analyzing war: <https://hudson.apache.org/hudson/job/Cactus/ws/Cactus/integration/maven2>:/null
Tests run: 4, Failures: 0, Errors: 0, Skipped: 0, Time elapsed: 0.662 sec

Results :

Tests run: 5, Failures: 0, Errors: 0, Skipped: 0

[JENKINS] Recording test results
[INFO] [jar:jar]
[INFO] Building jar: <https://hudson.apache.org/hudson/job/Cactus/ws/Cactus/integration/maven2/target/cactus.integration.maven2-1.8.2-SNAPSHOT.jar>
[INFO] [plugin:addPluginArtifactMetadata]
[INFO] [rat:check {execution: default}]
[INFO] Preparing checkstyle:check
[JENKINS] Archiving <https://hudson.apache.org/hudson/job/Cactus/ws/Cactus/integration/maven2/pom.xml> to /home/hudson/hudson/jobs/Cactus/modules/org.apache.cactus$cactus.integration.maven2/builds/2011-03-28_00-02-34/archive/org.apache.cactus/cactus.integration.maven2/1.8.2-SNAPSHOT/pom.xml
[JENKINS] Archiving <https://hudson.apache.org/hudson/job/Cactus/ws/Cactus/integration/maven2/target/cactus.integration.maven2-1.8.2-SNAPSHOT.jar> to /home/hudson/hudson/jobs/Cactus/modules/org.apache.cactus$cactus.integration.maven2/builds/2011-03-28_00-02-34/archive/org.apache.cactus/cactus.integration.maven2/1.8.2-SNAPSHOT/cactus.integration.maven2-1.8.2-SNAPSHOT.jar
[INFO] [checkstyle:checkstyle]
[WARNING] File encoding has not been set, using platform encoding ANSI_X3.4-1968, i.e. build is platform dependent!
[INFO] Starting audit...
<https://hudson.apache.org/hudson/job/Cactus/ws/Cactus/integration/maven2/src/main/java/org/apache/cactus/maven2/mojos/CactifyWarMojo.java>:80:20: warning: Name 'FILE_NAME' must match pattern '^[a-z][a-zA-Z0-9]*$'.
<https://hudson.apache.org/hudson/job/Cactus/ws/Cactus/integration/maven2/src/main/java/org/apache/cactus/maven2/mojos/CactifyWarMojo.java>:259:5: warning: Method length is 169 lines (max allowed is 150).
Audit done.

[INFO] [checkstyle:check {execution: default}]
[INFO] [install:install]
[INFO] Installing <https://hudson.apache.org/hudson/job/Cactus/ws/Cactus/integration/maven2/target/cactus.integration.maven2-1.8.2-SNAPSHOT.jar> to /home/hudson/.m2/repository/org/apache/cactus/cactus.integration.maven2/1.8.2-SNAPSHOT/cactus.integration.maven2-1.8.2-SNAPSHOT.jar
[INFO] [plugin:updateRegistry]
[INFO] ------------------------------------------------------------------------
[INFO] Building Cactus Eclipse Integration
[INFO]    task-segment: [clean, install]
[INFO] ------------------------------------------------------------------------
[INFO] [clean:clean]
[INFO] Deleting directory <https://hudson.apache.org/hudson/job/Cactus/ws/Cactus/integration/eclipse/target>
[INFO] [remote-resources:process {execution: default}]
[INFO] [site:attach-descriptor]
[INFO] [rat:check {execution: default}]
[INFO] Preparing checkstyle:check
[JENKINS] Archiving <https://hudson.apache.org/hudson/job/Cactus/ws/Cactus/integration/eclipse/pom.xml> to /home/hudson/hudson/jobs/Cactus/modules/org.apache.cactus$cactus.integration.eclipse/builds/2011-03-28_00-02-34/archive/org.apache.cactus/cactus.integration.eclipse/1.8.2-SNAPSHOT/pom.xml
[INFO] [checkstyle:checkstyle]
[INFO] Source directory does not exist - skipping report.
[INFO] [checkstyle:check {execution: default}]
[INFO] Unable to perform checkstyle:check, unable to find checkstyle:checkstyle outputFile.
[INFO] [install:install]
[INFO] Installing <https://hudson.apache.org/hudson/job/Cactus/ws/Cactus/integration/eclipse/pom.xml> to /home/hudson/.m2/repository/org/apache/cactus/cactus.integration.eclipse/1.8.2-SNAPSHOT/cactus.integration.eclipse-1.8.2-SNAPSHOT.pom
[INFO] ------------------------------------------------------------------------
[INFO] Building Cactus Eclipse Integration - Webapp
[INFO]    task-segment: [clean, install]
[INFO] ------------------------------------------------------------------------
[INFO] [clean:clean]
[INFO] artifact org.eclipse.jdt:ui: checking for updates from central
[INFO] artifact org.eclipse:osgi: checking for updates from central
[INFO] artifact org.eclipse.equinox:common: checking for updates from central
[INFO] artifact org.eclipse.core:jobs: checking for updates from central
[INFO] artifact org.eclipse.equinox:registry: checking for updates from central
[INFO] artifact org.eclipse.equinox:preferences: checking for updates from central
[INFO] artifact org.eclipse.core:contenttype: checking for updates from central
[INFO] artifact org.eclipse.equinox:app: checking for updates from central
[JENKINS] Archiving <https://hudson.apache.org/hudson/job/Cactus/ws/Cactus/integration/eclipse/org.apache.cactus.eclipse.webapp/pom.xml> to /home/hudson/hudson/jobs/Cactus/modules/org.apache.cactus$org.apache.cactus.eclipse.webapp/builds/2011-03-28_00-02-34/archive/org.apache.cactus/org.apache.cactus.eclipse.webapp/1.8.2-SNAPSHOT/pom.xml
[INFO] ------------------------------------------------------------------------
[ERROR] BUILD ERROR
[INFO] ------------------------------------------------------------------------
[INFO] Failed to resolve artifact.

Couldn't find a version in [1.0.0-v20070423, 1.0.0-v20070606] to match range [1.0.0,2.0.0)
  org.eclipse.equinox:app:jar:null

from the specified remote repositories:
  central (http://repo1.maven.org/maven2),
  maven.eclipse.plugin.repository (http://repo1.maven.org/eclipse/)

Path to dependency: 
	1) org.apache.cactus:org.apache.cactus.eclipse.webapp:jar:1.8.2-SNAPSHOT
	2) org.eclipse.jdt:ui:jar:3.3.0-v20070607-0010
	3) org.eclipse:ui:jar:3.3.0-I20070614-0800
	4) org.eclipse.core:runtime:jar:3.3.100-v20070530



[INFO] ------------------------------------------------------------------------
[INFO] For more information, run Maven with the -e switch
[INFO] ------------------------------------------------------------------------
[INFO] Total time: 2 minutes 24 seconds
[INFO] Finished at: Sun Mar 27 16:05:29 GMT-08:00 2011
[INFO] Final Memory: 57M/221M
[INFO] ------------------------------------------------------------------------
channel stopped


---------------------------------------------------------------------
To unsubscribe, e-mail: notifications-unsubscribe@jakarta.apache.org
For additional commands, e-mail: notifications-help@jakarta.apache.org


Build failed in Jenkins: Cactus #780

Posted by Apache Hudson Server <hu...@hudson.apache.org>.
See <https://hudson.apache.org/hudson/job/Cactus/780/>

------------------------------------------
[...truncated 796 lines...]
[INFO] ------------------------------------------------------------------------
[INFO] [clean:clean]
[INFO] Deleting directory <https://hudson.apache.org/hudson/job/Cactus/ws/Cactus/integration/ant/target>
[INFO] [remote-resources:process {execution: default}]
[INFO] [resources:resources]
[WARNING] Using platform encoding (ANSI_X3.4-1968 actually) to copy filtered resources, i.e. build is platform dependent!
[INFO] Copying 1 resource
[INFO] Copying 3 resources
[INFO] [compiler:compile]
[INFO] Compiling 12 source files to <https://hudson.apache.org/hudson/job/Cactus/ws/Cactus/integration/ant/target/classes>
[INFO] [resources:testResources]
[WARNING] Using platform encoding (ANSI_X3.4-1968 actually) to copy filtered resources, i.e. build is platform dependent!
[INFO] skip non existing resourceDirectory <https://hudson.apache.org/hudson/job/Cactus/ws/Cactus/integration/ant/src/test/resources>
[INFO] Copying 3 resources
[INFO] [compiler:testCompile]
[INFO] Compiling 16 source files to <https://hudson.apache.org/hudson/job/Cactus/ws/Cactus/integration/ant/target/test-classes>
[INFO] [surefire:test]
[INFO] Surefire report directory: <https://hudson.apache.org/hudson/job/Cactus/ws/Cactus/integration/ant/target/surefire-reports>

-------------------------------------------------------
 T E S T S
-------------------------------------------------------
Running org.apache.cactus.integration.ant.deployment.TestJarArchive
Tests run: 5, Failures: 0, Errors: 0, Skipped: 0, Time elapsed: 0.092 sec
Running org.apache.cactus.integration.ant.TestCactusTask
Tests run: 7, Failures: 0, Errors: 0, Skipped: 0, Time elapsed: 0.499 sec
Running org.apache.cactus.integration.ant.deployment.TestAll
Tests run: 0, Failures: 0, Errors: 0, Skipped: 0, Time elapsed: 0.004 sec
Running org.apache.cactus.integration.ant.TestCactusTestTask
Tests run: 7, Failures: 0, Errors: 0, Skipped: 0, Time elapsed: 0.096 sec
Running org.apache.cactus.integration.ant.deployment.application.TestApplicationXmlVersion
Tests run: 8, Failures: 0, Errors: 0, Skipped: 0, Time elapsed: 0.029 sec
Running org.apache.cactus.integration.ant.deployment.TestEarParser
Tests run: 2, Failures: 0, Errors: 0, Skipped: 0, Time elapsed: 0.114 sec
Running org.apache.cactus.integration.ant.deployment.webapp.TestWebXml
Tests run: 54, Failures: 0, Errors: 0, Skipped: 0, Time elapsed: 0.225 sec
Running org.apache.cactus.integration.ant.TestAll
Tests run: 0, Failures: 0, Errors: 0, Skipped: 0, Time elapsed: 0.002 sec
Running org.apache.cactus.integration.ant.TestCactifyEarTask
Tests run: 3, Failures: 0, Errors: 0, Skipped: 0, Time elapsed: 0.664 sec
Running org.apache.cactus.integration.ant.deployment.webapp.TestWebXmlVersion
Tests run: 8, Failures: 0, Errors: 0, Skipped: 0, Time elapsed: 0.006 sec
Running org.apache.cactus.integration.ant.deployment.webapp.TestWarArchive
Tests run: 3, Failures: 0, Errors: 0, Skipped: 0, Time elapsed: 0.008 sec
Running org.apache.cactus.integration.ant.deployment.application.TestApplicationXml
Tests run: 7, Failures: 0, Errors: 0, Skipped: 0, Time elapsed: 0.017 sec
Running org.apache.cactus.integration.ant.TestRunServerTestsTask
Tests run: 6, Failures: 0, Errors: 0, Skipped: 0, Time elapsed: 0.54 sec
Running org.apache.cactus.integration.ant.TestCactifyWarTask
Tests run: 21, Failures: 0, Errors: 0, Skipped: 0, Time elapsed: 2.356 sec

Results :

Tests run: 131, Failures: 0, Errors: 0, Skipped: 0

[JENKINS] Recording test results
[INFO] [jar:jar]
[INFO] Building jar: <https://hudson.apache.org/hudson/job/Cactus/ws/Cactus/integration/ant/target/cactus.integration.ant-1.8.2-SNAPSHOT.jar>
[INFO] [rat:check {execution: default}]
[INFO] Preparing checkstyle:check
[JENKINS] Archiving <https://hudson.apache.org/hudson/job/Cactus/ws/Cactus/integration/ant/pom.xml> to /home/hudson/hudson/jobs/Cactus/modules/org.apache.cactus$cactus.integration.ant/builds/2011-03-27_00-02-44/archive/org.apache.cactus/cactus.integration.ant/1.8.2-SNAPSHOT/pom.xml
[JENKINS] Archiving <https://hudson.apache.org/hudson/job/Cactus/ws/Cactus/integration/ant/target/cactus.integration.ant-1.8.2-SNAPSHOT.jar> to /home/hudson/hudson/jobs/Cactus/modules/org.apache.cactus$cactus.integration.ant/builds/2011-03-27_00-02-44/archive/org.apache.cactus/cactus.integration.ant/1.8.2-SNAPSHOT/cactus.integration.ant-1.8.2-SNAPSHOT.jar
[INFO] [checkstyle:checkstyle]
[WARNING] File encoding has not been set, using platform encoding ANSI_X3.4-1968, i.e. build is platform dependent!
[INFO] Starting audit...
<https://hudson.apache.org/hudson/job/Cactus/ws/Cactus/integration/ant/src/main/java/org/apache/cactus/integration/ant/container/GenericContainer.java>:321:15: warning: Redundant 'final' modifier.
<https://hudson.apache.org/hudson/job/Cactus/ws/Cactus/integration/ant/src/main/java/org/apache/cactus/integration/ant/container/GenericContainer.java>:330:12: warning: Redundant 'final' modifier.
<https://hudson.apache.org/hudson/job/Cactus/ws/Cactus/integration/ant/src/main/java/org/apache/cactus/integration/ant/CactifyWarTask.java>:1: warning: Line does not match expected header line of '/* '.
<https://hudson.apache.org/hudson/job/Cactus/ws/Cactus/integration/ant/src/main/java/org/apache/cactus/integration/ant/CactifyWarTask.java>:74:20: warning: Name 'FILE_NAME' must match pattern '^[a-z][a-zA-Z0-9]*$'.
<https://hudson.apache.org/hudson/job/Cactus/ws/Cactus/integration/ant/src/main/java/org/apache/cactus/integration/ant/CactusTask.java>:95: warning: Comment matches to-do format 'TODO:'.
Audit done.

[INFO] [checkstyle:check {execution: default}]
[INFO] [install:install]
[INFO] Installing <https://hudson.apache.org/hudson/job/Cactus/ws/Cactus/integration/ant/target/cactus.integration.ant-1.8.2-SNAPSHOT.jar> to /home/hudson/.m2/repository/org/apache/cactus/cactus.integration.ant/1.8.2-SNAPSHOT/cactus.integration.ant-1.8.2-SNAPSHOT.jar
[INFO] ------------------------------------------------------------------------
[INFO] Building Cactus Maven 1 Plugin
[INFO]    task-segment: [clean, install]
[INFO] ------------------------------------------------------------------------
[INFO] [clean:clean]
[INFO] Deleting directory <https://hudson.apache.org/hudson/job/Cactus/ws/Cactus/integration/maven/target>
[INFO] [remote-resources:process {execution: default}]
[WARNING] Attempting to build MavenProject instance for Artifact (commons-jelly:commons-jelly:20030902.160215) of type: jar; constructing POM artifact instead.
[WARNING] Attempting to build MavenProject instance for Artifact (commons-discovery:commons-discovery:20030211.213356) of type: jar; constructing POM artifact instead.
[INFO] [resources:resources]
[WARNING] Using platform encoding (ANSI_X3.4-1968 actually) to copy filtered resources, i.e. build is platform dependent!
[INFO] skip non existing resourceDirectory <https://hudson.apache.org/hudson/job/Cactus/ws/Cactus/integration/maven/src/main/resources>
[INFO] Copying 3 resources
[INFO] [compiler:compile]
[INFO] Compiling 3 source files to <https://hudson.apache.org/hudson/job/Cactus/ws/Cactus/integration/maven/target/classes>
[INFO] [resources:testResources]
[WARNING] Using platform encoding (ANSI_X3.4-1968 actually) to copy filtered resources, i.e. build is platform dependent!
[INFO] skip non existing resourceDirectory <https://hudson.apache.org/hudson/job/Cactus/ws/Cactus/integration/maven/src/test/resources>
[INFO] Copying 3 resources
[INFO] [compiler:testCompile]
[INFO] No sources to compile
[INFO] [surefire:test]
[INFO] Surefire report directory: <https://hudson.apache.org/hudson/job/Cactus/ws/Cactus/integration/maven/target/surefire-reports>

-------------------------------------------------------
 T E S T S
-------------------------------------------------------
There are no tests to run.

Results :

Tests run: 0, Failures: 0, Errors: 0, Skipped: 0

[JENKINS] Recording test results
[INFO] snapshot org.apache.maven.shared:maven-model-converter:2.3-SNAPSHOT: checking for updates from apache.snapshots
[INFO] [one:maven-one-plugin]
[INFO] Building jar: <https://hudson.apache.org/hudson/job/Cactus/ws/Cactus/integration/maven/target/cactus.maven1.plugin-1.8.2-SNAPSHOT.jar>
[INFO] [rat:check {execution: default}]
[INFO] Preparing checkstyle:check
[JENKINS] Archiving <https://hudson.apache.org/hudson/job/Cactus/ws/Cactus/integration/maven/pom.xml> to /home/hudson/hudson/jobs/Cactus/modules/org.apache.cactus$cactus.maven1.plugin/builds/2011-03-27_00-02-44/archive/org.apache.cactus/cactus.maven1.plugin/1.8.2-SNAPSHOT/pom.xml
[JENKINS] Archiving <https://hudson.apache.org/hudson/job/Cactus/ws/Cactus/integration/maven/target/cactus.maven1.plugin-1.8.2-SNAPSHOT.jar> to /home/hudson/hudson/jobs/Cactus/modules/org.apache.cactus$cactus.maven1.plugin/builds/2011-03-27_00-02-44/archive/org.apache.cactus/cactus.maven1.plugin/1.8.2-SNAPSHOT/cactus.maven1.plugin-1.8.2-SNAPSHOT.jar
[INFO] [checkstyle:checkstyle]
[WARNING] File encoding has not been set, using platform encoding ANSI_X3.4-1968, i.e. build is platform dependent!
[INFO] Starting audit...
Audit done.

[INFO] [checkstyle:check {execution: default}]
[INFO] [install:install]
[INFO] Installing <https://hudson.apache.org/hudson/job/Cactus/ws/Cactus/integration/maven/target/cactus.maven1.plugin-1.8.2-SNAPSHOT.jar> to /home/hudson/.m2/repository/org/apache/cactus/cactus.maven1.plugin/1.8.2-SNAPSHOT/cactus.maven1.plugin-1.8.2-SNAPSHOT.jar
[INFO] [one:install-maven-one-repository {execution: default}]
[INFO] Installing <https://hudson.apache.org/hudson/job/Cactus/ws/Cactus/integration/maven/target/cactus.maven1.plugin-1.8.2-SNAPSHOT.jar> to /home/hudson/.maven/repository/org.apache.cactus/plugins/cactus.maven1.plugin-1.8.2-SNAPSHOT.jar
[INFO] ------------------------------------------------------------------------
[INFO] Building Cactus Integration Maven2 - Plugin Project
[INFO]    task-segment: [clean, install]
[INFO] ------------------------------------------------------------------------
[INFO] [clean:clean]
[INFO] Deleting directory <https://hudson.apache.org/hudson/job/Cactus/ws/Cactus/integration/maven2/target>
[INFO] [plugin:descriptor]
[WARNING] 

Goal prefix is specified as: 'cactus'. Maven currently expects it to be 'cactus.integration.2'.

[INFO] Using 2 extractors.
[INFO] Applying extractor for language: java
[INFO] Extractor for language: java found 2 mojo descriptors.
[INFO] Applying extractor for language: bsh
[INFO] Extractor for language: bsh found 0 mojo descriptors.
[INFO] [remote-resources:process {execution: default}]
[INFO] [resources:resources]
[WARNING] Using platform encoding (ANSI_X3.4-1968 actually) to copy filtered resources, i.e. build is platform dependent!
[INFO] skip non existing resourceDirectory <https://hudson.apache.org/hudson/job/Cactus/ws/Cactus/integration/maven2/src/main/resources>
[INFO] Copying 3 resources
[INFO] [compiler:compile]
[INFO] Compiling 7 source files to <https://hudson.apache.org/hudson/job/Cactus/ws/Cactus/integration/maven2/target/classes>
[INFO] [resources:testResources]
[WARNING] Using platform encoding (ANSI_X3.4-1968 actually) to copy filtered resources, i.e. build is platform dependent!
[INFO] Copying 10 resources
[INFO] Copying 3 resources
[INFO] [compiler:testCompile]
[INFO] Compiling 4 source files to <https://hudson.apache.org/hudson/job/Cactus/ws/Cactus/integration/maven2/target/test-classes>
[INFO] [surefire:test]
[INFO] Surefire report directory: <https://hudson.apache.org/hudson/job/Cactus/ws/Cactus/integration/maven2/target/surefire-reports>

-------------------------------------------------------
 T E S T S
-------------------------------------------------------
Running org.apache.cactus.integration.maven2.test.TestCactifyEarMojo
Tests run: 1, Failures: 0, Errors: 0, Skipped: 0, Time elapsed: 0.423 sec
Running org.apache.cactus.integration.maven2.test.TestCactifyWarMojo
[INFO] Analyzing war: <https://hudson.apache.org/hudson/job/Cactus/ws/Cactus/integration/maven2>:/null
Tests run: 4, Failures: 0, Errors: 0, Skipped: 0, Time elapsed: 0.598 sec

Results :

Tests run: 5, Failures: 0, Errors: 0, Skipped: 0

[JENKINS] Recording test results
[INFO] [jar:jar]
[INFO] Building jar: <https://hudson.apache.org/hudson/job/Cactus/ws/Cactus/integration/maven2/target/cactus.integration.maven2-1.8.2-SNAPSHOT.jar>
[INFO] [plugin:addPluginArtifactMetadata]
[INFO] [rat:check {execution: default}]
[INFO] Preparing checkstyle:check
[JENKINS] Archiving <https://hudson.apache.org/hudson/job/Cactus/ws/Cactus/integration/maven2/pom.xml> to /home/hudson/hudson/jobs/Cactus/modules/org.apache.cactus$cactus.integration.maven2/builds/2011-03-27_00-02-44/archive/org.apache.cactus/cactus.integration.maven2/1.8.2-SNAPSHOT/pom.xml
[JENKINS] Archiving <https://hudson.apache.org/hudson/job/Cactus/ws/Cactus/integration/maven2/target/cactus.integration.maven2-1.8.2-SNAPSHOT.jar> to /home/hudson/hudson/jobs/Cactus/modules/org.apache.cactus$cactus.integration.maven2/builds/2011-03-27_00-02-44/archive/org.apache.cactus/cactus.integration.maven2/1.8.2-SNAPSHOT/cactus.integration.maven2-1.8.2-SNAPSHOT.jar
[INFO] [checkstyle:checkstyle]
[WARNING] File encoding has not been set, using platform encoding ANSI_X3.4-1968, i.e. build is platform dependent!
[INFO] Starting audit...
<https://hudson.apache.org/hudson/job/Cactus/ws/Cactus/integration/maven2/src/main/java/org/apache/cactus/maven2/mojos/CactifyWarMojo.java>:80:20: warning: Name 'FILE_NAME' must match pattern '^[a-z][a-zA-Z0-9]*$'.
<https://hudson.apache.org/hudson/job/Cactus/ws/Cactus/integration/maven2/src/main/java/org/apache/cactus/maven2/mojos/CactifyWarMojo.java>:259:5: warning: Method length is 169 lines (max allowed is 150).
Audit done.

[INFO] [checkstyle:check {execution: default}]
[INFO] [install:install]
[INFO] Installing <https://hudson.apache.org/hudson/job/Cactus/ws/Cactus/integration/maven2/target/cactus.integration.maven2-1.8.2-SNAPSHOT.jar> to /home/hudson/.m2/repository/org/apache/cactus/cactus.integration.maven2/1.8.2-SNAPSHOT/cactus.integration.maven2-1.8.2-SNAPSHOT.jar
[INFO] [plugin:updateRegistry]
[INFO] ------------------------------------------------------------------------
[INFO] Building Cactus Eclipse Integration
[INFO]    task-segment: [clean, install]
[INFO] ------------------------------------------------------------------------
[INFO] [clean:clean]
[INFO] Deleting directory <https://hudson.apache.org/hudson/job/Cactus/ws/Cactus/integration/eclipse/target>
[INFO] [remote-resources:process {execution: default}]
[INFO] [site:attach-descriptor]
[INFO] [rat:check {execution: default}]
[INFO] Preparing checkstyle:check
[JENKINS] Archiving <https://hudson.apache.org/hudson/job/Cactus/ws/Cactus/integration/eclipse/pom.xml> to /home/hudson/hudson/jobs/Cactus/modules/org.apache.cactus$cactus.integration.eclipse/builds/2011-03-27_00-02-44/archive/org.apache.cactus/cactus.integration.eclipse/1.8.2-SNAPSHOT/pom.xml
[INFO] [checkstyle:checkstyle]
[INFO] Source directory does not exist - skipping report.
[INFO] [checkstyle:check {execution: default}]
[INFO] Unable to perform checkstyle:check, unable to find checkstyle:checkstyle outputFile.
[INFO] [install:install]
[INFO] Installing <https://hudson.apache.org/hudson/job/Cactus/ws/Cactus/integration/eclipse/pom.xml> to /home/hudson/.m2/repository/org/apache/cactus/cactus.integration.eclipse/1.8.2-SNAPSHOT/cactus.integration.eclipse-1.8.2-SNAPSHOT.pom
[INFO] ------------------------------------------------------------------------
[INFO] Building Cactus Eclipse Integration - Webapp
[INFO]    task-segment: [clean, install]
[INFO] ------------------------------------------------------------------------
[INFO] [clean:clean]
[INFO] artifact org.eclipse.jdt:ui: checking for updates from central
[INFO] artifact org.eclipse:osgi: checking for updates from central
[INFO] artifact org.eclipse.equinox:common: checking for updates from central
[INFO] artifact org.eclipse.core:jobs: checking for updates from central
[INFO] artifact org.eclipse.equinox:registry: checking for updates from central
[INFO] artifact org.eclipse.equinox:preferences: checking for updates from central
[INFO] artifact org.eclipse.core:contenttype: checking for updates from central
[INFO] artifact org.eclipse.equinox:app: checking for updates from central
[JENKINS] Archiving <https://hudson.apache.org/hudson/job/Cactus/ws/Cactus/integration/eclipse/org.apache.cactus.eclipse.webapp/pom.xml> to /home/hudson/hudson/jobs/Cactus/modules/org.apache.cactus$org.apache.cactus.eclipse.webapp/builds/2011-03-27_00-02-44/archive/org.apache.cactus/org.apache.cactus.eclipse.webapp/1.8.2-SNAPSHOT/pom.xml
[INFO] ------------------------------------------------------------------------
[ERROR] BUILD ERROR
[INFO] ------------------------------------------------------------------------
[INFO] Failed to resolve artifact.

Couldn't find a version in [1.0.0-v20070423, 1.0.0-v20070606] to match range [1.0.0,2.0.0)
  org.eclipse.equinox:app:jar:null

from the specified remote repositories:
  central (http://repo1.maven.org/maven2),
  maven.eclipse.plugin.repository (http://repo1.maven.org/eclipse/)

Path to dependency: 
	1) org.apache.cactus:org.apache.cactus.eclipse.webapp:jar:1.8.2-SNAPSHOT
	2) org.eclipse.jdt:ui:jar:3.3.0-v20070607-0010
	3) org.eclipse:ui:jar:3.3.0-I20070614-0800
	4) org.eclipse.core:runtime:jar:3.3.100-v20070530



[INFO] ------------------------------------------------------------------------
[INFO] For more information, run Maven with the -e switch
[INFO] ------------------------------------------------------------------------
[INFO] Total time: 2 minutes 21 seconds
[INFO] Finished at: Sat Mar 26 16:05:33 GMT-08:00 2011
[INFO] Final Memory: 57M/222M
[INFO] ------------------------------------------------------------------------
channel stopped


---------------------------------------------------------------------
To unsubscribe, e-mail: notifications-unsubscribe@jakarta.apache.org
For additional commands, e-mail: notifications-help@jakarta.apache.org


Build failed in Jenkins: Cactus #779

Posted by Apache Hudson Server <hu...@hudson.apache.org>.
See <https://hudson.apache.org/hudson/job/Cactus/779/>

------------------------------------------
Started by timer
Building remotely on ubuntu1
Updating http://svn.apache.org/repos/asf/jakarta/cactus/trunk
At revision 1085607
no change for http://svn.apache.org/repos/asf/jakarta/cactus/trunk since the previous build
Found mavenVersion 2.0.10 from file jar:file:/home/hudson/tools/maven/latest2/lib/maven-2.0.10-uber.jar!/META-INF/maven/org.apache.maven/maven-core/pom.properties
Parsing POMs
ERROR: Processing failed due to a bug in the code. Please report this to jenkins-users@googlegroups.com
java.lang.ClassCastException: cannot assign instance of hudson.model.StreamBuildListener to field hudson.maven.MavenModuleSetBuild$PomParser.listener of type hudson.model.BuildListener in instance of hudson.maven.MavenModuleSetBuild$PomParser
	at java.io.ObjectStreamClass$FieldReflector.setObjFieldValues(ObjectStreamClass.java:2056)
	at java.io.ObjectStreamClass.setObjFieldValues(ObjectStreamClass.java:1229)
	at java.io.ObjectInputStream.defaultReadFields(ObjectInputStream.java:1969)
	at java.io.ObjectInputStream.readSerialData(ObjectInputStream.java:1887)
	at java.io.ObjectInputStream.readOrdinaryObject(ObjectInputStream.java:1770)
	at java.io.ObjectInputStream.readObject0(ObjectInputStream.java:1346)
	at java.io.ObjectInputStream.defaultReadFields(ObjectInputStream.java:1963)
	at java.io.ObjectInputStream.readSerialData(ObjectInputStream.java:1887)
	at java.io.ObjectInputStream.readOrdinaryObject(ObjectInputStream.java:1770)
	at java.io.ObjectInputStream.readObject0(ObjectInputStream.java:1346)
	at java.io.ObjectInputStream.readObject(ObjectInputStream.java:368)
	at hudson.remoting.UserRequest.deserialize(UserRequest.java:178)
	at hudson.remoting.UserRequest.perform(UserRequest.java:98)
	at hudson.remoting.UserRequest.perform(UserRequest.java:48)
	at hudson.remoting.Request$2.run(Request.java:270)
	at java.util.concurrent.Executors$RunnableAdapter.call(Executors.java:471)
	at java.util.concurrent.FutureTask$Sync.innerRun(FutureTask.java:334)
	at java.util.concurrent.FutureTask.run(FutureTask.java:166)
	at java.util.concurrent.ThreadPoolExecutor.runWorker(ThreadPoolExecutor.java:1110)
	at java.util.concurrent.ThreadPoolExecutor$Worker.run(ThreadPoolExecutor.java:603)
	at java.lang.Thread.run(Thread.java:636)
project=hudson.maven.MavenModuleSet@6f56e454[Cactus]
project.getModules()=[hudson.maven.MavenModule@2fb1e76a[Cactus/org.apache.cactus:cactus][Cactus/org.apache.cactus:cactus][relativePath:], hudson.maven.MavenModule@1def8b6c[Cactus/org.apache.cactus:cactus-site][Cactus/org.apache.cactus:cactus-site][relativePath:cactus-site], hudson.maven.MavenModule@7b3640f1[Cactus/org.apache.cactus:cactus.build.tools][Cactus/org.apache.cactus:cactus.build.tools][relativePath:build-tools], hudson.maven.MavenModule@68d6f200[Cactus/org.apache.cactus:cactus.core.framework][Cactus/org.apache.cactus:cactus.core.framework][relativePath:framework], hudson.maven.MavenModule@5735c56b[Cactus/org.apache.cactus:cactus.core.framework.javaEE.12-13-14][Cactus/org.apache.cactus:cactus.core.framework.javaEE.12-13-14][relativePath:framework/framework-12-13-14], hudson.maven.MavenModule@524321b8[Cactus/org.apache.cactus:cactus.core.framework.javaEE.13-14][Cactus/org.apache.cactus:cactus.core.framework.javaEE.13-14][relativePath:framework/framework-13-14], hudson.maven.MavenModule@5aa76583[Cactus/org.apache.cactus:cactus.core.framework.uberjar.javaEE.12][Cactus/org.apache.cactus:cactus.core.framework.uberjar.javaEE.12][relativePath:framework/framework-uberjars/javaEE-12-uberjar], hudson.maven.MavenModule@1171a7e4[Cactus/org.apache.cactus:cactus.core.framework.uberjar.javaEE.13][Cactus/org.apache.cactus:cactus.core.framework.uberjar.javaEE.13][relativePath:framework/framework-uberjars/javaEE-13-uberjar], hudson.maven.MavenModule@8ff99df[Cactus/org.apache.cactus:cactus.core.framework.uberjar.javaEE.14][Cactus/org.apache.cactus:cactus.core.framework.uberjar.javaEE.14][relativePath:framework/framework-uberjars/javaEE-14-uberjar], hudson.maven.MavenModule@62ce9d88[Cactus/org.apache.cactus:cactus.core.framework.uberjar.javaEE.15][Cactus/org.apache.cactus:cactus.core.framework.uberjar.javaEE.15][relativePath:framework/framework-uberjars/javaEE-15-uberjar], hudson.maven.MavenModule@1efc48ce[Cactus/org.apache.cactus:cactus.core.framework.uberjars][Cactus/org.apache.cactus:cactus.core.framework.uberjars][relativePath:framework/framework-uberjars], hudson.maven.MavenModule@5713e8d2[Cactus/org.apache.cactus:cactus.core.framework.wrapper.javaEE.12][Cactus/org.apache.cactus:cactus.core.framework.wrapper.javaEE.12][relativePath:framework/framework-wrappers/wrapper-javaEE-12], hudson.maven.MavenModule@2cb09a49[Cactus/org.apache.cactus:cactus.core.framework.wrapper.javaEE.13][Cactus/org.apache.cactus:cactus.core.framework.wrapper.javaEE.13][relativePath:framework/framework-wrappers/wrapper-javaEE-13], hudson.maven.MavenModule@5c536234[Cactus/org.apache.cactus:cactus.core.framework.wrapper.javaEE.14][Cactus/org.apache.cactus:cactus.core.framework.wrapper.javaEE.14][relativePath:framework/framework-wrappers/wrapper-javaEE-14], hudson.maven.MavenModule@348d2085[Cactus/org.apache.cactus:cactus.core.framework.wrappers][Cactus/org.apache.cactus:cactus.core.framework.wrappers][relativePath:framework/framework-wrappers], hudson.maven.MavenModule@2022d1f4[Cactus/org.apache.cactus:cactus.integration][Cactus/org.apache.cactus:cactus.integration][relativePath:integration], hudson.maven.MavenModule@51f205eb[Cactus/org.apache.cactus:cactus.integration.ant][Cactus/org.apache.cactus:cactus.integration.ant][relativePath:integration/ant], hudson.maven.MavenModule@6f4c198a[Cactus/org.apache.cactus:cactus.integration.eclipse][Cactus/org.apache.cactus:cactus.integration.eclipse][relativePath:integration/eclipse], hudson.maven.MavenModule@157090d9[Cactus/org.apache.cactus:cactus.integration.maven2][Cactus/org.apache.cactus:cactus.integration.maven2][relativePath:integration/maven2], hudson.maven.MavenModule@778adf2f[Cactus/org.apache.cactus:cactus.integration.shared.api][Cactus/org.apache.cactus:cactus.integration.shared.api][relativePath:integration/shared-api], hudson.maven.MavenModule@74d0d91c[Cactus/org.apache.cactus:cactus.maven.skin][Cactus/org.apache.cactus:cactus.maven.skin][relativePath:cactus-maven-skin], hudson.maven.MavenModule@632c13a2[Cactus/org.apache.cactus:cactus.maven1.plugin][Cactus/org.apache.cactus:cactus.maven1.plugin][relativePath:integration/maven], hudson.maven.MavenModule@76f79c23[Cactus/org.apache.cactus:cactus.samples][Cactus/org.apache.cactus:cactus.samples][relativePath:samples], hudson.maven.MavenModule@7a844674[Cactus/org.apache.cactus:org.apache.cactus.eclipse.runner][Cactus/org.apache.cactus:org.apache.cactus.eclipse.runner][relativePath:integration/eclipse/org.apache.cactus.eclipse.runner], hudson.maven.MavenModule@2099e843[Cactus/org.apache.cactus:org.apache.cactus.eclipse.webapp][Cactus/org.apache.cactus:org.apache.cactus.eclipse.webapp][relativePath:integration/eclipse/org.apache.cactus.eclipse.webapp]]
project.getRootModule()=hudson.maven.MavenModule@2fb1e76a[Cactus/org.apache.cactus:cactus][Cactus/org.apache.cactus:cactus][relativePath:]
FATAL: cannot assign instance of hudson.model.StreamBuildListener to field hudson.maven.MavenModuleSetBuild$PomParser.listener of type hudson.model.BuildListener in instance of hudson.maven.MavenModuleSetBuild$PomParser
java.lang.ClassCastException: cannot assign instance of hudson.model.StreamBuildListener to field hudson.maven.MavenModuleSetBuild$PomParser.listener of type hudson.model.BuildListener in instance of hudson.maven.MavenModuleSetBuild$PomParser
	at java.io.ObjectStreamClass$FieldReflector.setObjFieldValues(ObjectStreamClass.java:2056)
	at java.io.ObjectStreamClass.setObjFieldValues(ObjectStreamClass.java:1229)
	at java.io.ObjectInputStream.defaultReadFields(ObjectInputStream.java:1969)
	at java.io.ObjectInputStream.readSerialData(ObjectInputStream.java:1887)
	at java.io.ObjectInputStream.readOrdinaryObject(ObjectInputStream.java:1770)
	at java.io.ObjectInputStream.readObject0(ObjectInputStream.java:1346)
	at java.io.ObjectInputStream.defaultReadFields(ObjectInputStream.java:1963)
	at java.io.ObjectInputStream.readSerialData(ObjectInputStream.java:1887)
	at java.io.ObjectInputStream.readOrdinaryObject(ObjectInputStream.java:1770)
	at java.io.ObjectInputStream.readObject0(ObjectInputStream.java:1346)
	at java.io.ObjectInputStream.readObject(ObjectInputStream.java:368)
	at hudson.remoting.UserRequest.deserialize(UserRequest.java:178)
	at hudson.remoting.UserRequest.perform(UserRequest.java:98)
	at hudson.remoting.UserRequest.perform(UserRequest.java:48)
	at hudson.remoting.Request$2.run(Request.java:270)
	at java.util.concurrent.Executors$RunnableAdapter.call(Executors.java:471)
	at java.util.concurrent.FutureTask$Sync.innerRun(FutureTask.java:334)
	at java.util.concurrent.FutureTask.run(FutureTask.java:166)
	at java.util.concurrent.ThreadPoolExecutor.runWorker(ThreadPoolExecutor.java:1110)
	at java.util.concurrent.ThreadPoolExecutor$Worker.run(ThreadPoolExecutor.java:603)
	at java.lang.Thread.run(Thread.java:636)


---------------------------------------------------------------------
To unsubscribe, e-mail: notifications-unsubscribe@jakarta.apache.org
For additional commands, e-mail: notifications-help@jakarta.apache.org


Build failed in Jenkins: Cactus #778

Posted by Apache Hudson Server <hu...@hudson.apache.org>.
See <https://hudson.apache.org/hudson/job/Cactus/778/>

------------------------------------------
[...truncated 800 lines...]
[INFO] [resources:resources]
[WARNING] Using platform encoding (ANSI_X3.4-1968 actually) to copy filtered resources, i.e. build is platform dependent!
[INFO] Copying 1 resource
[INFO] Copying 3 resources
[INFO] [compiler:compile]
[INFO] Compiling 12 source files to <https://hudson.apache.org/hudson/job/Cactus/ws/Cactus/integration/ant/target/classes>
[INFO] [resources:testResources]
[WARNING] Using platform encoding (ANSI_X3.4-1968 actually) to copy filtered resources, i.e. build is platform dependent!
[INFO] skip non existing resourceDirectory <https://hudson.apache.org/hudson/job/Cactus/ws/Cactus/integration/ant/src/test/resources>
[INFO] Copying 3 resources
[INFO] [compiler:testCompile]
[INFO] Compiling 16 source files to <https://hudson.apache.org/hudson/job/Cactus/ws/Cactus/integration/ant/target/test-classes>
[INFO] [surefire:test]
[INFO] Surefire report directory: <https://hudson.apache.org/hudson/job/Cactus/ws/Cactus/integration/ant/target/surefire-reports>

-------------------------------------------------------
 T E S T S
-------------------------------------------------------
Running org.apache.cactus.integration.ant.deployment.TestJarArchive
Tests run: 5, Failures: 0, Errors: 0, Skipped: 0, Time elapsed: 0.091 sec
Running org.apache.cactus.integration.ant.TestCactusTask
Tests run: 7, Failures: 0, Errors: 0, Skipped: 0, Time elapsed: 0.463 sec
Running org.apache.cactus.integration.ant.deployment.TestAll
Tests run: 0, Failures: 0, Errors: 0, Skipped: 0, Time elapsed: 0.002 sec
Running org.apache.cactus.integration.ant.TestCactusTestTask
Tests run: 7, Failures: 0, Errors: 0, Skipped: 0, Time elapsed: 0.092 sec
Running org.apache.cactus.integration.ant.deployment.application.TestApplicationXmlVersion
Tests run: 8, Failures: 0, Errors: 0, Skipped: 0, Time elapsed: 0.028 sec
Running org.apache.cactus.integration.ant.deployment.TestEarParser
Tests run: 2, Failures: 0, Errors: 0, Skipped: 0, Time elapsed: 0.108 sec
Running org.apache.cactus.integration.ant.deployment.webapp.TestWebXml
Tests run: 54, Failures: 0, Errors: 0, Skipped: 0, Time elapsed: 0.201 sec
Running org.apache.cactus.integration.ant.TestAll
Tests run: 0, Failures: 0, Errors: 0, Skipped: 0, Time elapsed: 0.001 sec
Running org.apache.cactus.integration.ant.TestCactifyEarTask
Tests run: 3, Failures: 0, Errors: 0, Skipped: 0, Time elapsed: 0.649 sec
Running org.apache.cactus.integration.ant.deployment.webapp.TestWebXmlVersion
Tests run: 8, Failures: 0, Errors: 0, Skipped: 0, Time elapsed: 0.006 sec
Running org.apache.cactus.integration.ant.deployment.webapp.TestWarArchive
Tests run: 3, Failures: 0, Errors: 0, Skipped: 0, Time elapsed: 0.008 sec
Running org.apache.cactus.integration.ant.deployment.application.TestApplicationXml
Tests run: 7, Failures: 0, Errors: 0, Skipped: 0, Time elapsed: 0.015 sec
Running org.apache.cactus.integration.ant.TestRunServerTestsTask
Tests run: 6, Failures: 0, Errors: 0, Skipped: 0, Time elapsed: 0.538 sec
Running org.apache.cactus.integration.ant.TestCactifyWarTask
Tests run: 21, Failures: 0, Errors: 0, Skipped: 0, Time elapsed: 2.313 sec

Results :

Tests run: 131, Failures: 0, Errors: 0, Skipped: 0

[JENKINS] Recording test results
[INFO] [jar:jar]
[INFO] Building jar: <https://hudson.apache.org/hudson/job/Cactus/ws/Cactus/integration/ant/target/cactus.integration.ant-1.8.2-SNAPSHOT.jar>
[INFO] [rat:check {execution: default}]
[INFO] Preparing checkstyle:check
[JENKINS] Archiving <https://hudson.apache.org/hudson/job/Cactus/ws/Cactus/integration/ant/pom.xml> to /home/hudson/hudson/jobs/Cactus/modules/org.apache.cactus$cactus.integration.ant/builds/2011-03-25_00-02-27/archive/org.apache.cactus/cactus.integration.ant/1.8.2-SNAPSHOT/pom.xml
[JENKINS] Archiving <https://hudson.apache.org/hudson/job/Cactus/ws/Cactus/integration/ant/target/cactus.integration.ant-1.8.2-SNAPSHOT.jar> to /home/hudson/hudson/jobs/Cactus/modules/org.apache.cactus$cactus.integration.ant/builds/2011-03-25_00-02-27/archive/org.apache.cactus/cactus.integration.ant/1.8.2-SNAPSHOT/cactus.integration.ant-1.8.2-SNAPSHOT.jar
[INFO] [checkstyle:checkstyle]
[WARNING] File encoding has not been set, using platform encoding ANSI_X3.4-1968, i.e. build is platform dependent!
[INFO] Starting audit...
<https://hudson.apache.org/hudson/job/Cactus/ws/Cactus/integration/ant/src/main/java/org/apache/cactus/integration/ant/container/GenericContainer.java>:321:15: warning: Redundant 'final' modifier.
<https://hudson.apache.org/hudson/job/Cactus/ws/Cactus/integration/ant/src/main/java/org/apache/cactus/integration/ant/container/GenericContainer.java>:330:12: warning: Redundant 'final' modifier.
<https://hudson.apache.org/hudson/job/Cactus/ws/Cactus/integration/ant/src/main/java/org/apache/cactus/integration/ant/CactifyWarTask.java>:1: warning: Line does not match expected header line of '/* '.
<https://hudson.apache.org/hudson/job/Cactus/ws/Cactus/integration/ant/src/main/java/org/apache/cactus/integration/ant/CactifyWarTask.java>:74:20: warning: Name 'FILE_NAME' must match pattern '^[a-z][a-zA-Z0-9]*$'.
<https://hudson.apache.org/hudson/job/Cactus/ws/Cactus/integration/ant/src/main/java/org/apache/cactus/integration/ant/CactusTask.java>:95: warning: Comment matches to-do format 'TODO:'.
Audit done.

[INFO] [checkstyle:check {execution: default}]
[INFO] [install:install]
[INFO] Installing <https://hudson.apache.org/hudson/job/Cactus/ws/Cactus/integration/ant/target/cactus.integration.ant-1.8.2-SNAPSHOT.jar> to /home/hudson/.m2/repository/org/apache/cactus/cactus.integration.ant/1.8.2-SNAPSHOT/cactus.integration.ant-1.8.2-SNAPSHOT.jar
[INFO] ------------------------------------------------------------------------
[INFO] Building Cactus Maven 1 Plugin
[INFO]    task-segment: [clean, install]
[INFO] ------------------------------------------------------------------------
[INFO] [clean:clean]
[INFO] Deleting directory <https://hudson.apache.org/hudson/job/Cactus/ws/Cactus/integration/maven/target>
[INFO] [remote-resources:process {execution: default}]
[WARNING] Attempting to build MavenProject instance for Artifact (commons-jelly:commons-jelly:20030902.160215) of type: jar; constructing POM artifact instead.
[WARNING] Attempting to build MavenProject instance for Artifact (commons-discovery:commons-discovery:20030211.213356) of type: jar; constructing POM artifact instead.
[INFO] [resources:resources]
[WARNING] Using platform encoding (ANSI_X3.4-1968 actually) to copy filtered resources, i.e. build is platform dependent!
[INFO] skip non existing resourceDirectory <https://hudson.apache.org/hudson/job/Cactus/ws/Cactus/integration/maven/src/main/resources>
[INFO] Copying 3 resources
[INFO] [compiler:compile]
[INFO] Compiling 3 source files to <https://hudson.apache.org/hudson/job/Cactus/ws/Cactus/integration/maven/target/classes>
[INFO] [resources:testResources]
[WARNING] Using platform encoding (ANSI_X3.4-1968 actually) to copy filtered resources, i.e. build is platform dependent!
[INFO] skip non existing resourceDirectory <https://hudson.apache.org/hudson/job/Cactus/ws/Cactus/integration/maven/src/test/resources>
[INFO] Copying 3 resources
[INFO] [compiler:testCompile]
[INFO] No sources to compile
[INFO] [surefire:test]
[INFO] Surefire report directory: <https://hudson.apache.org/hudson/job/Cactus/ws/Cactus/integration/maven/target/surefire-reports>

-------------------------------------------------------
 T E S T S
-------------------------------------------------------
There are no tests to run.

Results :

Tests run: 0, Failures: 0, Errors: 0, Skipped: 0

[JENKINS] Recording test results
[INFO] snapshot org.apache.maven.shared:maven-model-converter:2.3-SNAPSHOT: checking for updates from apache.snapshots
Downloading: http://repository.apache.org/snapshots/org/apache/maven/shared/maven-model-converter/2.3-SNAPSHOT/maven-model-converter-2.3-20110324.071324-18.pom
3K downloaded
Downloading: http://repository.apache.org/snapshots/org/apache/maven/shared/maven-model-converter/2.3-SNAPSHOT/maven-model-converter-2.3-20110324.071324-18.jar
72K downloaded
[INFO] [one:maven-one-plugin]
[INFO] Building jar: <https://hudson.apache.org/hudson/job/Cactus/ws/Cactus/integration/maven/target/cactus.maven1.plugin-1.8.2-SNAPSHOT.jar>
[INFO] [rat:check {execution: default}]
[INFO] Preparing checkstyle:check
[JENKINS] Archiving <https://hudson.apache.org/hudson/job/Cactus/ws/Cactus/integration/maven/pom.xml> to /home/hudson/hudson/jobs/Cactus/modules/org.apache.cactus$cactus.maven1.plugin/builds/2011-03-25_00-02-27/archive/org.apache.cactus/cactus.maven1.plugin/1.8.2-SNAPSHOT/pom.xml
[JENKINS] Archiving <https://hudson.apache.org/hudson/job/Cactus/ws/Cactus/integration/maven/target/cactus.maven1.plugin-1.8.2-SNAPSHOT.jar> to /home/hudson/hudson/jobs/Cactus/modules/org.apache.cactus$cactus.maven1.plugin/builds/2011-03-25_00-02-27/archive/org.apache.cactus/cactus.maven1.plugin/1.8.2-SNAPSHOT/cactus.maven1.plugin-1.8.2-SNAPSHOT.jar
[INFO] [checkstyle:checkstyle]
[WARNING] File encoding has not been set, using platform encoding ANSI_X3.4-1968, i.e. build is platform dependent!
[INFO] Starting audit...
Audit done.

[INFO] [checkstyle:check {execution: default}]
[INFO] [install:install]
[INFO] Installing <https://hudson.apache.org/hudson/job/Cactus/ws/Cactus/integration/maven/target/cactus.maven1.plugin-1.8.2-SNAPSHOT.jar> to /home/hudson/.m2/repository/org/apache/cactus/cactus.maven1.plugin/1.8.2-SNAPSHOT/cactus.maven1.plugin-1.8.2-SNAPSHOT.jar
[INFO] [one:install-maven-one-repository {execution: default}]
[INFO] Installing <https://hudson.apache.org/hudson/job/Cactus/ws/Cactus/integration/maven/target/cactus.maven1.plugin-1.8.2-SNAPSHOT.jar> to /home/hudson/.maven/repository/org.apache.cactus/plugins/cactus.maven1.plugin-1.8.2-SNAPSHOT.jar
[INFO] ------------------------------------------------------------------------
[INFO] Building Cactus Integration Maven2 - Plugin Project
[INFO]    task-segment: [clean, install]
[INFO] ------------------------------------------------------------------------
[INFO] [clean:clean]
[INFO] Deleting directory <https://hudson.apache.org/hudson/job/Cactus/ws/Cactus/integration/maven2/target>
[INFO] [plugin:descriptor]
[WARNING] 

Goal prefix is specified as: 'cactus'. Maven currently expects it to be 'cactus.integration.2'.

[INFO] Using 2 extractors.
[INFO] Applying extractor for language: java
[INFO] Extractor for language: java found 2 mojo descriptors.
[INFO] Applying extractor for language: bsh
[INFO] Extractor for language: bsh found 0 mojo descriptors.
[INFO] [remote-resources:process {execution: default}]
[INFO] [resources:resources]
[WARNING] Using platform encoding (ANSI_X3.4-1968 actually) to copy filtered resources, i.e. build is platform dependent!
[INFO] skip non existing resourceDirectory <https://hudson.apache.org/hudson/job/Cactus/ws/Cactus/integration/maven2/src/main/resources>
[INFO] Copying 3 resources
[INFO] [compiler:compile]
[INFO] Compiling 7 source files to <https://hudson.apache.org/hudson/job/Cactus/ws/Cactus/integration/maven2/target/classes>
[INFO] [resources:testResources]
[WARNING] Using platform encoding (ANSI_X3.4-1968 actually) to copy filtered resources, i.e. build is platform dependent!
[INFO] Copying 10 resources
[INFO] Copying 3 resources
[INFO] [compiler:testCompile]
[INFO] Compiling 4 source files to <https://hudson.apache.org/hudson/job/Cactus/ws/Cactus/integration/maven2/target/test-classes>
[INFO] [surefire:test]
[INFO] Surefire report directory: <https://hudson.apache.org/hudson/job/Cactus/ws/Cactus/integration/maven2/target/surefire-reports>

-------------------------------------------------------
 T E S T S
-------------------------------------------------------
Running org.apache.cactus.integration.maven2.test.TestCactifyEarMojo
Tests run: 1, Failures: 0, Errors: 0, Skipped: 0, Time elapsed: 0.422 sec
Running org.apache.cactus.integration.maven2.test.TestCactifyWarMojo
[INFO] Analyzing war: <https://hudson.apache.org/hudson/job/Cactus/ws/Cactus/integration/maven2>:/null
Tests run: 4, Failures: 0, Errors: 0, Skipped: 0, Time elapsed: 0.66 sec

Results :

Tests run: 5, Failures: 0, Errors: 0, Skipped: 0

[JENKINS] Recording test results
[INFO] [jar:jar]
[INFO] Building jar: <https://hudson.apache.org/hudson/job/Cactus/ws/Cactus/integration/maven2/target/cactus.integration.maven2-1.8.2-SNAPSHOT.jar>
[INFO] [plugin:addPluginArtifactMetadata]
[INFO] [rat:check {execution: default}]
[INFO] Preparing checkstyle:check
[JENKINS] Archiving <https://hudson.apache.org/hudson/job/Cactus/ws/Cactus/integration/maven2/pom.xml> to /home/hudson/hudson/jobs/Cactus/modules/org.apache.cactus$cactus.integration.maven2/builds/2011-03-25_00-02-27/archive/org.apache.cactus/cactus.integration.maven2/1.8.2-SNAPSHOT/pom.xml
[JENKINS] Archiving <https://hudson.apache.org/hudson/job/Cactus/ws/Cactus/integration/maven2/target/cactus.integration.maven2-1.8.2-SNAPSHOT.jar> to /home/hudson/hudson/jobs/Cactus/modules/org.apache.cactus$cactus.integration.maven2/builds/2011-03-25_00-02-27/archive/org.apache.cactus/cactus.integration.maven2/1.8.2-SNAPSHOT/cactus.integration.maven2-1.8.2-SNAPSHOT.jar
[INFO] [checkstyle:checkstyle]
[WARNING] File encoding has not been set, using platform encoding ANSI_X3.4-1968, i.e. build is platform dependent!
[INFO] Starting audit...
<https://hudson.apache.org/hudson/job/Cactus/ws/Cactus/integration/maven2/src/main/java/org/apache/cactus/maven2/mojos/CactifyWarMojo.java>:80:20: warning: Name 'FILE_NAME' must match pattern '^[a-z][a-zA-Z0-9]*$'.
<https://hudson.apache.org/hudson/job/Cactus/ws/Cactus/integration/maven2/src/main/java/org/apache/cactus/maven2/mojos/CactifyWarMojo.java>:259:5: warning: Method length is 169 lines (max allowed is 150).
Audit done.

[INFO] [checkstyle:check {execution: default}]
[INFO] [install:install]
[INFO] Installing <https://hudson.apache.org/hudson/job/Cactus/ws/Cactus/integration/maven2/target/cactus.integration.maven2-1.8.2-SNAPSHOT.jar> to /home/hudson/.m2/repository/org/apache/cactus/cactus.integration.maven2/1.8.2-SNAPSHOT/cactus.integration.maven2-1.8.2-SNAPSHOT.jar
[INFO] [plugin:updateRegistry]
[INFO] ------------------------------------------------------------------------
[INFO] Building Cactus Eclipse Integration
[INFO]    task-segment: [clean, install]
[INFO] ------------------------------------------------------------------------
[INFO] [clean:clean]
[INFO] Deleting directory <https://hudson.apache.org/hudson/job/Cactus/ws/Cactus/integration/eclipse/target>
[INFO] [remote-resources:process {execution: default}]
[INFO] [site:attach-descriptor]
[INFO] [rat:check {execution: default}]
[INFO] Preparing checkstyle:check
[JENKINS] Archiving <https://hudson.apache.org/hudson/job/Cactus/ws/Cactus/integration/eclipse/pom.xml> to /home/hudson/hudson/jobs/Cactus/modules/org.apache.cactus$cactus.integration.eclipse/builds/2011-03-25_00-02-27/archive/org.apache.cactus/cactus.integration.eclipse/1.8.2-SNAPSHOT/pom.xml
[INFO] [checkstyle:checkstyle]
[INFO] Source directory does not exist - skipping report.
[INFO] [checkstyle:check {execution: default}]
[INFO] Unable to perform checkstyle:check, unable to find checkstyle:checkstyle outputFile.
[INFO] [install:install]
[INFO] Installing <https://hudson.apache.org/hudson/job/Cactus/ws/Cactus/integration/eclipse/pom.xml> to /home/hudson/.m2/repository/org/apache/cactus/cactus.integration.eclipse/1.8.2-SNAPSHOT/cactus.integration.eclipse-1.8.2-SNAPSHOT.pom
[INFO] ------------------------------------------------------------------------
[INFO] Building Cactus Eclipse Integration - Webapp
[INFO]    task-segment: [clean, install]
[INFO] ------------------------------------------------------------------------
[INFO] [clean:clean]
[INFO] artifact org.eclipse.jdt:ui: checking for updates from central
[INFO] artifact org.eclipse:osgi: checking for updates from central
[INFO] artifact org.eclipse.equinox:common: checking for updates from central
[INFO] artifact org.eclipse.core:jobs: checking for updates from central
[INFO] artifact org.eclipse.equinox:registry: checking for updates from central
[INFO] artifact org.eclipse.equinox:preferences: checking for updates from central
[INFO] artifact org.eclipse.core:contenttype: checking for updates from central
[INFO] artifact org.eclipse.equinox:app: checking for updates from central
[JENKINS] Archiving <https://hudson.apache.org/hudson/job/Cactus/ws/Cactus/integration/eclipse/org.apache.cactus.eclipse.webapp/pom.xml> to /home/hudson/hudson/jobs/Cactus/modules/org.apache.cactus$org.apache.cactus.eclipse.webapp/builds/2011-03-25_00-02-27/archive/org.apache.cactus/org.apache.cactus.eclipse.webapp/1.8.2-SNAPSHOT/pom.xml
[INFO] ------------------------------------------------------------------------
[ERROR] BUILD ERROR
[INFO] ------------------------------------------------------------------------
[INFO] Failed to resolve artifact.

Couldn't find a version in [1.0.0-v20070423, 1.0.0-v20070606] to match range [1.0.0,2.0.0)
  org.eclipse.equinox:app:jar:null

from the specified remote repositories:
  central (http://repo1.maven.org/maven2),
  maven.eclipse.plugin.repository (http://repo1.maven.org/eclipse/)

Path to dependency: 
	1) org.apache.cactus:org.apache.cactus.eclipse.webapp:jar:1.8.2-SNAPSHOT
	2) org.eclipse.jdt:ui:jar:3.3.0-v20070607-0010
	3) org.eclipse:ui:jar:3.3.0-I20070614-0800
	4) org.eclipse.core:runtime:jar:3.3.100-v20070530



[INFO] ------------------------------------------------------------------------
[INFO] For more information, run Maven with the -e switch
[INFO] ------------------------------------------------------------------------
[INFO] Total time: 2 minutes 13 seconds
[INFO] Finished at: Thu Mar 24 16:05:06 GMT-08:00 2011
[INFO] Final Memory: 57M/175M
[INFO] ------------------------------------------------------------------------
channel stopped


---------------------------------------------------------------------
To unsubscribe, e-mail: notifications-unsubscribe@jakarta.apache.org
For additional commands, e-mail: notifications-help@jakarta.apache.org


Build failed in Jenkins: Cactus #777

Posted by Apache Hudson Server <hu...@hudson.apache.org>.
See <https://hudson.apache.org/hudson/job/Cactus/777/>

------------------------------------------
Started by timer
Building remotely on ubuntu1
Updating http://svn.apache.org/repos/asf/jakarta/cactus/trunk
At revision 1084810
no change for http://svn.apache.org/repos/asf/jakarta/cactus/trunk since the previous build
Found mavenVersion 2.0.10 from file jar:file:/home/hudson/tools/maven/latest2/lib/maven-2.0.10-uber.jar!/META-INF/maven/org.apache.maven/maven-core/pom.properties
Parsing POMs
ERROR: Processing failed due to a bug in the code. Please report this to jenkins-users@googlegroups.com
java.lang.ClassCastException: cannot assign instance of hudson.model.StreamBuildListener to field hudson.maven.MavenModuleSetBuild$PomParser.listener of type hudson.model.BuildListener in instance of hudson.maven.MavenModuleSetBuild$PomParser
	at java.io.ObjectStreamClass$FieldReflector.setObjFieldValues(ObjectStreamClass.java:2056)
	at java.io.ObjectStreamClass.setObjFieldValues(ObjectStreamClass.java:1229)
	at java.io.ObjectInputStream.defaultReadFields(ObjectInputStream.java:1969)
	at java.io.ObjectInputStream.readSerialData(ObjectInputStream.java:1887)
	at java.io.ObjectInputStream.readOrdinaryObject(ObjectInputStream.java:1770)
	at java.io.ObjectInputStream.readObject0(ObjectInputStream.java:1346)
	at java.io.ObjectInputStream.defaultReadFields(ObjectInputStream.java:1963)
	at java.io.ObjectInputStream.readSerialData(ObjectInputStream.java:1887)
	at java.io.ObjectInputStream.readOrdinaryObject(ObjectInputStream.java:1770)
	at java.io.ObjectInputStream.readObject0(ObjectInputStream.java:1346)
	at java.io.ObjectInputStream.readObject(ObjectInputStream.java:368)
	at hudson.remoting.UserRequest.deserialize(UserRequest.java:178)
	at hudson.remoting.UserRequest.perform(UserRequest.java:98)
	at hudson.remoting.UserRequest.perform(UserRequest.java:48)
	at hudson.remoting.Request$2.run(Request.java:270)
	at java.util.concurrent.Executors$RunnableAdapter.call(Executors.java:471)
	at java.util.concurrent.FutureTask$Sync.innerRun(FutureTask.java:334)
	at java.util.concurrent.FutureTask.run(FutureTask.java:166)
	at java.util.concurrent.ThreadPoolExecutor.runWorker(ThreadPoolExecutor.java:1110)
	at java.util.concurrent.ThreadPoolExecutor$Worker.run(ThreadPoolExecutor.java:603)
	at java.lang.Thread.run(Thread.java:636)
project=hudson.maven.MavenModuleSet@6f56e454[Cactus]
project.getModules()=[hudson.maven.MavenModule@2fb1e76a[Cactus/org.apache.cactus:cactus][Cactus/org.apache.cactus:cactus][relativePath:], hudson.maven.MavenModule@1def8b6c[Cactus/org.apache.cactus:cactus-site][Cactus/org.apache.cactus:cactus-site][relativePath:cactus-site], hudson.maven.MavenModule@7b3640f1[Cactus/org.apache.cactus:cactus.build.tools][Cactus/org.apache.cactus:cactus.build.tools][relativePath:build-tools], hudson.maven.MavenModule@68d6f200[Cactus/org.apache.cactus:cactus.core.framework][Cactus/org.apache.cactus:cactus.core.framework][relativePath:framework], hudson.maven.MavenModule@5735c56b[Cactus/org.apache.cactus:cactus.core.framework.javaEE.12-13-14][Cactus/org.apache.cactus:cactus.core.framework.javaEE.12-13-14][relativePath:framework/framework-12-13-14], hudson.maven.MavenModule@524321b8[Cactus/org.apache.cactus:cactus.core.framework.javaEE.13-14][Cactus/org.apache.cactus:cactus.core.framework.javaEE.13-14][relativePath:framework/framework-13-14], hudson.maven.MavenModule@5aa76583[Cactus/org.apache.cactus:cactus.core.framework.uberjar.javaEE.12][Cactus/org.apache.cactus:cactus.core.framework.uberjar.javaEE.12][relativePath:framework/framework-uberjars/javaEE-12-uberjar], hudson.maven.MavenModule@1171a7e4[Cactus/org.apache.cactus:cactus.core.framework.uberjar.javaEE.13][Cactus/org.apache.cactus:cactus.core.framework.uberjar.javaEE.13][relativePath:framework/framework-uberjars/javaEE-13-uberjar], hudson.maven.MavenModule@8ff99df[Cactus/org.apache.cactus:cactus.core.framework.uberjar.javaEE.14][Cactus/org.apache.cactus:cactus.core.framework.uberjar.javaEE.14][relativePath:framework/framework-uberjars/javaEE-14-uberjar], hudson.maven.MavenModule@62ce9d88[Cactus/org.apache.cactus:cactus.core.framework.uberjar.javaEE.15][Cactus/org.apache.cactus:cactus.core.framework.uberjar.javaEE.15][relativePath:framework/framework-uberjars/javaEE-15-uberjar], hudson.maven.MavenModule@1efc48ce[Cactus/org.apache.cactus:cactus.core.framework.uberjars][Cactus/org.apache.cactus:cactus.core.framework.uberjars][relativePath:framework/framework-uberjars], hudson.maven.MavenModule@5713e8d2[Cactus/org.apache.cactus:cactus.core.framework.wrapper.javaEE.12][Cactus/org.apache.cactus:cactus.core.framework.wrapper.javaEE.12][relativePath:framework/framework-wrappers/wrapper-javaEE-12], hudson.maven.MavenModule@2cb09a49[Cactus/org.apache.cactus:cactus.core.framework.wrapper.javaEE.13][Cactus/org.apache.cactus:cactus.core.framework.wrapper.javaEE.13][relativePath:framework/framework-wrappers/wrapper-javaEE-13], hudson.maven.MavenModule@5c536234[Cactus/org.apache.cactus:cactus.core.framework.wrapper.javaEE.14][Cactus/org.apache.cactus:cactus.core.framework.wrapper.javaEE.14][relativePath:framework/framework-wrappers/wrapper-javaEE-14], hudson.maven.MavenModule@348d2085[Cactus/org.apache.cactus:cactus.core.framework.wrappers][Cactus/org.apache.cactus:cactus.core.framework.wrappers][relativePath:framework/framework-wrappers], hudson.maven.MavenModule@2022d1f4[Cactus/org.apache.cactus:cactus.integration][Cactus/org.apache.cactus:cactus.integration][relativePath:integration], hudson.maven.MavenModule@51f205eb[Cactus/org.apache.cactus:cactus.integration.ant][Cactus/org.apache.cactus:cactus.integration.ant][relativePath:integration/ant], hudson.maven.MavenModule@6f4c198a[Cactus/org.apache.cactus:cactus.integration.eclipse][Cactus/org.apache.cactus:cactus.integration.eclipse][relativePath:integration/eclipse], hudson.maven.MavenModule@157090d9[Cactus/org.apache.cactus:cactus.integration.maven2][Cactus/org.apache.cactus:cactus.integration.maven2][relativePath:integration/maven2], hudson.maven.MavenModule@778adf2f[Cactus/org.apache.cactus:cactus.integration.shared.api][Cactus/org.apache.cactus:cactus.integration.shared.api][relativePath:integration/shared-api], hudson.maven.MavenModule@74d0d91c[Cactus/org.apache.cactus:cactus.maven.skin][Cactus/org.apache.cactus:cactus.maven.skin][relativePath:cactus-maven-skin], hudson.maven.MavenModule@632c13a2[Cactus/org.apache.cactus:cactus.maven1.plugin][Cactus/org.apache.cactus:cactus.maven1.plugin][relativePath:integration/maven], hudson.maven.MavenModule@76f79c23[Cactus/org.apache.cactus:cactus.samples][Cactus/org.apache.cactus:cactus.samples][relativePath:samples], hudson.maven.MavenModule@7a844674[Cactus/org.apache.cactus:org.apache.cactus.eclipse.runner][Cactus/org.apache.cactus:org.apache.cactus.eclipse.runner][relativePath:integration/eclipse/org.apache.cactus.eclipse.runner], hudson.maven.MavenModule@2099e843[Cactus/org.apache.cactus:org.apache.cactus.eclipse.webapp][Cactus/org.apache.cactus:org.apache.cactus.eclipse.webapp][relativePath:integration/eclipse/org.apache.cactus.eclipse.webapp]]
project.getRootModule()=hudson.maven.MavenModule@2fb1e76a[Cactus/org.apache.cactus:cactus][Cactus/org.apache.cactus:cactus][relativePath:]
FATAL: cannot assign instance of hudson.model.StreamBuildListener to field hudson.maven.MavenModuleSetBuild$PomParser.listener of type hudson.model.BuildListener in instance of hudson.maven.MavenModuleSetBuild$PomParser
java.lang.ClassCastException: cannot assign instance of hudson.model.StreamBuildListener to field hudson.maven.MavenModuleSetBuild$PomParser.listener of type hudson.model.BuildListener in instance of hudson.maven.MavenModuleSetBuild$PomParser
	at java.io.ObjectStreamClass$FieldReflector.setObjFieldValues(ObjectStreamClass.java:2056)
	at java.io.ObjectStreamClass.setObjFieldValues(ObjectStreamClass.java:1229)
	at java.io.ObjectInputStream.defaultReadFields(ObjectInputStream.java:1969)
	at java.io.ObjectInputStream.readSerialData(ObjectInputStream.java:1887)
	at java.io.ObjectInputStream.readOrdinaryObject(ObjectInputStream.java:1770)
	at java.io.ObjectInputStream.readObject0(ObjectInputStream.java:1346)
	at java.io.ObjectInputStream.defaultReadFields(ObjectInputStream.java:1963)
	at java.io.ObjectInputStream.readSerialData(ObjectInputStream.java:1887)
	at java.io.ObjectInputStream.readOrdinaryObject(ObjectInputStream.java:1770)
	at java.io.ObjectInputStream.readObject0(ObjectInputStream.java:1346)
	at java.io.ObjectInputStream.readObject(ObjectInputStream.java:368)
	at hudson.remoting.UserRequest.deserialize(UserRequest.java:178)
	at hudson.remoting.UserRequest.perform(UserRequest.java:98)
	at hudson.remoting.UserRequest.perform(UserRequest.java:48)
	at hudson.remoting.Request$2.run(Request.java:270)
	at java.util.concurrent.Executors$RunnableAdapter.call(Executors.java:471)
	at java.util.concurrent.FutureTask$Sync.innerRun(FutureTask.java:334)
	at java.util.concurrent.FutureTask.run(FutureTask.java:166)
	at java.util.concurrent.ThreadPoolExecutor.runWorker(ThreadPoolExecutor.java:1110)
	at java.util.concurrent.ThreadPoolExecutor$Worker.run(ThreadPoolExecutor.java:603)
	at java.lang.Thread.run(Thread.java:636)


---------------------------------------------------------------------
To unsubscribe, e-mail: notifications-unsubscribe@jakarta.apache.org
For additional commands, e-mail: notifications-help@jakarta.apache.org


Build failed in Jenkins: Cactus #776

Posted by Apache Hudson Server <hu...@hudson.apache.org>.
See <https://hudson.apache.org/hudson/job/Cactus/776/>

------------------------------------------
[...truncated 796 lines...]
[INFO] ------------------------------------------------------------------------
[INFO] [clean:clean]
[INFO] Deleting directory <https://hudson.apache.org/hudson/job/Cactus/ws/Cactus/integration/ant/target>
[INFO] [remote-resources:process {execution: default}]
[INFO] [resources:resources]
[WARNING] Using platform encoding (ANSI_X3.4-1968 actually) to copy filtered resources, i.e. build is platform dependent!
[INFO] Copying 1 resource
[INFO] Copying 3 resources
[INFO] [compiler:compile]
[INFO] Compiling 12 source files to <https://hudson.apache.org/hudson/job/Cactus/ws/Cactus/integration/ant/target/classes>
[INFO] [resources:testResources]
[WARNING] Using platform encoding (ANSI_X3.4-1968 actually) to copy filtered resources, i.e. build is platform dependent!
[INFO] skip non existing resourceDirectory <https://hudson.apache.org/hudson/job/Cactus/ws/Cactus/integration/ant/src/test/resources>
[INFO] Copying 3 resources
[INFO] [compiler:testCompile]
[INFO] Compiling 16 source files to <https://hudson.apache.org/hudson/job/Cactus/ws/Cactus/integration/ant/target/test-classes>
[INFO] [surefire:test]
[INFO] Surefire report directory: <https://hudson.apache.org/hudson/job/Cactus/ws/Cactus/integration/ant/target/surefire-reports>

-------------------------------------------------------
 T E S T S
-------------------------------------------------------
Running org.apache.cactus.integration.ant.deployment.TestJarArchive
Tests run: 5, Failures: 0, Errors: 0, Skipped: 0, Time elapsed: 0.089 sec
Running org.apache.cactus.integration.ant.TestCactusTask
Tests run: 7, Failures: 0, Errors: 0, Skipped: 0, Time elapsed: 0.46 sec
Running org.apache.cactus.integration.ant.deployment.TestAll
Tests run: 0, Failures: 0, Errors: 0, Skipped: 0, Time elapsed: 0.004 sec
Running org.apache.cactus.integration.ant.TestCactusTestTask
Tests run: 7, Failures: 0, Errors: 0, Skipped: 0, Time elapsed: 0.108 sec
Running org.apache.cactus.integration.ant.deployment.application.TestApplicationXmlVersion
Tests run: 8, Failures: 0, Errors: 0, Skipped: 0, Time elapsed: 0.03 sec
Running org.apache.cactus.integration.ant.deployment.TestEarParser
Tests run: 2, Failures: 0, Errors: 0, Skipped: 0, Time elapsed: 0.116 sec
Running org.apache.cactus.integration.ant.deployment.webapp.TestWebXml
Tests run: 54, Failures: 0, Errors: 0, Skipped: 0, Time elapsed: 0.233 sec
Running org.apache.cactus.integration.ant.TestAll
Tests run: 0, Failures: 0, Errors: 0, Skipped: 0, Time elapsed: 0.002 sec
Running org.apache.cactus.integration.ant.TestCactifyEarTask
Tests run: 3, Failures: 0, Errors: 0, Skipped: 0, Time elapsed: 0.684 sec
Running org.apache.cactus.integration.ant.deployment.webapp.TestWebXmlVersion
Tests run: 8, Failures: 0, Errors: 0, Skipped: 0, Time elapsed: 0.007 sec
Running org.apache.cactus.integration.ant.deployment.webapp.TestWarArchive
Tests run: 3, Failures: 0, Errors: 0, Skipped: 0, Time elapsed: 0.008 sec
Running org.apache.cactus.integration.ant.deployment.application.TestApplicationXml
Tests run: 7, Failures: 0, Errors: 0, Skipped: 0, Time elapsed: 0.017 sec
Running org.apache.cactus.integration.ant.TestRunServerTestsTask
Tests run: 6, Failures: 0, Errors: 0, Skipped: 0, Time elapsed: 0.542 sec
Running org.apache.cactus.integration.ant.TestCactifyWarTask
Tests run: 21, Failures: 0, Errors: 0, Skipped: 0, Time elapsed: 2.362 sec

Results :

Tests run: 131, Failures: 0, Errors: 0, Skipped: 0

[JENKINS] Recording test results
[INFO] [jar:jar]
[INFO] Building jar: <https://hudson.apache.org/hudson/job/Cactus/ws/Cactus/integration/ant/target/cactus.integration.ant-1.8.2-SNAPSHOT.jar>
[INFO] [rat:check {execution: default}]
[INFO] Preparing checkstyle:check
[JENKINS] Archiving <https://hudson.apache.org/hudson/job/Cactus/ws/Cactus/integration/ant/pom.xml> to /home/hudson/hudson/jobs/Cactus/modules/org.apache.cactus$cactus.integration.ant/builds/2011-03-23_00-04-10/archive/org.apache.cactus/cactus.integration.ant/1.8.2-SNAPSHOT/pom.xml
[JENKINS] Archiving <https://hudson.apache.org/hudson/job/Cactus/ws/Cactus/integration/ant/target/cactus.integration.ant-1.8.2-SNAPSHOT.jar> to /home/hudson/hudson/jobs/Cactus/modules/org.apache.cactus$cactus.integration.ant/builds/2011-03-23_00-04-10/archive/org.apache.cactus/cactus.integration.ant/1.8.2-SNAPSHOT/cactus.integration.ant-1.8.2-SNAPSHOT.jar
[INFO] [checkstyle:checkstyle]
[WARNING] File encoding has not been set, using platform encoding ANSI_X3.4-1968, i.e. build is platform dependent!
[INFO] Starting audit...
<https://hudson.apache.org/hudson/job/Cactus/ws/Cactus/integration/ant/src/main/java/org/apache/cactus/integration/ant/container/GenericContainer.java>:321:15: warning: Redundant 'final' modifier.
<https://hudson.apache.org/hudson/job/Cactus/ws/Cactus/integration/ant/src/main/java/org/apache/cactus/integration/ant/container/GenericContainer.java>:330:12: warning: Redundant 'final' modifier.
<https://hudson.apache.org/hudson/job/Cactus/ws/Cactus/integration/ant/src/main/java/org/apache/cactus/integration/ant/CactifyWarTask.java>:1: warning: Line does not match expected header line of '/* '.
<https://hudson.apache.org/hudson/job/Cactus/ws/Cactus/integration/ant/src/main/java/org/apache/cactus/integration/ant/CactifyWarTask.java>:74:20: warning: Name 'FILE_NAME' must match pattern '^[a-z][a-zA-Z0-9]*$'.
<https://hudson.apache.org/hudson/job/Cactus/ws/Cactus/integration/ant/src/main/java/org/apache/cactus/integration/ant/CactusTask.java>:95: warning: Comment matches to-do format 'TODO:'.
Audit done.

[INFO] [checkstyle:check {execution: default}]
[INFO] [install:install]
[INFO] Installing <https://hudson.apache.org/hudson/job/Cactus/ws/Cactus/integration/ant/target/cactus.integration.ant-1.8.2-SNAPSHOT.jar> to /home/hudson/.m2/repository/org/apache/cactus/cactus.integration.ant/1.8.2-SNAPSHOT/cactus.integration.ant-1.8.2-SNAPSHOT.jar
[INFO] ------------------------------------------------------------------------
[INFO] Building Cactus Maven 1 Plugin
[INFO]    task-segment: [clean, install]
[INFO] ------------------------------------------------------------------------
[INFO] [clean:clean]
[INFO] Deleting directory <https://hudson.apache.org/hudson/job/Cactus/ws/Cactus/integration/maven/target>
[INFO] [remote-resources:process {execution: default}]
[WARNING] Attempting to build MavenProject instance for Artifact (commons-jelly:commons-jelly:20030902.160215) of type: jar; constructing POM artifact instead.
[WARNING] Attempting to build MavenProject instance for Artifact (commons-discovery:commons-discovery:20030211.213356) of type: jar; constructing POM artifact instead.
[INFO] [resources:resources]
[WARNING] Using platform encoding (ANSI_X3.4-1968 actually) to copy filtered resources, i.e. build is platform dependent!
[INFO] skip non existing resourceDirectory <https://hudson.apache.org/hudson/job/Cactus/ws/Cactus/integration/maven/src/main/resources>
[INFO] Copying 3 resources
[INFO] [compiler:compile]
[INFO] Compiling 3 source files to <https://hudson.apache.org/hudson/job/Cactus/ws/Cactus/integration/maven/target/classes>
[INFO] [resources:testResources]
[WARNING] Using platform encoding (ANSI_X3.4-1968 actually) to copy filtered resources, i.e. build is platform dependent!
[INFO] skip non existing resourceDirectory <https://hudson.apache.org/hudson/job/Cactus/ws/Cactus/integration/maven/src/test/resources>
[INFO] Copying 3 resources
[INFO] [compiler:testCompile]
[INFO] No sources to compile
[INFO] [surefire:test]
[INFO] Surefire report directory: <https://hudson.apache.org/hudson/job/Cactus/ws/Cactus/integration/maven/target/surefire-reports>

-------------------------------------------------------
 T E S T S
-------------------------------------------------------
There are no tests to run.

Results :

Tests run: 0, Failures: 0, Errors: 0, Skipped: 0

[JENKINS] Recording test results
[INFO] snapshot org.apache.maven.shared:maven-model-converter:2.3-SNAPSHOT: checking for updates from apache.snapshots
[INFO] [one:maven-one-plugin]
[INFO] Building jar: <https://hudson.apache.org/hudson/job/Cactus/ws/Cactus/integration/maven/target/cactus.maven1.plugin-1.8.2-SNAPSHOT.jar>
[INFO] [rat:check {execution: default}]
[INFO] Preparing checkstyle:check
[JENKINS] Archiving <https://hudson.apache.org/hudson/job/Cactus/ws/Cactus/integration/maven/pom.xml> to /home/hudson/hudson/jobs/Cactus/modules/org.apache.cactus$cactus.maven1.plugin/builds/2011-03-23_00-04-10/archive/org.apache.cactus/cactus.maven1.plugin/1.8.2-SNAPSHOT/pom.xml
[JENKINS] Archiving <https://hudson.apache.org/hudson/job/Cactus/ws/Cactus/integration/maven/target/cactus.maven1.plugin-1.8.2-SNAPSHOT.jar> to /home/hudson/hudson/jobs/Cactus/modules/org.apache.cactus$cactus.maven1.plugin/builds/2011-03-23_00-04-10/archive/org.apache.cactus/cactus.maven1.plugin/1.8.2-SNAPSHOT/cactus.maven1.plugin-1.8.2-SNAPSHOT.jar
[INFO] [checkstyle:checkstyle]
[WARNING] File encoding has not been set, using platform encoding ANSI_X3.4-1968, i.e. build is platform dependent!
[INFO] Starting audit...
Audit done.

[INFO] [checkstyle:check {execution: default}]
[INFO] [install:install]
[INFO] Installing <https://hudson.apache.org/hudson/job/Cactus/ws/Cactus/integration/maven/target/cactus.maven1.plugin-1.8.2-SNAPSHOT.jar> to /home/hudson/.m2/repository/org/apache/cactus/cactus.maven1.plugin/1.8.2-SNAPSHOT/cactus.maven1.plugin-1.8.2-SNAPSHOT.jar
[INFO] [one:install-maven-one-repository {execution: default}]
[INFO] Installing <https://hudson.apache.org/hudson/job/Cactus/ws/Cactus/integration/maven/target/cactus.maven1.plugin-1.8.2-SNAPSHOT.jar> to /home/hudson/.maven/repository/org.apache.cactus/plugins/cactus.maven1.plugin-1.8.2-SNAPSHOT.jar
[INFO] ------------------------------------------------------------------------
[INFO] Building Cactus Integration Maven2 - Plugin Project
[INFO]    task-segment: [clean, install]
[INFO] ------------------------------------------------------------------------
[INFO] [clean:clean]
[INFO] Deleting directory <https://hudson.apache.org/hudson/job/Cactus/ws/Cactus/integration/maven2/target>
[INFO] [plugin:descriptor]
[WARNING] 

Goal prefix is specified as: 'cactus'. Maven currently expects it to be 'cactus.integration.2'.

[INFO] Using 2 extractors.
[INFO] Applying extractor for language: java
[INFO] Extractor for language: java found 2 mojo descriptors.
[INFO] Applying extractor for language: bsh
[INFO] Extractor for language: bsh found 0 mojo descriptors.
[INFO] [remote-resources:process {execution: default}]
[INFO] [resources:resources]
[WARNING] Using platform encoding (ANSI_X3.4-1968 actually) to copy filtered resources, i.e. build is platform dependent!
[INFO] skip non existing resourceDirectory <https://hudson.apache.org/hudson/job/Cactus/ws/Cactus/integration/maven2/src/main/resources>
[INFO] Copying 3 resources
[INFO] [compiler:compile]
[INFO] Compiling 7 source files to <https://hudson.apache.org/hudson/job/Cactus/ws/Cactus/integration/maven2/target/classes>
[INFO] [resources:testResources]
[WARNING] Using platform encoding (ANSI_X3.4-1968 actually) to copy filtered resources, i.e. build is platform dependent!
[INFO] Copying 10 resources
[INFO] Copying 3 resources
[INFO] [compiler:testCompile]
[INFO] Compiling 4 source files to <https://hudson.apache.org/hudson/job/Cactus/ws/Cactus/integration/maven2/target/test-classes>
[INFO] [surefire:test]
[INFO] Surefire report directory: <https://hudson.apache.org/hudson/job/Cactus/ws/Cactus/integration/maven2/target/surefire-reports>

-------------------------------------------------------
 T E S T S
-------------------------------------------------------
Running org.apache.cactus.integration.maven2.test.TestCactifyEarMojo
Tests run: 1, Failures: 0, Errors: 0, Skipped: 0, Time elapsed: 0.431 sec
Running org.apache.cactus.integration.maven2.test.TestCactifyWarMojo
[INFO] Analyzing war: <https://hudson.apache.org/hudson/job/Cactus/ws/Cactus/integration/maven2>:/null
Tests run: 4, Failures: 0, Errors: 0, Skipped: 0, Time elapsed: 0.575 sec

Results :

Tests run: 5, Failures: 0, Errors: 0, Skipped: 0

[JENKINS] Recording test results
[INFO] [jar:jar]
[INFO] Building jar: <https://hudson.apache.org/hudson/job/Cactus/ws/Cactus/integration/maven2/target/cactus.integration.maven2-1.8.2-SNAPSHOT.jar>
[INFO] [plugin:addPluginArtifactMetadata]
[INFO] [rat:check {execution: default}]
[INFO] Preparing checkstyle:check
[JENKINS] Archiving <https://hudson.apache.org/hudson/job/Cactus/ws/Cactus/integration/maven2/pom.xml> to /home/hudson/hudson/jobs/Cactus/modules/org.apache.cactus$cactus.integration.maven2/builds/2011-03-23_00-04-10/archive/org.apache.cactus/cactus.integration.maven2/1.8.2-SNAPSHOT/pom.xml
[JENKINS] Archiving <https://hudson.apache.org/hudson/job/Cactus/ws/Cactus/integration/maven2/target/cactus.integration.maven2-1.8.2-SNAPSHOT.jar> to /home/hudson/hudson/jobs/Cactus/modules/org.apache.cactus$cactus.integration.maven2/builds/2011-03-23_00-04-10/archive/org.apache.cactus/cactus.integration.maven2/1.8.2-SNAPSHOT/cactus.integration.maven2-1.8.2-SNAPSHOT.jar
[INFO] [checkstyle:checkstyle]
[WARNING] File encoding has not been set, using platform encoding ANSI_X3.4-1968, i.e. build is platform dependent!
[INFO] Starting audit...
<https://hudson.apache.org/hudson/job/Cactus/ws/Cactus/integration/maven2/src/main/java/org/apache/cactus/maven2/mojos/CactifyWarMojo.java>:80:20: warning: Name 'FILE_NAME' must match pattern '^[a-z][a-zA-Z0-9]*$'.
<https://hudson.apache.org/hudson/job/Cactus/ws/Cactus/integration/maven2/src/main/java/org/apache/cactus/maven2/mojos/CactifyWarMojo.java>:259:5: warning: Method length is 169 lines (max allowed is 150).
Audit done.

[INFO] [checkstyle:check {execution: default}]
[INFO] [install:install]
[INFO] Installing <https://hudson.apache.org/hudson/job/Cactus/ws/Cactus/integration/maven2/target/cactus.integration.maven2-1.8.2-SNAPSHOT.jar> to /home/hudson/.m2/repository/org/apache/cactus/cactus.integration.maven2/1.8.2-SNAPSHOT/cactus.integration.maven2-1.8.2-SNAPSHOT.jar
[INFO] [plugin:updateRegistry]
[INFO] ------------------------------------------------------------------------
[INFO] Building Cactus Eclipse Integration
[INFO]    task-segment: [clean, install]
[INFO] ------------------------------------------------------------------------
[INFO] [clean:clean]
[INFO] Deleting directory <https://hudson.apache.org/hudson/job/Cactus/ws/Cactus/integration/eclipse/target>
[INFO] [remote-resources:process {execution: default}]
[INFO] [site:attach-descriptor]
[INFO] [rat:check {execution: default}]
[INFO] Preparing checkstyle:check
[JENKINS] Archiving <https://hudson.apache.org/hudson/job/Cactus/ws/Cactus/integration/eclipse/pom.xml> to /home/hudson/hudson/jobs/Cactus/modules/org.apache.cactus$cactus.integration.eclipse/builds/2011-03-23_00-04-10/archive/org.apache.cactus/cactus.integration.eclipse/1.8.2-SNAPSHOT/pom.xml
[INFO] [checkstyle:checkstyle]
[INFO] Source directory does not exist - skipping report.
[INFO] [checkstyle:check {execution: default}]
[INFO] Unable to perform checkstyle:check, unable to find checkstyle:checkstyle outputFile.
[INFO] [install:install]
[INFO] Installing <https://hudson.apache.org/hudson/job/Cactus/ws/Cactus/integration/eclipse/pom.xml> to /home/hudson/.m2/repository/org/apache/cactus/cactus.integration.eclipse/1.8.2-SNAPSHOT/cactus.integration.eclipse-1.8.2-SNAPSHOT.pom
[INFO] ------------------------------------------------------------------------
[INFO] Building Cactus Eclipse Integration - Webapp
[INFO]    task-segment: [clean, install]
[INFO] ------------------------------------------------------------------------
[INFO] [clean:clean]
[INFO] artifact org.eclipse.jdt:ui: checking for updates from central
[INFO] artifact org.eclipse:osgi: checking for updates from central
[INFO] artifact org.eclipse.equinox:common: checking for updates from central
[INFO] artifact org.eclipse.core:jobs: checking for updates from central
[INFO] artifact org.eclipse.equinox:registry: checking for updates from central
[INFO] artifact org.eclipse.equinox:preferences: checking for updates from central
[INFO] artifact org.eclipse.core:contenttype: checking for updates from central
[INFO] artifact org.eclipse.equinox:app: checking for updates from central
[JENKINS] Archiving <https://hudson.apache.org/hudson/job/Cactus/ws/Cactus/integration/eclipse/org.apache.cactus.eclipse.webapp/pom.xml> to /home/hudson/hudson/jobs/Cactus/modules/org.apache.cactus$org.apache.cactus.eclipse.webapp/builds/2011-03-23_00-04-10/archive/org.apache.cactus/org.apache.cactus.eclipse.webapp/1.8.2-SNAPSHOT/pom.xml
[INFO] ------------------------------------------------------------------------
[ERROR] BUILD ERROR
[INFO] ------------------------------------------------------------------------
[INFO] Failed to resolve artifact.

Couldn't find a version in [1.0.0-v20070423, 1.0.0-v20070606] to match range [1.0.0,2.0.0)
  org.eclipse.equinox:app:jar:null

from the specified remote repositories:
  central (http://repo1.maven.org/maven2),
  maven.eclipse.plugin.repository (http://repo1.maven.org/eclipse/)

Path to dependency: 
	1) org.apache.cactus:org.apache.cactus.eclipse.webapp:jar:1.8.2-SNAPSHOT
	2) org.eclipse.jdt:ui:jar:3.3.0-v20070607-0010
	3) org.eclipse:ui:jar:3.3.0-I20070614-0800
	4) org.eclipse.core:runtime:jar:3.3.100-v20070530



[INFO] ------------------------------------------------------------------------
[INFO] For more information, run Maven with the -e switch
[INFO] ------------------------------------------------------------------------
[INFO] Total time: 2 minutes 17 seconds
[INFO] Finished at: Tue Mar 22 16:06:56 GMT-08:00 2011
[INFO] Final Memory: 57M/213M
[INFO] ------------------------------------------------------------------------
channel stopped


---------------------------------------------------------------------
To unsubscribe, e-mail: notifications-unsubscribe@jakarta.apache.org
For additional commands, e-mail: notifications-help@jakarta.apache.org