You are viewing a plain text version of this content. The canonical link for it is here.
Posted to dev@kafka.apache.org by Apache Jenkins Server <je...@builds.apache.org> on 2016/02/16 18:43:47 UTC

Build failed in Jenkins: kafka-trunk-jdk8 #369

See <https://builds.apache.org/job/kafka-trunk-jdk8/369/changes>

Changes:

[me] KAFKA-3227; Conservative update of Kafka dependencies

------------------------------------------
[...truncated 4162 lines...]
org.apache.kafka.streams.state.internals.InMemoryLRUCacheStoreTest > testPutGetRangeWithDefaultSerdes PASSED

org.apache.kafka.streams.processor.TopologyBuilderTest > testSourceTopics PASSED

org.apache.kafka.streams.processor.TopologyBuilderTest > testAddSinkWithSameName PASSED

org.apache.kafka.streams.processor.TopologyBuilderTest > testAddSinkWithSelfParent PASSED

org.apache.kafka.streams.processor.TopologyBuilderTest > testAddProcessorWithSelfParent PASSED

org.apache.kafka.streams.processor.TopologyBuilderTest > testAddStateStoreWithSink PASSED

org.apache.kafka.streams.processor.TopologyBuilderTest > testTopicGroups PASSED

org.apache.kafka.streams.processor.TopologyBuilderTest > testBuild PASSED

org.apache.kafka.streams.processor.TopologyBuilderTest > testAddStateStoreWithSource PASSED

org.apache.kafka.streams.processor.TopologyBuilderTest > testAddSourceWithSameName PASSED

org.apache.kafka.streams.processor.TopologyBuilderTest > testAddProcessorWithSameName PASSED

org.apache.kafka.streams.processor.TopologyBuilderTest > testAddSourceWithSameTopic PASSED

org.apache.kafka.streams.processor.TopologyBuilderTest > testTopicGroupsByStateStore PASSED

org.apache.kafka.streams.processor.TopologyBuilderTest > testAddStateStoreWithDuplicates PASSED

org.apache.kafka.streams.processor.TopologyBuilderTest > testAddSinkWithWrongParent PASSED

org.apache.kafka.streams.processor.TopologyBuilderTest > testAddSinkConnectedWithMultipleParent PASSED

org.apache.kafka.streams.processor.TopologyBuilderTest > testAddProcessorWithWrongParent PASSED

org.apache.kafka.streams.processor.TopologyBuilderTest > testAddStateStore PASSED

org.apache.kafka.streams.processor.TopologyBuilderTest > testAddSinkConnectedWithParent PASSED

org.apache.kafka.streams.processor.TopologyBuilderTest > testAddStateStoreWithNonExistingProcessor PASSED

org.apache.kafka.streams.processor.internals.ProcessorStateManagerTest > testRegisterNonPersistentStore PASSED

org.apache.kafka.streams.processor.internals.ProcessorStateManagerTest > testLockStateDirectory PASSED

org.apache.kafka.streams.processor.internals.ProcessorStateManagerTest > testGetStore PASSED

org.apache.kafka.streams.processor.internals.ProcessorStateManagerTest > testClose PASSED

org.apache.kafka.streams.processor.internals.ProcessorStateManagerTest > testChangeLogOffsets PASSED

org.apache.kafka.streams.processor.internals.ProcessorStateManagerTest > testRegisterPersistentStore PASSED

org.apache.kafka.streams.processor.internals.ProcessorStateManagerTest > testNoTopic PASSED

org.apache.kafka.streams.processor.internals.MinTimestampTrackerTest > testTracking PASSED

org.apache.kafka.streams.processor.internals.StandbyTaskTest > testStorePartitions PASSED

org.apache.kafka.streams.processor.internals.StandbyTaskTest > testUpdateKTable PASSED

org.apache.kafka.streams.processor.internals.StandbyTaskTest > testUpdateNonPersistentStore PASSED

org.apache.kafka.streams.processor.internals.StandbyTaskTest > testUpdate PASSED

org.apache.kafka.streams.processor.internals.StreamTaskTest > testProcessOrder PASSED

org.apache.kafka.streams.processor.internals.StreamTaskTest > testPauseResume PASSED

org.apache.kafka.streams.processor.internals.PartitionGroupTest > testTimeTracking PASSED

org.apache.kafka.streams.processor.internals.assignment.TaskAssignorTest > testStickiness PASSED

org.apache.kafka.streams.processor.internals.assignment.TaskAssignorTest > testAssignWithStandby PASSED

org.apache.kafka.streams.processor.internals.assignment.TaskAssignorTest > testAssignWithoutStandby PASSED

org.apache.kafka.streams.processor.internals.assignment.SubscriptionInfoTest > testEncodeDecode PASSED

org.apache.kafka.streams.processor.internals.assignment.AssginmentInfoTest > testEncodeDecode PASSED

org.apache.kafka.streams.processor.internals.ProcessorTopologyTest > testDrivingMultiplexingTopology PASSED

org.apache.kafka.streams.processor.internals.ProcessorTopologyTest > testDrivingStatefulTopology PASSED

org.apache.kafka.streams.processor.internals.ProcessorTopologyTest > testDrivingSimpleTopology PASSED

org.apache.kafka.streams.processor.internals.ProcessorTopologyTest > testTopologyMetadata PASSED

org.apache.kafka.streams.processor.internals.QuickUnionTest > testUnite PASSED

org.apache.kafka.streams.processor.internals.QuickUnionTest > testUniteMany PASSED

org.apache.kafka.streams.processor.internals.PunctuationQueueTest > testPunctuationInterval PASSED

org.apache.kafka.streams.processor.internals.StreamPartitionAssignorTest > testAssignWithStandbyReplicas PASSED

org.apache.kafka.streams.processor.internals.StreamPartitionAssignorTest > testAssignWithNewTasks PASSED

org.apache.kafka.streams.processor.internals.StreamPartitionAssignorTest > testAssignWithStates PASSED

org.apache.kafka.streams.processor.internals.StreamPartitionAssignorTest > testAssignBasic PASSED

org.apache.kafka.streams.processor.internals.StreamPartitionAssignorTest > testOnAssignment PASSED

org.apache.kafka.streams.processor.internals.StreamPartitionAssignorTest > testSubscription PASSED

org.apache.kafka.streams.processor.internals.RecordCollectorTest > testSpecificPartition PASSED

org.apache.kafka.streams.processor.internals.RecordCollectorTest > testStreamPartitioner PASSED

org.apache.kafka.streams.processor.internals.RecordQueueTest > testTimeTracking PASSED

org.apache.kafka.streams.processor.internals.StreamThreadTest > testMaybeCommit PASSED

org.apache.kafka.streams.processor.internals.StreamThreadTest > testPartitionAssignmentChange PASSED

org.apache.kafka.streams.processor.internals.StreamThreadTest > testMaybeClean PASSED

org.apache.kafka.streams.processor.DefaultPartitionGrouperTest > testGrouping PASSED

org.apache.kafka.streams.kstream.KStreamBuilderTest > testMerge PASSED

org.apache.kafka.streams.kstream.KStreamBuilderTest > testFrom PASSED

org.apache.kafka.streams.kstream.KStreamBuilderTest > testNewName PASSED

org.apache.kafka.streams.kstream.internals.KTableSourceTest > testNotSedingOldValue PASSED

org.apache.kafka.streams.kstream.internals.KTableSourceTest > testSedingOldValue PASSED

org.apache.kafka.streams.kstream.internals.KTableSourceTest > testKTable PASSED

org.apache.kafka.streams.kstream.internals.KTableSourceTest > testValueGetter PASSED

org.apache.kafka.streams.kstream.internals.KTableKTableJoinTest > testJoin PASSED

org.apache.kafka.streams.kstream.internals.KTableKTableJoinTest > testNotSendingOldValues PASSED

org.apache.kafka.streams.kstream.internals.KTableKTableJoinTest > testSendingOldValues PASSED

org.apache.kafka.streams.kstream.internals.KStreamKStreamLeftJoinTest > testLeftJoin PASSED

org.apache.kafka.streams.kstream.internals.KStreamKStreamLeftJoinTest > testWindowing PASSED

org.apache.kafka.streams.kstream.internals.KTableFilterTest > testSendingOldValue PASSED

org.apache.kafka.streams.kstream.internals.KTableFilterTest > testNotSendingOldValue PASSED

org.apache.kafka.streams.kstream.internals.KTableFilterTest > testKTable PASSED

org.apache.kafka.streams.kstream.internals.KTableFilterTest > testValueGetter PASSED

org.apache.kafka.streams.kstream.internals.KStreamMapTest > testMap PASSED

org.apache.kafka.streams.kstream.internals.KTableKTableOuterJoinTest > testSendingOldValue PASSED

org.apache.kafka.streams.kstream.internals.KTableKTableOuterJoinTest > testJoin PASSED

org.apache.kafka.streams.kstream.internals.KTableKTableOuterJoinTest > testNotSendingOldValue PASSED

org.apache.kafka.streams.kstream.internals.KStreamKStreamJoinTest > testOuterJoin PASSED

org.apache.kafka.streams.kstream.internals.KStreamKStreamJoinTest > testJoin PASSED

org.apache.kafka.streams.kstream.internals.KStreamKStreamJoinTest > testWindowing PASSED

org.apache.kafka.streams.kstream.internals.KStreamFlatMapTest > testFlatMap PASSED

org.apache.kafka.streams.kstream.internals.KTableImplTest > testStateStore PASSED

org.apache.kafka.streams.kstream.internals.KTableImplTest > testKTable PASSED

org.apache.kafka.streams.kstream.internals.KTableImplTest > testValueGetter PASSED

org.apache.kafka.streams.kstream.internals.KStreamFlatMapValuesTest > testFlatMapValues PASSED

org.apache.kafka.streams.kstream.internals.KTableMapValuesTest > testSendingOldValue PASSED

org.apache.kafka.streams.kstream.internals.KTableMapValuesTest > testNotSendingOldValue PASSED

org.apache.kafka.streams.kstream.internals.KTableMapValuesTest > testKTable PASSED

org.apache.kafka.streams.kstream.internals.KTableMapValuesTest > testValueGetter PASSED

org.apache.kafka.streams.kstream.internals.KTableAggregateTest > testAggBasic PASSED

org.apache.kafka.streams.kstream.internals.KStreamKTableLeftJoinTest > testNotJoinable PASSED

org.apache.kafka.streams.kstream.internals.KStreamKTableLeftJoinTest > testJoin PASSED

org.apache.kafka.streams.kstream.internals.KStreamTransformTest > testTransform PASSED

org.apache.kafka.streams.kstream.internals.KTableKTableLeftJoinTest > testSendingOldValue PASSED

org.apache.kafka.streams.kstream.internals.KTableKTableLeftJoinTest > testJoin PASSED

org.apache.kafka.streams.kstream.internals.KTableKTableLeftJoinTest > testNotSendingOldValue PASSED

org.apache.kafka.streams.kstream.internals.KStreamMapValuesTest > testFlatMapValues PASSED

org.apache.kafka.streams.kstream.internals.KStreamImplTest > testNumProcesses PASSED

org.apache.kafka.streams.kstream.internals.WindowsTest > unlimitedWindows PASSED

org.apache.kafka.streams.kstream.internals.WindowsTest > tumblineWindows PASSED

org.apache.kafka.streams.kstream.internals.WindowsTest > hoppingWindows PASSED

org.apache.kafka.streams.kstream.internals.KStreamFilterTest > testFilterOut PASSED

org.apache.kafka.streams.kstream.internals.KStreamFilterTest > testFilter PASSED

org.apache.kafka.streams.kstream.internals.KStreamAggregateTest > testAggBasic PASSED

org.apache.kafka.streams.kstream.internals.KStreamAggregateTest > testJoin PASSED

org.apache.kafka.streams.kstream.internals.KStreamTransformValuesTest > testTransform PASSED

org.apache.kafka.streams.kstream.internals.KStreamBranchTest > testKStreamBranch PASSED

org.apache.kafka.streams.kstream.internals.WindowedStreamPartitionerTest > testCopartitioning PASSED

org.apache.kafka.streams.StreamsConfigTest > testGetConsumerConfigs PASSED

org.apache.kafka.streams.StreamsConfigTest > testGetProducerConfigs PASSED

org.apache.kafka.streams.StreamsConfigTest > testGetRestoreConsumerConfigs PASSED
*** glibc detected *** /x1/jenkins/jenkins-slave/tools/hudson.model.JDK/jdk1.8.0_45/bin/java: double free or corruption (out): 0x00007fe9b058a480 ***
pthread destroy mutex: Device or resource busy
:streams:test FAILED

FAILURE: Build failed with an exception.

* What went wrong:
Execution failed for task ':streams:test'.
> Process 'Gradle Test Executor 4' finished with non-zero exit value 134

* Try:
Run with --stacktrace option to get the stack trace. Run with --info or --debug option to get more log output.

BUILD FAILED

Total time: 1 hrs 30 mins 27.3 secs
Build step 'Execute shell' marked build as failure
Recording test results
Setting JDK1_8_0_45_HOME=/home/jenkins/jenkins-slave/tools/hudson.model.JDK/jdk1.8.0_45
Setting GRADLE_2_4_RC_2_HOME=/home/jenkins/jenkins-slave/tools/hudson.plugins.gradle.GradleInstallation/Gradle_2.4-rc-2
Setting JDK1_8_0_45_HOME=/home/jenkins/jenkins-slave/tools/hudson.model.JDK/jdk1.8.0_45
Setting GRADLE_2_4_RC_2_HOME=/home/jenkins/jenkins-slave/tools/hudson.plugins.gradle.GradleInstallation/Gradle_2.4-rc-2