You are viewing a plain text version of this content. The canonical link for it is here.
Posted to builds@mesos.apache.org by Apache Jenkins Server <je...@builds.apache.org> on 2017/08/24 02:17:38 UTC
Build failed in Jenkins: Mesos-Buildbot » autotools,gcc,--verbose --enable-libevent --enable-ssl,GLOG_v=1 MESOS_VERBOSE=1,centos:7,(ubuntu)&&(!ubuntu-us1)&&(!ubuntu-eu2) #4144
See <https://builds.apache.org/job/Mesos-Buildbot/BUILDTOOL=autotools,COMPILER=gcc,CONFIGURATION=--verbose%20--enable-libevent%20--enable-ssl,ENVIRONMENT=GLOG_v=1%20MESOS_VERBOSE=1,OS=centos%3A7,label_exp=(ubuntu)&&(!ubuntu-us1)&&(!ubuntu-eu2)/4144/display/redirect?page=changes>
Changes:
[bmahler] Fixed a bug where the agent kills and still launches a task.
[bmahler] Added MESOS-7865 to the 1.1.3 CHANGELOG.
------------------------------------------
[...truncated 27.80 MB...]
rm -f jvm/org/apache/*.o
rm -f jvm/org/apache/*.lo
rm -f launcher/*.o
rm -f launcher/posix/*.o
rm -f linux/*.o
rm -f linux/*.lo
rm -f linux/routing/*.o
rm -f linux/routing/*.lo
rm -f linux/routing/diagnosis/*.o
rm -f linux/routing/diagnosis/*.lo
rm -f linux/routing/filter/*.o
rm -f linux/routing/filter/*.lo
rm -f linux/routing/link/*.o
rm -f linux/routing/link/*.lo
rm -f linux/routing/queueing/*.o
rm -f linux/routing/queueing/*.lo
rm -f local/*.o
rm -f local/*.lo
rm -f log/*.o
rm -f log/*.lo
rm -f log/tool/*.o
rm -f log/tool/*.lo
rm -f logging/*.o
rm -f logging/*.lo
rm -f master/*.o
rm -f master/*.lo
rm -f master/allocator/*.o
rm -f master/allocator/*.lo
rm -f master/allocator/mesos/*.o
rm -f master/allocator/mesos/*.lo
rm -f master/allocator/sorter/drf/*.o
rm -f master/allocator/sorter/drf/*.lo
rm -f master/contender/*.o
rm -f examples/java/*.class
rm -f master/contender/*.lo
rm -f master/detector/*.o
rm -f java/jni/org_apache_mesos*.h
rm -f master/detector/*.lo
rm -f messages/*.o
rm -f messages/*.lo
rm -f module/*.o
rm -f module/*.lo
rm -f sched/*.o
rm -f sched/*.lo
rm -f scheduler/*.o
rm -f scheduler/*.lo
rm -f slave/*.o
rm -f slave/*.lo
rm -f slave/container_loggers/*.o
rm -f slave/container_loggers/*.lo
rm -f slave/containerizer/*.o
rm -f slave/containerizer/*.lo
rm -f slave/containerizer/mesos/*.o
rm -f slave/containerizer/mesos/*.lo
rm -f slave/containerizer/mesos/isolators/appc/*.o
rm -f slave/containerizer/mesos/isolators/appc/*.lo
rm -f slave/containerizer/mesos/isolators/cgroups/*.o
rm -f slave/containerizer/mesos/isolators/cgroups/*.lo
rm -f slave/containerizer/mesos/isolators/cgroups/subsystems/*.o
rm -f slave/containerizer/mesos/isolators/cgroups/subsystems/*.lo
rm -f slave/containerizer/mesos/isolators/docker/*.o
rm -f slave/containerizer/mesos/isolators/docker/*.lo
rm -f slave/containerizer/mesos/isolators/docker/volume/*.o
rm -f slave/containerizer/mesos/isolators/docker/volume/*.lo
rm -f slave/containerizer/mesos/isolators/filesystem/*.o
rm -f slave/containerizer/mesos/isolators/filesystem/*.lo
rm -rf ../include/mesos/.libs ../include/mesos/_libs
rm -f slave/containerizer/mesos/isolators/gpu/*.o
rm -f slave/containerizer/mesos/isolators/gpu/*.lo
rm -f slave/containerizer/mesos/isolators/linux/*.o
rm -rf ../include/mesos/agent/.libs ../include/mesos/agent/_libs
rm -f slave/containerizer/mesos/isolators/linux/*.lo
rm -rf ../include/mesos/allocator/.libs ../include/mesos/allocator/_libs
rm -rf ../include/mesos/appc/.libs ../include/mesos/appc/_libs
rm -f slave/containerizer/mesos/isolators/namespaces/*.o
rm -rf ../include/mesos/authentication/.libs ../include/mesos/authentication/_libs
rm -rf ../include/mesos/authorizer/.libs ../include/mesos/authorizer/_libs
rm -f slave/containerizer/mesos/isolators/namespaces/*.lo
rm -rf ../include/mesos/docker/.libs ../include/mesos/docker/_libs
rm -rf ../include/mesos/executor/.libs ../include/mesos/executor/_libs
rm -f slave/containerizer/mesos/isolators/network/*.o
rm -rf ../include/mesos/fetcher/.libs ../include/mesos/fetcher/_libs
rm -rf ../include/mesos/maintenance/.libs ../include/mesos/maintenance/_libs
rm -f slave/containerizer/mesos/isolators/network/*.lo
rm -rf ../include/mesos/master/.libs ../include/mesos/master/_libs
rm -f slave/containerizer/mesos/isolators/network/cni/*.o
rm -rf ../include/mesos/module/.libs ../include/mesos/module/_libs
rm -rf ../include/mesos/quota/.libs ../include/mesos/quota/_libs
rm -f slave/containerizer/mesos/isolators/network/cni/*.lo
rm -rf ../include/mesos/scheduler/.libs ../include/mesos/scheduler/_libs
rm -f slave/containerizer/mesos/isolators/network/cni/plugins/port_mapper/*.o
rm -f slave/containerizer/mesos/isolators/network/cni/plugins/port_mapper/*.lo
rm -f slave/containerizer/mesos/isolators/posix/*.o
rm -f slave/containerizer/mesos/isolators/posix/*.lo
rm -f slave/containerizer/mesos/isolators/volume/*.o
rm -f slave/containerizer/mesos/isolators/volume/*.lo
rm -f slave/containerizer/mesos/isolators/xfs/*.o
rm -rf ../include/mesos/slave/.libs ../include/mesos/slave/_libs
rm -rf ../include/mesos/state/.libs ../include/mesos/state/_libs
rm -f slave/containerizer/mesos/isolators/xfs/*.lo
rm -rf ../include/mesos/uri/.libs ../include/mesos/uri/_libs
rm -rf ../include/mesos/v1/.libs ../include/mesos/v1/_libs
rm -f slave/containerizer/mesos/provisioner/*.o
rm -rf ../include/mesos/v1/agent/.libs ../include/mesos/v1/agent/_libs
rm -f slave/containerizer/mesos/provisioner/*.lo
rm -rf ../include/mesos/v1/allocator/.libs ../include/mesos/v1/allocator/_libs
rm -rf ../include/mesos/v1/executor/.libs ../include/mesos/v1/executor/_libs
rm -f slave/containerizer/mesos/provisioner/appc/*.o
rm -rf ../include/mesos/v1/maintenance/.libs ../include/mesos/v1/maintenance/_libs
rm -rf ../include/mesos/v1/master/.libs ../include/mesos/v1/master/_libs
rm -f slave/containerizer/mesos/provisioner/appc/*.lo
rm -rf ../include/mesos/v1/quota/.libs ../include/mesos/v1/quota/_libs
rm -f slave/containerizer/mesos/provisioner/backends/*.o
rm -rf ../include/mesos/v1/scheduler/.libs ../include/mesos/v1/scheduler/_libs
rm -rf appc/.libs appc/_libs
rm -f slave/containerizer/mesos/provisioner/backends/*.lo
rm -f slave/containerizer/mesos/provisioner/docker/*.o
rm -f slave/containerizer/mesos/provisioner/docker/*.lo
rm -f slave/qos_controllers/*.o
rm -rf authentication/cram_md5/.libs authentication/cram_md5/_libs
rm -f slave/qos_controllers/*.lo
rm -rf authentication/http/.libs authentication/http/_libs
rm -f slave/resource_estimators/*.o
rm -rf authorizer/.libs authorizer/_libs
rm -f slave/resource_estimators/*.lo
rm -rf authorizer/local/.libs authorizer/local/_libs
rm -f state/*.o
rm -rf common/.libs common/_libs
rm -f state/*.lo
rm -rf docker/.libs docker/_libs
rm -f tests/*.o
rm -rf examples/.libs examples/_libs
rm -rf exec/.libs exec/_libs
rm -rf executor/.libs executor/_libs
rm -rf files/.libs files/_libs
rm -rf hdfs/.libs hdfs/_libs
rm -rf health-check/.libs health-check/_libs
rm -rf hook/.libs hook/_libs
rm -rf internal/.libs internal/_libs
rm -rf java/jni/.libs java/jni/_libs
rm -rf jvm/.libs jvm/_libs
rm -rf jvm/org/apache/.libs jvm/org/apache/_libs
rm -rf linux/.libs linux/_libs
rm -rf linux/routing/.libs linux/routing/_libs
rm -rf linux/routing/diagnosis/.libs linux/routing/diagnosis/_libs
rm -rf linux/routing/filter/.libs linux/routing/filter/_libs
rm -rf linux/routing/link/.libs linux/routing/link/_libs
rm -rf linux/routing/queueing/.libs linux/routing/queueing/_libs
rm -rf local/.libs local/_libs
rm -rf log/.libs log/_libs
rm -rf log/tool/.libs log/tool/_libs
rm -rf logging/.libs logging/_libs
rm -rf master/.libs master/_libs
rm -rf master/allocator/.libs master/allocator/_libs
rm -rf master/allocator/mesos/.libs master/allocator/mesos/_libs
rm -rf master/allocator/sorter/drf/.libs master/allocator/sorter/drf/_libs
rm -rf master/contender/.libs master/contender/_libs
rm -rf master/detector/.libs master/detector/_libs
rm -rf messages/.libs messages/_libs
rm -rf module/.libs module/_libs
rm -rf sched/.libs sched/_libs
rm -rf scheduler/.libs scheduler/_libs
rm -rf slave/.libs slave/_libs
rm -rf slave/container_loggers/.libs slave/container_loggers/_libs
rm -rf slave/containerizer/.libs slave/containerizer/_libs
rm -rf slave/containerizer/mesos/.libs slave/containerizer/mesos/_libs
rm -rf slave/containerizer/mesos/isolators/appc/.libs slave/containerizer/mesos/isolators/appc/_libs
rm -rf slave/containerizer/mesos/isolators/cgroups/.libs slave/containerizer/mesos/isolators/cgroups/_libs
rm -rf slave/containerizer/mesos/isolators/cgroups/subsystems/.libs slave/containerizer/mesos/isolators/cgroups/subsystems/_libs
rm -rf slave/containerizer/mesos/isolators/docker/.libs slave/containerizer/mesos/isolators/docker/_libs
rm -rf slave/containerizer/mesos/isolators/docker/volume/.libs slave/containerizer/mesos/isolators/docker/volume/_libs
rm -rf slave/containerizer/mesos/isolators/filesystem/.libs slave/containerizer/mesos/isolators/filesystem/_libs
rm -rf slave/containerizer/mesos/isolators/gpu/.libs slave/containerizer/mesos/isolators/gpu/_libs
rm -rf slave/containerizer/mesos/isolators/linux/.libs slave/containerizer/mesos/isolators/linux/_libs
rm -rf slave/containerizer/mesos/isolators/namespaces/.libs slave/containerizer/mesos/isolators/namespaces/_libs
rm -rf slave/containerizer/mesos/isolators/network/.libs slave/containerizer/mesos/isolators/network/_libs
rm -rf slave/containerizer/mesos/isolators/network/cni/.libs slave/containerizer/mesos/isolators/network/cni/_libs
rm -rf slave/containerizer/mesos/isolators/network/cni/plugins/port_mapper/.libs slave/containerizer/mesos/isolators/network/cni/plugins/port_mapper/_libs
rm -rf slave/containerizer/mesos/isolators/posix/.libs slave/containerizer/mesos/isolators/posix/_libs
rm -rf slave/containerizer/mesos/isolators/volume/.libs slave/containerizer/mesos/isolators/volume/_libs
rm -rf slave/containerizer/mesos/isolators/xfs/.libs slave/containerizer/mesos/isolators/xfs/_libs
rm -rf slave/containerizer/mesos/provisioner/.libs slave/containerizer/mesos/provisioner/_libs
rm -rf slave/containerizer/mesos/provisioner/appc/.libs slave/containerizer/mesos/provisioner/appc/_libs
rm -rf slave/containerizer/mesos/provisioner/backends/.libs slave/containerizer/mesos/provisioner/backends/_libs
rm -rf slave/containerizer/mesos/provisioner/docker/.libs slave/containerizer/mesos/provisioner/docker/_libs
rm -rf slave/qos_controllers/.libs slave/qos_controllers/_libs
rm -f tests/common/*.o
rm -rf slave/resource_estimators/.libs slave/resource_estimators/_libs
rm -rf state/.libs state/_libs
rm -f tests/containerizer/*.o
rm -rf uri/.libs uri/_libs
rm -rf uri/fetchers/.libs uri/fetchers/_libs
rm -rf usage/.libs usage/_libs
rm -rf v1/.libs v1/_libs
rm -rf version/.libs version/_libs
rm -rf watcher/.libs watcher/_libs
rm -rf zookeeper/.libs zookeeper/_libs
rm -f uri/*.o
rm -f uri/*.lo
rm -f uri/fetchers/*.o
rm -f uri/fetchers/*.lo
rm -f usage/*.o
rm -f usage/*.lo
rm -f v1/*.o
rm -f v1/*.lo
rm -f version/*.o
rm -f version/*.lo
rm -f watcher/*.o
rm -f watcher/*.lo
rm -f zookeeper/*.o
rm -f zookeeper/*.lo
rm -rf ../include/mesos/.deps ../include/mesos/agent/.deps ../include/mesos/allocator/.deps ../include/mesos/appc/.deps ../include/mesos/authentication/.deps ../include/mesos/authorizer/.deps ../include/mesos/docker/.deps ../include/mesos/executor/.deps ../include/mesos/fetcher/.deps ../include/mesos/maintenance/.deps ../include/mesos/master/.deps ../include/mesos/module/.deps ../include/mesos/quota/.deps ../include/mesos/scheduler/.deps ../include/mesos/slave/.deps ../include/mesos/state/.deps ../include/mesos/uri/.deps ../include/mesos/v1/.deps ../include/mesos/v1/agent/.deps ../include/mesos/v1/allocator/.deps ../include/mesos/v1/executor/.deps ../include/mesos/v1/maintenance/.deps ../include/mesos/v1/master/.deps ../include/mesos/v1/quota/.deps ../include/mesos/v1/scheduler/.deps appc/.deps authentication/cram_md5/.deps authentication/http/.deps authorizer/.deps authorizer/local/.deps cli/.deps common/.deps docker/.deps examples/.deps exec/.deps executor/.deps files/.deps hdfs/.deps health-check/.deps hook/.deps internal/.deps java/jni/.deps jvm/.deps jvm/org/apache/.deps launcher/.deps launcher/posix/.deps linux/.deps linux/routing/.deps linux/routing/diagnosis/.deps linux/routing/filter/.deps linux/routing/link/.deps linux/routing/queueing/.deps local/.deps log/.deps log/tool/.deps logging/.deps master/.deps master/allocator/.deps master/allocator/mesos/.deps master/allocator/sorter/drf/.deps master/contender/.deps master/detector/.deps messages/.deps module/.deps sched/.deps scheduler/.deps slave/.deps slave/container_loggers/.deps slave/containerizer/.deps slave/containerizer/mesos/.deps slave/containerizer/mesos/isolators/appc/.deps slave/containerizer/mesos/isolators/cgroups/.deps slave/containerizer/mesos/isolators/cgroups/subsystems/.deps slave/containerizer/mesos/isolators/docker/.deps slave/containerizer/mesos/isolators/docker/volume/.deps slave/containerizer/mesos/isolators/filesystem/.deps slave/containerizer/mesos/isolators/gpu/.deps slave/containerizer/mesos/isolators/linux/.deps slave/containerizer/mesos/isolators/namespaces/.deps slave/containerizer/mesos/isolators/network/.deps slave/containerizer/mesos/isolators/network/cni/.deps slave/containerizer/mesos/isolators/network/cni/plugins/port_mapper/.deps slave/containerizer/mesos/isolators/posix/.deps slave/containerizer/mesos/isolators/volume/.deps slave/containerizer/mesos/isolators/xfs/.deps slave/containerizer/mesos/provisioner/.deps slave/containerizer/mesos/provisioner/appc/.deps slave/containerizer/mesos/provisioner/backends/.deps slave/containerizer/mesos/provisioner/docker/.deps slave/qos_controllers/.deps slave/resource_estimators/.deps state/.deps tests/.deps tests/common/.deps tests/containerizer/.deps uri/.deps uri/fetchers/.deps usage/.deps v1/.deps version/.deps watcher/.deps zookeeper/.deps
rm -f Makefile
make[2]: Leaving directory `/mesos/mesos-1.1.3/_build/src'
rm -f config.status config.cache config.log configure.lineno config.status.lineno
rm -f Makefile
ERROR: files left in build directory after distclean:
./src/core
make[1]: *** [distcleancheck] Error 1
make[1]: Leaving directory `/mesos/mesos-1.1.3/_build'
make: *** [distcheck] Error 1
+ docker rmi mesos-1503539007-15464
Untagged: mesos-1503539007-15464:latest
Deleted: sha256:8f8eadebe806bb7eefe8a515a435c700501950bec136f55b2e49299bec3b3007
Deleted: sha256:b70bc3f1578ce3c77bd259c738fd5cfbb43e0349fbebaf98cfb34d4bb4067ccc
Deleted: sha256:30720e21c3776f2a042179bcf47d9b995aa464a31004c9d59de7866ca1d74bd0
Deleted: sha256:485c330bcc48f36c30412b6034fd3cc95230e152b0b7b58c0b7ee2699fc3503b
Deleted: sha256:31857e3fa855a2583c1d8780f5641d65569fbe7e94ee6485fa097cd23094db74
Deleted: sha256:5c8744f7d2a55845b7aa200b419d46541c8b4abf1e241e9b9babc78176fc6d9b
Deleted: sha256:52c1d6f645bd2cfda574008d7cb357ea84c662ca3e016ba7be2d7b1f8c5c7d7c
Deleted: sha256:b9f343d04b97c51a1c714a09e2d54f94c22e53cc3f1a81894f5c2650cc85feeb
Deleted: sha256:2f212c95e2fd384c689786b03d0be55fd8ff8bee6ca9e19a0d3852c02a7c6523
Deleted: sha256:8b5597cd1590aa87f320c2ee17d356b4dbaa2a3724a5c6407a4917f2ab267a4f
Deleted: sha256:5a54634f5dec1faf68b4be6d65c4eb9012a480a6e6c9ef21ccc1f18d92ff7467
Deleted: sha256:466ac11f8084e25c4e6d2b3df201324af8ce041e5079fd73facf38c5ac2d7a76
Deleted: sha256:20f5cce7ce52620ac4bc4d8158f9f593b2f4124f21b89278ffca0921f91280ce
Deleted: sha256:33883a93d8b53a2de741d99569898ac6a65e7bd71ee8f6f2a48730c4897f3259
Deleted: sha256:94e5060d5154c46afbf6d9c578be23546a7f4944c64a85f4b91cde6a4703809f
Deleted: sha256:1f33636fa762c88ece1f5c15ff65b809aab245bacc8abe64a8390c3e5fbf7685
Deleted: sha256:3053ce3aa4c51f9da28f744da5a19d7b230faee274f3b45246e5733f1176e043
Deleted: sha256:259804917fc7058b6120e8d8858e3b44963b96cdeb36968ca51208a6d0af80a7
Deleted: sha256:06f7992c56b4d43e3910b31a1eac050d76b9bf71bd79f5a1fa8b868f449a4fe5
Deleted: sha256:945ae7473c78a704d223d84a4a250e95f5ded2cc35725ac256591caea53db8d6
Deleted: sha256:b3c195d875076f445e4c756ef18fc3436aae2d86cd392e7ab233c38b64028557
Deleted: sha256:b91cc073a12d7b05a6e67dc778f465f7f22e78075b655995af7c3ca9ca340235
Deleted: sha256:05a222de0876a4cb22ed0383839af83a8ed1edc6471de3602def70453242aaf4
Deleted: sha256:9212154493aa83c58886a13fd9f52313c081c50f29faa222344e95c53dd1b244
Deleted: sha256:eb6114a6d074697486570ad13ae3d6ee69736777bbd15be5ca4ce59002c5d814
Build step 'Execute shell' marked build as failure
Jenkins build is back to normal : Mesos-Buildbot » autotools,gcc,--verbose --enable-libevent --enable-ssl,GLOG_v=1 MESOS_VERBOSE=1,centos:7,(ubuntu)&&(!ubuntu-us1)&&(!ubuntu-eu2) #4149
Posted by Apache Jenkins Server <je...@builds.apache.org>.
See <https://builds.apache.org/job/Mesos-Buildbot/BUILDTOOL=autotools,COMPILER=gcc,CONFIGURATION=--verbose%20--enable-libevent%20--enable-ssl,ENVIRONMENT=GLOG_v=1%20MESOS_VERBOSE=1,OS=centos%3A7,label_exp=(ubuntu)&&(!ubuntu-us1)&&(!ubuntu-eu2)/4149/display/redirect?page=changes>
Build failed in Jenkins: Mesos-Buildbot » autotools,gcc,--verbose --enable-libevent --enable-ssl,GLOG_v=1 MESOS_VERBOSE=1,centos:7,(ubuntu)&&(!ubuntu-us1)&&(!ubuntu-eu2) #4148
Posted by Apache Jenkins Server <je...@builds.apache.org>.
See <https://builds.apache.org/job/Mesos-Buildbot/BUILDTOOL=autotools,COMPILER=gcc,CONFIGURATION=--verbose%20--enable-libevent%20--enable-ssl,ENVIRONMENT=GLOG_v=1%20MESOS_VERBOSE=1,OS=centos%3A7,label_exp=(ubuntu)&&(!ubuntu-us1)&&(!ubuntu-eu2)/4148/display/redirect?page=changes>
Changes:
[bmahler] Fixed a bug where the agent kills and still launches a task.
[bmahler] Added MESOS-7865 to the 1.2.3 CHANGELOG.
[yujie.jay] Adjusted the ContainerLaunchInfo.command merge logic.
[yujie.jay] Added MESOS-7909 to 1.2.3 CHANGELOG.
[yujie.jay] Used clone instead of fork in ns::clone.
[yujie.jay] Added MESOS-7858 to 1.2.3 CHANGELOG.
[bmahler] Improved the reason and message for tasks killed before delivery.
[bmahler] Updated Framework::removePendingTask to take only a TaskID.
[bmahler] Introduced a Framework::idle function in the agent.
[bmahler] Renamed Framework::pending to Framework::pendingTasks in agent.
[bmahler] Introduced a CHECK_NOTNONE.
[bmahler] Fixed a bug where TASK_KILLED updates can be dropped by the agent.
[bmahler] Added a missing return statement from 45c2444ad.
[bmahler] Added MESOS-7863 to the 1.2.3 CHANGELOG.
------------------------------------------
[...truncated 3.36 MB...]
I0824 22:34:25.302314 1874 cluster.cpp:160] Creating default 'local' authorizer
I0824 22:34:25.304863 1905 master.cpp:383] Master 530c8ef0-ef4b-48a1-a3b4-02936aa4c0de (147a0c84f4be) started on 172.17.0.7:42963
I0824 22:34:25.304890 1905 master.cpp:385] Flags at startup: --acls="" --agent_ping_timeout="15secs" --agent_reregister_timeout="10mins" --allocation_interval="1secs" --allocator="HierarchicalDRF" --authenticate_agents="true" --authenticate_frameworks="true" --authenticate_http_frameworks="true" --authenticate_http_readonly="true" --authenticate_http_readwrite="true" --authenticators="crammd5" --authorizers="local" --credentials="/tmp/KIsc27/credentials" --framework_sorter="drf" --help="false" --hostname_lookup="true" --http_authenticators="basic" --http_framework_authenticators="basic" --initialize_driver_logging="true" --log_auto_initialize="true" --logbufsecs="0" --logging_level="INFO" --max_agent_ping_timeouts="5" --max_completed_frameworks="50" --max_completed_tasks_per_framework="1000" --max_unreachable_tasks_per_framework="1000" --port="5050" --quiet="false" --recovery_agent_removal_limit="100%" --registry="in_memory" --registry_fetch_timeout="1mins" --registry_gc_interval="15mins" --registry_max_agent_age="2weeks" --registry_max_agent_count="102400" --registry_store_timeout="100secs" --registry_strict="false" --root_submissions="true" --user_sorter="drf" --version="false" --webui_dir="/mesos/mesos-1.2.3/_inst/share/mesos/webui" --work_dir="/tmp/KIsc27/master" --zk_session_timeout="10secs"
I0824 22:34:25.305281 1905 master.cpp:435] Master only allowing authenticated frameworks to register
I0824 22:34:25.305295 1905 master.cpp:449] Master only allowing authenticated agents to register
I0824 22:34:25.305304 1905 master.cpp:462] Master only allowing authenticated HTTP frameworks to register
I0824 22:34:25.305312 1905 credentials.hpp:37] Loading credentials for authentication from '/tmp/KIsc27/credentials'
I0824 22:34:25.305554 1905 master.cpp:507] Using default 'crammd5' authenticator
I0824 22:34:25.305702 1905 http.cpp:919] Using default 'basic' HTTP authenticator for realm 'mesos-master-readonly'
I0824 22:34:25.305860 1905 http.cpp:919] Using default 'basic' HTTP authenticator for realm 'mesos-master-readwrite'
I0824 22:34:25.305985 1905 http.cpp:919] Using default 'basic' HTTP authenticator for realm 'mesos-master-scheduler'
I0824 22:34:25.306248 1905 master.cpp:587] Authorization enabled
I0824 22:34:25.306524 1901 whitelist_watcher.cpp:77] No whitelist given
I0824 22:34:25.306545 1896 hierarchical.cpp:161] Initialized hierarchical allocator process
I0824 22:34:25.308923 1897 master.cpp:2124] Elected as the leading master!
I0824 22:34:25.308951 1897 master.cpp:1646] Recovering from registrar
I0824 22:34:25.309087 1902 registrar.cpp:329] Recovering registrar
I0824 22:34:25.309893 1894 registrar.cpp:362] Successfully fetched the registry (0B) in 755968ns
I0824 22:34:25.309994 1894 registrar.cpp:461] Applied 1 operations in 16697ns; attempting to update the registry
I0824 22:34:25.311003 1894 registrar.cpp:506] Successfully updated the registry in 944896ns
I0824 22:34:25.311123 1894 registrar.cpp:392] Successfully recovered registrar
I0824 22:34:25.311590 1896 master.cpp:1762] Recovered 0 agents from the registry (129B); allowing 10mins for agents to re-register
I0824 22:34:25.311679 1906 hierarchical.cpp:188] Skipping recovery of hierarchical allocator: nothing to recover
I0824 22:34:25.314643 1874 containerizer.cpp:221] Using isolation: posix/cpu,posix/mem,filesystem/posix,network/cni
W0824 22:34:25.315191 1874 backend.cpp:76] Failed to create 'aufs' backend: AufsBackend requires root privileges
W0824 22:34:25.315317 1874 backend.cpp:76] Failed to create 'bind' backend: BindBackend requires root privileges
I0824 22:34:25.315362 1874 provisioner.cpp:249] Using default backend 'copy'
I0824 22:34:25.318994 1895 slave.cpp:217] Mesos agent started on 172.17.0.7:42963
I0824 22:34:25.319015 1895 slave.cpp:218] Flags at startup: --acls="" --appc_simple_discovery_uri_prefix="http://" --appc_store_dir="/tmp/mesos/store/appc" --authenticate_http_readonly="true" --authenticate_http_readwrite="true" --authenticatee="crammd5" --authentication_backoff_factor="1secs" --authorizer="local" --cgroups_cpu_enable_pids_and_tids_count="false" --cgroups_enable_cfs="false" --cgroups_hierarchy="/sys/fs/cgroup" --cgroups_limit_swap="false" --cgroups_root="mesos" --container_disk_watch_interval="15secs" --containerizers="mesos" --credential="/tmp/HTTPCommandExecutorTest_TerminateWithACK_Nt5p3v/credential" --default_role="*" --disk_watch_interval="1mins" --docker="docker" --docker_kill_orphans="true" --docker_registry="https://registry-1.docker.io" --docker_remove_delay="6hrs" --docker_socket="/var/run/docker.sock" --docker_stop_timeout="0ns" --docker_store_dir="/tmp/mesos/store/docker" --docker_volume_checkpoint_dir="/var/run/mesos/isolators/docker/volume" --enforce_container_disk_quota="false" --executor_registration_timeout="1mins" --executor_reregistration_timeout="2secs" --executor_shutdown_grace_period="5secs" --fetcher_cache_dir="/tmp/HTTPCommandExecutorTest_TerminateWithACK_Nt5p3v/fetch" --fetcher_cache_size="2GB" --frameworks_home="" --gc_delay="1weeks" --gc_disk_headroom="0.1" --hadoop_home="" --help="false" --hostname_lookup="true" --http_authenticators="basic" --http_command_executor="true" --http_credentials="/tmp/HTTPCommandExecutorTest_TerminateWithACK_Nt5p3v/http_credentials" --http_heartbeat_interval="30secs" --initialize_driver_logging="true" --isolation="posix/cpu,posix/mem" --launcher="posix" --launcher_dir="/mesos/mesos-1.2.3/_build/src" --logbufsecs="0" --logging_level="INFO" --max_completed_executors_per_framework="150" --oversubscribed_resources_interval="15secs" --perf_duration="10secs" --perf_interval="1mins" --port="5051" --qos_correction_interval_min="0ns" --quiet="false" --recover="reconnect" --recovery_timeout="15mins" --registration_backoff_factor="10ms" --resources="cpus:2;gpus:0;mem:1024;disk:1024;ports:[31000-32000]" --revocable_cpu_low_priority="true" --runtime_dir="/tmp/HTTPCommandExecutorTest_TerminateWithACK_Nt5p3v" --sandbox_directory="/mnt/mesos/sandbox" --strict="true" --switch_user="true" --systemd_enable_support="true" --systemd_runtime_directory="/run/systemd/system" --version="false" --work_dir="/tmp/HTTPCommandExecutorTest_TerminateWithACK_4pHN2j"
I0824 22:34:25.319499 1895 credentials.hpp:86] Loading credential for authentication from '/tmp/HTTPCommandExecutorTest_TerminateWithACK_Nt5p3v/credential'
I0824 22:34:25.319655 1895 slave.cpp:360] Agent using credential for: test-principal
I0824 22:34:25.319674 1895 credentials.hpp:37] Loading credentials for authentication from '/tmp/HTTPCommandExecutorTest_TerminateWithACK_Nt5p3v/http_credentials'
I0824 22:34:25.319896 1895 http.cpp:919] Using default 'basic' HTTP authenticator for realm 'mesos-agent-readonly'
I0824 22:34:25.320088 1895 http.cpp:919] Using default 'basic' HTTP authenticator for realm 'mesos-agent-readwrite'
I0824 22:34:25.320112 1874 sched.cpp:232] Version: 1.2.3
I0824 22:34:25.321355 1895 slave.cpp:547] Agent resources: cpus(*):2; mem(*):1024; disk(*):1024; ports(*):[31000-32000]
I0824 22:34:25.321434 1895 slave.cpp:555] Agent attributes: [ ]
I0824 22:34:25.321446 1895 slave.cpp:560] Agent hostname: 147a0c84f4be
I0824 22:34:25.322325 1907 status_update_manager.cpp:177] Pausing sending status updates
I0824 22:34:25.322449 1914 sched.cpp:336] New master detected at master@172.17.0.7:42963
I0824 22:34:25.322544 1914 sched.cpp:407] Authenticating with master master@172.17.0.7:42963
I0824 22:34:25.322562 1914 sched.cpp:414] Using default CRAM-MD5 authenticatee
I0824 22:34:25.322783 1912 authenticatee.cpp:121] Creating new client SASL connection
I0824 22:34:25.323066 1902 master.cpp:7201] Authenticating scheduler-094af765-0e23-4f79-8470-e774967b8d5c@172.17.0.7:42963
I0824 22:34:25.323192 1907 authenticator.cpp:414] Starting authentication session for crammd5-authenticatee(34)@172.17.0.7:42963
I0824 22:34:25.323252 1905 state.cpp:62] Recovering state from '/tmp/HTTPCommandExecutorTest_TerminateWithACK_4pHN2j/meta'
I0824 22:34:25.323434 1906 authenticator.cpp:98] Creating new server SASL connection
I0824 22:34:25.323521 1895 status_update_manager.cpp:203] Recovering status update manager
I0824 22:34:25.323740 1913 authenticatee.cpp:213] Received SASL authentication mechanisms: CRAM-MD5
I0824 22:34:25.323771 1913 authenticatee.cpp:239] Attempting to authenticate with mechanism 'CRAM-MD5'
I0824 22:34:25.323879 1893 containerizer.cpp:600] Recovering containerizer
I0824 22:34:25.323920 1894 authenticator.cpp:204] Received SASL authentication start
I0824 22:34:25.323971 1894 authenticator.cpp:326] Authentication requires more steps
I0824 22:34:25.324082 1909 authenticatee.cpp:259] Received SASL authentication step
I0824 22:34:25.324190 1894 authenticator.cpp:232] Received SASL authentication step
I0824 22:34:25.324229 1894 auxprop.cpp:109] Request to lookup properties for user: 'test-principal' realm: '147a0c84f4be' server FQDN: '147a0c84f4be' SASL_AUXPROP_VERIFY_AGAINST_HASH: false SASL_AUXPROP_OVERRIDE: false SASL_AUXPROP_AUTHZID: false
I0824 22:34:25.324252 1894 auxprop.cpp:181] Looking up auxiliary property '*userPassword'
I0824 22:34:25.324304 1894 auxprop.cpp:181] Looking up auxiliary property '*cmusaslsecretCRAM-MD5'
I0824 22:34:25.324338 1894 auxprop.cpp:109] Request to lookup properties for user: 'test-principal' realm: '147a0c84f4be' server FQDN: '147a0c84f4be' SASL_AUXPROP_VERIFY_AGAINST_HASH: false SASL_AUXPROP_OVERRIDE: false SASL_AUXPROP_AUTHZID: true
I0824 22:34:25.324358 1894 auxprop.cpp:131] Skipping auxiliary property '*userPassword' since SASL_AUXPROP_AUTHZID == true
I0824 22:34:25.324370 1894 auxprop.cpp:131] Skipping auxiliary property '*cmusaslsecretCRAM-MD5' since SASL_AUXPROP_AUTHZID == true
I0824 22:34:25.324393 1894 authenticator.cpp:318] Authentication success
I0824 22:34:25.324549 1896 master.cpp:7231] Successfully authenticated principal 'test-principal' at scheduler-094af765-0e23-4f79-8470-e774967b8d5c@172.17.0.7:42963
I0824 22:34:25.324599 1912 authenticator.cpp:432] Authentication session cleanup for crammd5-authenticatee(34)@172.17.0.7:42963
I0824 22:34:25.324642 1905 authenticatee.cpp:299] Authentication success
I0824 22:34:25.324952 1894 sched.cpp:513] Successfully authenticated with master master@172.17.0.7:42963
I0824 22:34:25.324971 1894 sched.cpp:836] Sending SUBSCRIBE call to master@172.17.0.7:42963
I0824 22:34:25.325081 1894 sched.cpp:869] Will retry registration in 1.21461161secs if necessary
I0824 22:34:25.325206 1896 master.cpp:2737] Received SUBSCRIBE call for framework 'default' at scheduler-094af765-0e23-4f79-8470-e774967b8d5c@172.17.0.7:42963
I0824 22:34:25.325273 1896 master.cpp:2160] Authorizing framework principal 'test-principal' to receive offers for role '*'
I0824 22:34:25.325714 1916 master.cpp:2813] Subscribing framework default with checkpointing disabled and capabilities [ ]
I0824 22:34:25.325773 1899 provisioner.cpp:410] Provisioner recovery complete
I0824 22:34:25.326246 1897 slave.cpp:5711] Finished recovery
I0824 22:34:25.326493 1906 sched.cpp:759] Framework registered with 530c8ef0-ef4b-48a1-a3b4-02936aa4c0de-0000
I0824 22:34:25.326546 1906 sched.cpp:773] Scheduler::registered took 25175ns
I0824 22:34:25.326580 1898 hierarchical.cpp:286] Added framework 530c8ef0-ef4b-48a1-a3b4-02936aa4c0de-0000
I0824 22:34:25.326689 1897 slave.cpp:5885] Querying resource estimator for oversubscribable resources
I0824 22:34:25.326722 1898 hierarchical.cpp:1810] No allocations performed
I0824 22:34:25.326769 1898 hierarchical.cpp:1900] No inverse offers to send out!
I0824 22:34:25.326833 1898 hierarchical.cpp:1394] Performed allocation for 0 agents in 158569ns
I0824 22:34:25.326912 1913 status_update_manager.cpp:177] Pausing sending status updates
I0824 22:34:25.326911 1897 slave.cpp:937] New master detected at master@172.17.0.7:42963
I0824 22:34:25.327003 1897 slave.cpp:972] Detecting new master
I0824 22:34:25.333156 1914 slave.cpp:999] Authenticating with master master@172.17.0.7:42963
I0824 22:34:25.333216 1914 slave.cpp:1010] Using default CRAM-MD5 authenticatee
I0824 22:34:25.333447 1913 authenticatee.cpp:121] Creating new client SASL connection
I0824 22:34:25.333631 1899 master.cpp:7201] Authenticating (13)@172.17.0.7:42963
I0824 22:34:25.333716 1902 authenticator.cpp:414] Starting authentication session for crammd5-authenticatee(35)@172.17.0.7:42963
I0824 22:34:25.333890 1915 authenticator.cpp:98] Creating new server SASL connection
I0824 22:34:25.334067 1911 authenticatee.cpp:213] Received SASL authentication mechanisms: CRAM-MD5
I0824 22:34:25.334091 1911 authenticatee.cpp:239] Attempting to authenticate with mechanism 'CRAM-MD5'
I0824 22:34:25.334231 1898 authenticator.cpp:204] Received SASL authentication start
I0824 22:34:25.334285 1898 authenticator.cpp:326] Authentication requires more steps
I0824 22:34:25.334367 1898 authenticatee.cpp:259] Received SASL authentication step
I0824 22:34:25.334493 1912 authenticator.cpp:232] Received SASL authentication step
I0824 22:34:25.334527 1912 auxprop.cpp:109] Request to lookup properties for user: 'test-principal' realm: '147a0c84f4be' server FQDN: '147a0c84f4be' SASL_AUXPROP_VERIFY_AGAINST_HASH: false SASL_AUXPROP_OVERRIDE: false SASL_AUXPROP_AUTHZID: false
I0824 22:34:25.334542 1912 auxprop.cpp:181] Looking up auxiliary property '*userPassword'
I0824 22:34:25.334563 1912 auxprop.cpp:181] Looking up auxiliary property '*cmusaslsecretCRAM-MD5'
I0824 22:34:25.334590 1912 auxprop.cpp:109] Request to lookup properties for user: 'test-principal' realm: '147a0c84f4be' server FQDN: '147a0c84f4be' SASL_AUXPROP_VERIFY_AGAINST_HASH: false SASL_AUXPROP_OVERRIDE: false SASL_AUXPROP_AUTHZID: true
I0824 22:34:25.334606 1912 auxprop.cpp:131] Skipping auxiliary property '*userPassword' since SASL_AUXPROP_AUTHZID == true
I0824 22:34:25.334621 1912 auxprop.cpp:131] Skipping auxiliary property '*cmusaslsecretCRAM-MD5' since SASL_AUXPROP_AUTHZID == true
I0824 22:34:25.334640 1912 authenticator.cpp:318] Authentication success
I0824 22:34:25.334719 1909 authenticatee.cpp:299] Authentication success
I0824 22:34:25.334754 1899 master.cpp:7231] Successfully authenticated principal 'test-principal' at (13)@172.17.0.7:42963
I0824 22:34:25.334877 1898 authenticator.cpp:432] Authentication session cleanup for crammd5-authenticatee(35)@172.17.0.7:42963
I0824 22:34:25.335057 1897 slave.cpp:1094] Successfully authenticated with master master@172.17.0.7:42963
I0824 22:34:25.335209 1897 slave.cpp:1521] Will retry registration in 6.503998ms if necessary
I0824 22:34:25.335430 1904 master.cpp:5398] Registering agent at (13)@172.17.0.7:42963 (147a0c84f4be) with id 530c8ef0-ef4b-48a1-a3b4-02936aa4c0de-S0
I0824 22:34:25.335863 1896 registrar.cpp:461] Applied 1 operations in 56268ns; attempting to update the registry
I0824 22:34:25.337275 1896 registrar.cpp:506] Successfully updated the registry in 1.35808ms
I0824 22:34:25.337926 1904 slave.cpp:4442] Received ping from slave-observer(9)@172.17.0.7:42963
I0824 22:34:25.338148 1904 slave.cpp:1140] Registered with master master@172.17.0.7:42963; given agent ID 530c8ef0-ef4b-48a1-a3b4-02936aa4c0de-S0
I0824 22:34:25.338171 1904 fetcher.cpp:94] Clearing fetcher cache
I0824 22:34:25.338088 1906 master.cpp:5472] Registered agent 530c8ef0-ef4b-48a1-a3b4-02936aa4c0de-S0 at (13)@172.17.0.7:42963 (147a0c84f4be) with cpus(*):2; mem(*):1024; disk(*):1024; ports(*):[31000-32000]
I0824 22:34:25.338311 1896 status_update_manager.cpp:184] Resuming sending status updates
I0824 22:34:25.338482 1904 slave.cpp:1168] Checkpointing SlaveInfo to '/tmp/HTTPCommandExecutorTest_TerminateWithACK_4pHN2j/meta/slaves/530c8ef0-ef4b-48a1-a3b4-02936aa4c0de-S0/slave.info'
I0824 22:34:25.338516 1903 hierarchical.cpp:516] Added agent 530c8ef0-ef4b-48a1-a3b4-02936aa4c0de-S0 (147a0c84f4be) with cpus(*):2; mem(*):1024; disk(*):1024; ports(*):[31000-32000] (allocated: {})
I0824 22:34:25.339570 1903 hierarchical.cpp:1900] No inverse offers to send out!
I0824 22:34:25.339614 1903 hierarchical.cpp:1394] Performed allocation for 1 agents in 973225ns
I0824 22:34:25.340051 1916 master.cpp:7030] Sending 1 offers to framework 530c8ef0-ef4b-48a1-a3b4-02936aa4c0de-0000 (default) at scheduler-094af765-0e23-4f79-8470-e774967b8d5c@172.17.0.7:42963
I0824 22:34:25.340559 1901 sched.cpp:933] Scheduler::resourceOffers took 127639ns
I0824 22:34:25.342334 1914 master.cpp:3776] Processing ACCEPT call for offers: [ 530c8ef0-ef4b-48a1-a3b4-02936aa4c0de-O0 ] on agent 530c8ef0-ef4b-48a1-a3b4-02936aa4c0de-S0 at (13)@172.17.0.7:42963 (147a0c84f4be) for framework 530c8ef0-ef4b-48a1-a3b4-02936aa4c0de-0000 (default) at scheduler-094af765-0e23-4f79-8470-e774967b8d5c@172.17.0.7:42963
I0824 22:34:25.342419 1914 master.cpp:3352] Authorizing framework principal 'test-principal' to launch task ae9ae1b1-54b6-4dda-b5f2-4a385d0d3624
I0824 22:34:25.344830 1914 master.cpp:9091] Adding task ae9ae1b1-54b6-4dda-b5f2-4a385d0d3624 with resources cpus(*)(allocated: *):2; mem(*)(allocated: *):1024; disk(*)(allocated: *):1024; ports(*)(allocated: *):[31000-32000] on agent 530c8ef0-ef4b-48a1-a3b4-02936aa4c0de-S0 at (13)@172.17.0.7:42963 (147a0c84f4be)
I0824 22:34:25.345226 1914 master.cpp:4426] Launching task ae9ae1b1-54b6-4dda-b5f2-4a385d0d3624 of framework 530c8ef0-ef4b-48a1-a3b4-02936aa4c0de-0000 (default) at scheduler-094af765-0e23-4f79-8470-e774967b8d5c@172.17.0.7:42963 with resources cpus(*)(allocated: *):2; mem(*)(allocated: *):1024; disk(*)(allocated: *):1024; ports(*)(allocated: *):[31000-32000] on agent 530c8ef0-ef4b-48a1-a3b4-02936aa4c0de-S0 at (13)@172.17.0.7:42963 (147a0c84f4be)
I0824 22:34:25.346084 1913 slave.cpp:1631] Got assigned task 'ae9ae1b1-54b6-4dda-b5f2-4a385d0d3624' for framework 530c8ef0-ef4b-48a1-a3b4-02936aa4c0de-0000
I0824 22:34:25.346881 1913 slave.cpp:1797] Launching task 'ae9ae1b1-54b6-4dda-b5f2-4a385d0d3624' for framework 530c8ef0-ef4b-48a1-a3b4-02936aa4c0de-0000
I0824 22:34:25.347551 1913 paths.cpp:547] Trying to chown '/tmp/HTTPCommandExecutorTest_TerminateWithACK_4pHN2j/slaves/530c8ef0-ef4b-48a1-a3b4-02936aa4c0de-S0/frameworks/530c8ef0-ef4b-48a1-a3b4-02936aa4c0de-0000/executors/ae9ae1b1-54b6-4dda-b5f2-4a385d0d3624/runs/63f9128e-55ac-4208-82b8-88cfe83a77fd' to user 'mesos'
I0824 22:34:25.347841 1897 hierarchical.cpp:807] Updated allocation of framework 530c8ef0-ef4b-48a1-a3b4-02936aa4c0de-0000 on agent 530c8ef0-ef4b-48a1-a3b4-02936aa4c0de-S0 from cpus(*)(allocated: *):2; mem(*)(allocated: *):1024; disk(*)(allocated: *):1024; ports(*)(allocated: *):[31000-32000] to cpus(*)(allocated: *):2; mem(*)(allocated: *):1024; disk(*)(allocated: *):1024; ports(*)(allocated: *):[31000-32000]
I0824 22:34:25.347842 1913 slave.cpp:6639] Launching executor 'ae9ae1b1-54b6-4dda-b5f2-4a385d0d3624' of framework 530c8ef0-ef4b-48a1-a3b4-02936aa4c0de-0000 with resources cpus(*)(allocated: *):0.1; mem(*)(allocated: *):32 in work directory '/tmp/HTTPCommandExecutorTest_TerminateWithACK_4pHN2j/slaves/530c8ef0-ef4b-48a1-a3b4-02936aa4c0de-S0/frameworks/530c8ef0-ef4b-48a1-a3b4-02936aa4c0de-0000/executors/ae9ae1b1-54b6-4dda-b5f2-4a385d0d3624/runs/63f9128e-55ac-4208-82b8-88cfe83a77fd'
I0824 22:34:25.348593 1901 containerizer.cpp:993] Starting container 63f9128e-55ac-4208-82b8-88cfe83a77fd for executor 'ae9ae1b1-54b6-4dda-b5f2-4a385d0d3624' of framework 530c8ef0-ef4b-48a1-a3b4-02936aa4c0de-0000
I0824 22:34:25.348655 1913 slave.cpp:2108] Queued task 'ae9ae1b1-54b6-4dda-b5f2-4a385d0d3624' for executor 'ae9ae1b1-54b6-4dda-b5f2-4a385d0d3624' of framework 530c8ef0-ef4b-48a1-a3b4-02936aa4c0de-0000
I0824 22:34:25.348728 1913 slave.cpp:890] Successfully attached file '/tmp/HTTPCommandExecutorTest_TerminateWithACK_4pHN2j/slaves/530c8ef0-ef4b-48a1-a3b4-02936aa4c0de-S0/frameworks/530c8ef0-ef4b-48a1-a3b4-02936aa4c0de-0000/executors/ae9ae1b1-54b6-4dda-b5f2-4a385d0d3624/runs/63f9128e-55ac-4208-82b8-88cfe83a77fd'
I0824 22:34:25.358428 1893 containerizer.cpp:1548] Launching 'mesos-containerizer' with flags '--help="false" --launch_info="{"command":{"arguments":["mesos-executor","--launcher_dir=\/mesos\/mesos-1.2.3\/_build\/src"],"shell":false,"value":"\/mesos\/mesos-1.2.3\/_build\/src\/mesos-executor"},"environment":{"variables":[{"name":"LIBPROCESS_PORT","value":"0"},{"name":"MESOS_AGENT_ENDPOINT","value":"172.17.0.7:42963"},{"name":"MESOS_CHECKPOINT","value":"0"},{"name":"MESOS_DIRECTORY","value":"\/tmp\/HTTPCommandExecutorTest_TerminateWithACK_4pHN2j\/slaves\/530c8ef0-ef4b-48a1-a3b4-02936aa4c0de-S0\/frameworks\/530c8ef0-ef4b-48a1-a3b4-02936aa4c0de-0000\/executors\/ae9ae1b1-54b6-4dda-b5f2-4a385d0d3624\/runs\/63f9128e-55ac-4208-82b8-88cfe83a77fd"},{"name":"MESOS_EXECUTOR_ID","value":"ae9ae1b1-54b6-4dda-b5f2-4a385d0d3624"},{"name":"MESOS_EXECUTOR_SHUTDOWN_GRACE_PERIOD","value":"5secs"},{"name":"MESOS_FRAMEWORK_ID","value":"530c8ef0-ef4b-48a1-a3b4-02936aa4c0de-0000"},{"name":"MESOS_HTTP_COMMAND_EXECUTOR","value":"1"},{"name":"MESOS_SLAVE_ID","value":"530c8ef0-ef4b-48a1-a3b4-02936aa4c0de-S0"},{"name":"MESOS_SLAVE_PID","value":"(13)@172.17.0.7:42963"},{"name":"MESOS_SANDBOX","value":"\/tmp\/HTTPCommandExecutorTest_TerminateWithACK_4pHN2j\/slaves\/530c8ef0-ef4b-48a1-a3b4-02936aa4c0de-S0\/frameworks\/530c8ef0-ef4b-48a1-a3b4-02936aa4c0de-0000\/executors\/ae9ae1b1-54b6-4dda-b5f2-4a385d0d3624\/runs\/63f9128e-55ac-4208-82b8-88cfe83a77fd"}]},"user":"mesos","working_directory":"\/tmp\/HTTPCommandExecutorTest_TerminateWithACK_4pHN2j\/slaves\/530c8ef0-ef4b-48a1-a3b4-02936aa4c0de-S0\/frameworks\/530c8ef0-ef4b-48a1-a3b4-02936aa4c0de-0000\/executors\/ae9ae1b1-54b6-4dda-b5f2-4a385d0d3624\/runs\/63f9128e-55ac-4208-82b8-88cfe83a77fd"}" --pipe_read="7" --pipe_write="8" --runtime_directory="/tmp/HTTPCommandExecutorTest_TerminateWithACK_Nt5p3v/containers/63f9128e-55ac-4208-82b8-88cfe83a77fd" --unshare_namespace_mnt="false"'
I0824 22:34:25.360720 1893 launcher.cpp:135] Forked child with pid '1929' for container '63f9128e-55ac-4208-82b8-88cfe83a77fd'
I0824 22:34:25.365427 1909 fetcher.cpp:353] Starting to fetch URIs for container: 63f9128e-55ac-4208-82b8-88cfe83a77fd, directory: /tmp/HTTPCommandExecutorTest_TerminateWithACK_4pHN2j/slaves/530c8ef0-ef4b-48a1-a3b4-02936aa4c0de-S0/frameworks/530c8ef0-ef4b-48a1-a3b4-02936aa4c0de-0000/executors/ae9ae1b1-54b6-4dda-b5f2-4a385d0d3624/runs/63f9128e-55ac-4208-82b8-88cfe83a77fd
I0824 22:34:26.307312 1902 hierarchical.cpp:1810] No allocations performed
I0824 22:34:26.307445 1902 hierarchical.cpp:1900] No inverse offers to send out!
I0824 22:34:26.307575 1902 hierarchical.cpp:1394] Performed allocation for 1 agents in 507440ns
I0824 22:34:27.308807 1893 hierarchical.cpp:1810] No allocations performed
I0824 22:34:27.308917 1893 hierarchical.cpp:1900] No inverse offers to send out!
I0824 22:34:27.308996 1893 hierarchical.cpp:1394] Performed allocation for 1 agents in 440234ns
I0824 22:34:28.310274 1903 hierarchical.cpp:1810] No allocations performed
I0824 22:34:28.310355 1903 hierarchical.cpp:1900] No inverse offers to send out!
I0824 22:34:28.310478 1903 hierarchical.cpp:1394] Performed allocation for 1 agents in 513392ns
I0824 22:34:29.311053 1906 hierarchical.cpp:1810] No allocations performed
I0824 22:34:29.311146 1906 hierarchical.cpp:1900] No inverse offers to send out!
I0824 22:34:29.311211 1906 hierarchical.cpp:1394] Performed allocation for 1 agents in 323868ns
I0824 22:34:30.312063 1908 hierarchical.cpp:1810] No allocations performed
I0824 22:34:30.312171 1908 hierarchical.cpp:1900] No inverse offers to send out!
I0824 22:34:30.312261 1908 hierarchical.cpp:1394] Performed allocation for 1 agents in 399207ns
I0824 22:34:31.313354 1900 hierarchical.cpp:1810] No allocations performed
I0824 22:34:31.313459 1900 hierarchical.cpp:1900] No inverse offers to send out!
I0824 22:34:31.313550 1900 hierarchical.cpp:1394] Performed allocation for 1 agents in 395262ns
I0824 22:34:32.314986 1897 hierarchical.cpp:1810] No allocations performed
I0824 22:34:32.315119 1897 hierarchical.cpp:1900] No inverse offers to send out!
I0824 22:34:32.315198 1897 hierarchical.cpp:1394] Performed allocation for 1 agents in 506738ns
I0824 22:34:33.315876 1915 hierarchical.cpp:1810] No allocations performed
I0824 22:34:33.315981 1915 hierarchical.cpp:1900] No inverse offers to send out!
I0824 22:34:33.316067 1915 hierarchical.cpp:1394] Performed allocation for 1 agents in 386374ns
I0824 22:34:34.317420 1905 hierarchical.cpp:1810] No allocations performed
I0824 22:34:34.317541 1905 hierarchical.cpp:1900] No inverse offers to send out!
I0824 22:34:34.317639 1905 hierarchical.cpp:1394] Performed allocation for 1 agents in 505497ns
I0824 22:34:35.318815 1911 hierarchical.cpp:1810] No allocations performed
I0824 22:34:35.318924 1911 hierarchical.cpp:1900] No inverse offers to send out!
I0824 22:34:35.319008 1911 hierarchical.cpp:1394] Performed allocation for 1 agents in 432656ns
I0824 22:34:36.320528 1903 hierarchical.cpp:1810] No allocations performed
I0824 22:34:36.320637 1903 hierarchical.cpp:1900] No inverse offers to send out!
I0824 22:34:36.320724 1903 hierarchical.cpp:1394] Performed allocation for 1 agents in 432112ns
I0824 22:34:37.322496 1899 hierarchical.cpp:1810] No allocations performed
I0824 22:34:37.322659 1899 hierarchical.cpp:1900] No inverse offers to send out!
I0824 22:34:37.322762 1899 hierarchical.cpp:1394] Performed allocation for 1 agents in 530771ns
I0824 22:34:38.323964 1902 hierarchical.cpp:1810] No allocations performed
I0824 22:34:38.324074 1902 hierarchical.cpp:1900] No inverse offers to send out!
I0824 22:34:38.324174 1902 hierarchical.cpp:1394] Performed allocation for 1 agents in 395028ns
I0824 22:34:39.324806 1898 hierarchical.cpp:1810] No allocations performed
I0824 22:34:39.324901 1898 hierarchical.cpp:1900] No inverse offers to send out!
I0824 22:34:39.324997 1898 hierarchical.cpp:1394] Performed allocation for 1 agents in 377500ns
I0824 22:34:40.325618 1895 hierarchical.cpp:1810] No allocations performed
I0824 22:34:40.325731 1895 hierarchical.cpp:1900] No inverse offers to send out!
I0824 22:34:40.325804 1895 hierarchical.cpp:1394] Performed allocation for 1 agents in 382373ns
I0824 22:34:40.338548 1916 slave.cpp:4442] Received ping from slave-observer(9)@172.17.0.7:42963
../../src/tests/command_executor_tests.cpp:402: Failure
Failed to wait 15secs for statusRunning
I0824 22:34:40.342366 1897 master.cpp:1381] Framework 530c8ef0-ef4b-48a1-a3b4-02936aa4c0de-0000 (default) at scheduler-094af765-0e23-4f79-8470-e774967b8d5c@172.17.0.7:42963 disconnected
I0824 22:34:40.342416 1897 master.cpp:3081] Deactivating framework 530c8ef0-ef4b-48a1-a3b4-02936aa4c0de-0000 (default) at scheduler-094af765-0e23-4f79-8470-e774967b8d5c@172.17.0.7:42963
I0824 22:34:40.342651 1897 master.cpp:3058] Disconnecting framework 530c8ef0-ef4b-48a1-a3b4-02936aa4c0de-0000 (default) at scheduler-094af765-0e23-4f79-8470-e774967b8d5c@172.17.0.7:42963
I0824 22:34:40.342684 1898 hierarchical.cpp:415] Deactivated framework 530c8ef0-ef4b-48a1-a3b4-02936aa4c0de-0000
I0824 22:34:40.342713 1897 master.cpp:1396] Giving framework 530c8ef0-ef4b-48a1-a3b4-02936aa4c0de-0000 (default) at scheduler-094af765-0e23-4f79-8470-e774967b8d5c@172.17.0.7:42963 0ns to failover
../../src/tests/command_executor_tests.cpp:391: Failure
Actual function call count doesn't match EXPECT_CALL(sched, statusUpdate(_, _))...
Expected: to be called twice
Actual: never called - unsatisfied and active
I0824 22:34:40.342963 1909 master.cpp:6870] Framework failover timeout, removing framework 530c8ef0-ef4b-48a1-a3b4-02936aa4c0de-0000 (default) at scheduler-094af765-0e23-4f79-8470-e774967b8d5c@172.17.0.7:42963
I0824 22:34:40.343058 1909 master.cpp:7755] Removing framework 530c8ef0-ef4b-48a1-a3b4-02936aa4c0de-0000 (default) at scheduler-094af765-0e23-4f79-8470-e774967b8d5c@172.17.0.7:42963
I0824 22:34:40.343212 1899 slave.cpp:2682] Asked to shut down framework 530c8ef0-ef4b-48a1-a3b4-02936aa4c0de-0000 by master@172.17.0.7:42963
I0824 22:34:40.343266 1899 slave.cpp:2707] Shutting down framework 530c8ef0-ef4b-48a1-a3b4-02936aa4c0de-0000
I0824 22:34:40.343264 1909 master.cpp:8340] Updating the state of task ae9ae1b1-54b6-4dda-b5f2-4a385d0d3624 of framework 530c8ef0-ef4b-48a1-a3b4-02936aa4c0de-0000 (latest state: TASK_KILLED, status update state: TASK_KILLED)
I0824 22:34:40.343348 1899 slave.cpp:5180] Shutting down executor 'ae9ae1b1-54b6-4dda-b5f2-4a385d0d3624' of framework 530c8ef0-ef4b-48a1-a3b4-02936aa4c0de-0000
W0824 22:34:40.343377 1899 slave.hpp:915] Unable to send event to executor 'ae9ae1b1-54b6-4dda-b5f2-4a385d0d3624' of framework 530c8ef0-ef4b-48a1-a3b4-02936aa4c0de-0000: unknown connection type
../../src/tests/command_executor_tests.cpp:396: Failure
Actual function call count doesn't match EXPECT_CALL(slave, executorTerminated(_, _, _))...
Expected: to be called once
Actual: never called - unsatisfied and active
I0824 22:34:40.344116 1909 master.cpp:8434] Removing task ae9ae1b1-54b6-4dda-b5f2-4a385d0d3624 with resources cpus(*)(allocated: *):2; mem(*)(allocated: *):1024; disk(*)(allocated: *):1024; ports(*)(allocated: *):[31000-32000] of framework 530c8ef0-ef4b-48a1-a3b4-02936aa4c0de-0000 on agent 530c8ef0-ef4b-48a1-a3b4-02936aa4c0de-S0 at (13)@172.17.0.7:42963 (147a0c84f4be)
I0824 22:34:40.344678 1914 hierarchical.cpp:1064] Recovered cpus(*)(allocated: *):2; mem(*)(allocated: *):1024; disk(*)(allocated: *):1024; ports(*)(allocated: *):[31000-32000] (total: cpus(*):2; mem(*):1024; disk(*):1024; ports(*):[31000-32000], allocated: {}) on agent 530c8ef0-ef4b-48a1-a3b4-02936aa4c0de-S0 from framework 530c8ef0-ef4b-48a1-a3b4-02936aa4c0de-0000
I0824 22:34:40.344938 1914 hierarchical.cpp:362] Removed framework 530c8ef0-ef4b-48a1-a3b4-02936aa4c0de-0000
*** Aborted at 1503614080 (unix time) try "date -d @1503614080" if you are using GNU date ***
PC: @ 0x0 (unknown)
*** SIGSEGV (@0x0) received by PID 1874 (TID 0x7f5c38028700) from PID 0; stack trace: ***
@ 0x7f5c4629e370 (unknown)
make[4]: *** [check-local] Segmentation fault (core dumped)
make[4]: Leaving directory `/mesos/mesos-1.2.3/_build/src'
make[3]: *** [check-am] Error 2
make[3]: Leaving directory `/mesos/mesos-1.2.3/_build/src'
make[2]: *** [check] Error 2
make[2]: Leaving directory `/mesos/mesos-1.2.3/_build/src'
make[1]: *** [check-recursive] Error 1
make[1]: Leaving directory `/mesos/mesos-1.2.3/_build'
make: *** [distcheck] Error 1
+ docker rmi mesos-1503612231-28704
Untagged: mesos-1503612231-28704:latest
Deleted: sha256:2024bf974626355b839db9a3e97e9aa299d4c38592be221be90a233b82b09eb3
Deleted: sha256:1690781827eca093945fb42f518e88fc63b2f5be034128bdfd9a75e9cf65716d
Deleted: sha256:73e56c079c922a16f312b9f042f9a4419398c218a81c2bb4a50ddc6dad07bc02
Deleted: sha256:3c6f5408f44c959af5c010675b35df713da80087a77b2492f3200dcd41207426
Deleted: sha256:a94abae6536200b5da7bde00dda19ea35195586ce8c7801b8a2eb45b561b80f0
Deleted: sha256:28c698b242e22c03d294607559fdf27f332129932fa7decd8b0c7b53ccf9c017
Deleted: sha256:8bad9d01651aacf98258ad30a35739e8250b8ccd0b48be63ad0e3844228ed46b
Deleted: sha256:aa31ce8609264b4e7435eef26d59e656e861fdd9a9fbe0edbb6380bfdd1ed1b8
Deleted: sha256:8f2a89df2b6eff5e2285df9ba5bd4f3b8647ad17df904353294aa3c4f2c46fc9
Deleted: sha256:744f76dd14c2d57a3f0d1fda3469dc0bb7b79fac2f03c7bd7e8fd38541203d64
Deleted: sha256:389759cf1c61c0500c40b265f211bb15dc80aad098ad493ced6af9c2a928391f
Deleted: sha256:a3ab1e18fc8937ec86e0d543f03fb047c56a8026ba45f47c6ca1e5b44c5614d9
Deleted: sha256:431bc68964aceb5547a14dbd8157144ff822874d96445d0246220ca466dc317e
Deleted: sha256:ce08f1706e31578ca388636d49a0584521b36d43d8ecbace85133d9b1a6f6f8f
Deleted: sha256:18b56462d6ff7cf1533878861ea2ef47562f93c257a2f0bab1442f9ec744b0ed
Deleted: sha256:c5371eaaf542e8d4f03a4d3c555fe625814f9401c1f24843622afd441cb96745
Deleted: sha256:8e26b4752329a398a0ebc11a589723509be5199edf68398599e849fd7bdfdddf
Deleted: sha256:26fbce25c4fea788fbe52310fa79dfa50388b75dbb829d8b9b5b0ad13f8a8235
Deleted: sha256:5d43a3fdd90755b1b671d833d90275e61bc988d5a9c5787d1c6ce27b114a9f64
Deleted: sha256:8e84ac4dcc74b56efb72de8ee70c75eb8aa75c0883ab33fa20f056e41860e151
Deleted: sha256:b8a1e6d601dc66093ece24eba9cbd480c87c1a9956fb3cff160bccab2c71a4df
Deleted: sha256:0c5d0e5fd459f0e5fcbaf441d750c4658c12afc7bb09cfd50313eb2a258c40d1
Deleted: sha256:f30674a4187fe90446e791171bdb89d4bafc7c185c68b5d6b76b1c7353b3fcc2
Deleted: sha256:f47399ae71e79af723d388bf1ee16fad81c597337fa24e2dd0296f4272139035
Deleted: sha256:b8fcbe366c2f5c0ff324fb2cdfc5cc275c00718c708e082c95cfa8f1511492c6
Build step 'Execute shell' marked build as failure
Not sending mail to unregistered user yujie.jay@gmail.com
Build failed in Jenkins: Mesos-Buildbot » autotools,gcc,--verbose --enable-libevent --enable-ssl,GLOG_v=1 MESOS_VERBOSE=1,centos:7,(ubuntu)&&(!ubuntu-us1)&&(!ubuntu-eu2) #4147
Posted by Apache Jenkins Server <je...@builds.apache.org>.
See <https://builds.apache.org/job/Mesos-Buildbot/BUILDTOOL=autotools,COMPILER=gcc,CONFIGURATION=--verbose%20--enable-libevent%20--enable-ssl,ENVIRONMENT=GLOG_v=1%20MESOS_VERBOSE=1,OS=centos%3A7,label_exp=(ubuntu)&&(!ubuntu-us1)&&(!ubuntu-eu2)/4147/display/redirect?page=changes>
Changes:
[bmahler] Fixed a bug where the agent kills and still launches a task.
[bmahler] Added MESOS-7865 to the 1.3.2 CHANGELOG.
[bmahler] Improved the reason and message for tasks killed before delivery.
[bmahler] Updated Framework::removePendingTask to take only a TaskID.
[bmahler] Introduced a Framework::idle function in the agent.
[bmahler] Renamed Framework::pending to Framework::pendingTasks in agent.
[bmahler] Introduced a CHECK_NOTNONE.
[bmahler] Fixed a bug where TASK_KILLED updates can be dropped by the agent.
[bmahler] Added a missing return statement from 45c2444ad.
[bmahler] Added MESOS-7863 to the 1.3.2 CHANGELOG.
[yujie.jay] Adjusted the ContainerLaunchInfo.command merge logic.
[yujie.jay] Added MESOS-7909 to 1.3.2 CHANGELOG.
[yujie.jay] Used clone instead of fork in ns::clone.
[yujie.jay] Added MESOS-7858 to 1.3.2 CHANGELOG.
------------------------------------------
[...truncated 28.09 MB...]
I0824 17:47:13.968983 21495 http.cpp:936] Authorizing principal 'test-principal' to GET the '/containers' endpoint
I0824 17:47:13.972295 21499 slave.cpp:796] Agent terminating
[ OK ] Endpoint/SlaveEndpointTest.AuthorizedRequest/2 (32 ms)
[ RUN ] Endpoint/SlaveEndpointTest.UnauthorizedRequest/0
I0824 17:47:13.985687 2251 containerizer.cpp:221] Using isolation: posix/cpu,posix/mem,filesystem/posix,network/cni
W0824 17:47:13.986222 2251 backend.cpp:76] Failed to create 'aufs' backend: AufsBackend requires root privileges
W0824 17:47:13.986331 2251 backend.cpp:76] Failed to create 'bind' backend: BindBackend requires root privileges
I0824 17:47:13.986366 2251 provisioner.cpp:249] Using default backend 'copy'
I0824 17:47:13.989715 21497 slave.cpp:231] Mesos agent started on (744)@172.17.0.4:35835
I0824 17:47:13.989738 21497 slave.cpp:232] Flags at startup: --acls="" --appc_simple_discovery_uri_prefix="http://" --appc_store_dir="/tmp/mesos/store/appc" --authenticate_http_executors="true" --authenticate_http_readonly="true" --authenticate_http_readwrite="true" --authenticatee="crammd5" --authentication_backoff_factor="1secs" --authorizer="local" --cgroups_cpu_enable_pids_and_tids_count="false" --cgroups_enable_cfs="false" --cgroups_hierarchy="/sys/fs/cgroup" --cgroups_limit_swap="false" --cgroups_root="mesos" --container_disk_watch_interval="15secs" --containerizers="mesos" --credential="/tmp/Endpoint_SlaveEndpointTest_UnauthorizedRequest_0_VNRouY/credential" --default_role="*" --disk_watch_interval="1mins" --docker="docker" --docker_kill_orphans="true" --docker_registry="https://registry-1.docker.io" --docker_remove_delay="6hrs" --docker_socket="/var/run/docker.sock" --docker_stop_timeout="0ns" --docker_store_dir="/tmp/mesos/store/docker" --docker_volume_checkpoint_dir="/var/run/mesos/isolators/docker/volume" --enforce_container_disk_quota="false" --executor_registration_timeout="1mins" --executor_reregistration_timeout="2secs" --executor_secret_key="/tmp/Endpoint_SlaveEndpointTest_UnauthorizedRequest_0_VNRouY/executor_secret_key" --executor_shutdown_grace_period="5secs" --fetcher_cache_dir="/tmp/Endpoint_SlaveEndpointTest_UnauthorizedRequest_0_VNRouY/fetch" --fetcher_cache_size="2GB" --frameworks_home="" --gc_delay="1weeks" --gc_disk_headroom="0.1" --hadoop_home="" --help="false" --hostname_lookup="true" --http_command_executor="false" --http_credentials="/tmp/Endpoint_SlaveEndpointTest_UnauthorizedRequest_0_VNRouY/http_credentials" --http_heartbeat_interval="30secs" --initialize_driver_logging="true" --isolation="posix/cpu,posix/mem" --launcher="posix" --launcher_dir="/mesos/mesos-1.3.2/_build/src" --logbufsecs="0" --logging_level="INFO" --max_completed_executors_per_framework="150" --oversubscribed_resources_interval="15secs" --perf_duration="10secs" --perf_interval="1mins" --port="5051" --qos_correction_interval_min="0ns" --quiet="false" --recover="reconnect" --recovery_timeout="15mins" --registration_backoff_factor="10ms" --resources="cpus:2;gpus:0;mem:1024;disk:1024;ports:[31000-32000]" --revocable_cpu_low_priority="true" --runtime_dir="/tmp/Endpoint_SlaveEndpointTest_UnauthorizedRequest_0_VNRouY" --sandbox_directory="/mnt/mesos/sandbox" --strict="true" --switch_user="true" --systemd_enable_support="true" --systemd_runtime_directory="/run/systemd/system" --version="false" --work_dir="/tmp/Endpoint_SlaveEndpointTest_UnauthorizedRequest_0_OmTjqs"
I0824 17:47:13.990105 21497 credentials.hpp:86] Loading credential for authentication from '/tmp/Endpoint_SlaveEndpointTest_UnauthorizedRequest_0_VNRouY/credential'
I0824 17:47:13.990269 21497 slave.cpp:264] Agent using credential for: test-principal
I0824 17:47:13.990290 21497 credentials.hpp:37] Loading credentials for authentication from '/tmp/Endpoint_SlaveEndpointTest_UnauthorizedRequest_0_VNRouY/http_credentials'
I0824 17:47:13.990566 21497 http.cpp:975] Creating default 'basic' HTTP authenticator for realm 'mesos-agent-executor'
I0824 17:47:13.990685 21497 http.cpp:996] Creating default 'jwt' HTTP authenticator for realm 'mesos-agent-executor'
I0824 17:47:13.990996 21497 http.cpp:975] Creating default 'basic' HTTP authenticator for realm 'mesos-agent-readonly'
I0824 17:47:13.991086 21497 http.cpp:996] Creating default 'jwt' HTTP authenticator for realm 'mesos-agent-readonly'
I0824 17:47:13.991242 21497 http.cpp:975] Creating default 'basic' HTTP authenticator for realm 'mesos-agent-readwrite'
I0824 17:47:13.991345 21497 http.cpp:996] Creating default 'jwt' HTTP authenticator for realm 'mesos-agent-readwrite'
I0824 17:47:13.992717 21497 slave.cpp:531] Agent resources: cpus(*):2; mem(*):1024; disk(*):1024; ports(*):[31000-32000]
I0824 17:47:13.992804 21497 slave.cpp:539] Agent attributes: [ ]
I0824 17:47:13.992816 21497 slave.cpp:544] Agent hostname: dfcf3e75d200
I0824 17:47:13.992952 21488 status_update_manager.cpp:177] Pausing sending status updates
I0824 17:47:13.994477 21487 state.cpp:62] Recovering state from '/tmp/Endpoint_SlaveEndpointTest_UnauthorizedRequest_0_OmTjqs/meta'
I0824 17:47:13.994885 21477 status_update_manager.cpp:203] Recovering status update manager
I0824 17:47:13.995102 21498 containerizer.cpp:608] Recovering containerizer
I0824 17:47:13.996680 21484 provisioner.cpp:410] Provisioner recovery complete
I0824 17:47:13.997139 21479 slave.cpp:6107] Finished recovery
I0824 17:47:13.997686 21479 slave.cpp:6289] Querying resource estimator for oversubscribable resources
I0824 17:47:13.997956 21496 slave.cpp:6303] Received oversubscribable resources {} from the resource estimator
I0824 17:47:14.000221 21485 process.cpp:3741] Handling HTTP event for process 'slave(744)' with path: '/slave(744)/monitor/statistics'
I0824 17:47:14.001986 21492 http.cpp:1115] HTTP GET for /slave(744)/monitor/statistics from 172.17.0.4:52358
I0824 17:47:14.002065 21492 http.cpp:936] Authorizing principal 'test-principal' to GET the '/monitor/statistics' endpoint
I0824 17:47:14.004215 21486 slave.cpp:796] Agent terminating
[ OK ] Endpoint/SlaveEndpointTest.UnauthorizedRequest/0 (29 ms)
[ RUN ] Endpoint/SlaveEndpointTest.UnauthorizedRequest/1
I0824 17:47:14.014796 2251 containerizer.cpp:221] Using isolation: posix/cpu,posix/mem,filesystem/posix,network/cni
W0824 17:47:14.015326 2251 backend.cpp:76] Failed to create 'aufs' backend: AufsBackend requires root privileges
W0824 17:47:14.015432 2251 backend.cpp:76] Failed to create 'bind' backend: BindBackend requires root privileges
I0824 17:47:14.015466 2251 provisioner.cpp:249] Using default backend 'copy'
I0824 17:47:14.019078 21499 slave.cpp:231] Mesos agent started on (745)@172.17.0.4:35835
I0824 17:47:14.019104 21499 slave.cpp:232] Flags at startup: --acls="" --appc_simple_discovery_uri_prefix="http://" --appc_store_dir="/tmp/mesos/store/appc" --authenticate_http_executors="true" --authenticate_http_readonly="true" --authenticate_http_readwrite="true" --authenticatee="crammd5" --authentication_backoff_factor="1secs" --authorizer="local" --cgroups_cpu_enable_pids_and_tids_count="false" --cgroups_enable_cfs="false" --cgroups_hierarchy="/sys/fs/cgroup" --cgroups_limit_swap="false" --cgroups_root="mesos" --container_disk_watch_interval="15secs" --containerizers="mesos" --credential="/tmp/Endpoint_SlaveEndpointTest_UnauthorizedRequest_1_PiazZ2/credential" --default_role="*" --disk_watch_interval="1mins" --docker="docker" --docker_kill_orphans="true" --docker_registry="https://registry-1.docker.io" --docker_remove_delay="6hrs" --docker_socket="/var/run/docker.sock" --docker_stop_timeout="0ns" --docker_store_dir="/tmp/mesos/store/docker" --docker_volume_checkpoint_dir="/var/run/mesos/isolators/docker/volume" --enforce_container_disk_quota="false" --executor_registration_timeout="1mins" --executor_reregistration_timeout="2secs" --executor_secret_key="/tmp/Endpoint_SlaveEndpointTest_UnauthorizedRequest_1_PiazZ2/executor_secret_key" --executor_shutdown_grace_period="5secs" --fetcher_cache_dir="/tmp/Endpoint_SlaveEndpointTest_UnauthorizedRequest_1_PiazZ2/fetch" --fetcher_cache_size="2GB" --frameworks_home="" --gc_delay="1weeks" --gc_disk_headroom="0.1" --hadoop_home="" --help="false" --hostname_lookup="true" --http_command_executor="false" --http_credentials="/tmp/Endpoint_SlaveEndpointTest_UnauthorizedRequest_1_PiazZ2/http_credentials" --http_heartbeat_interval="30secs" --initialize_driver_logging="true" --isolation="posix/cpu,posix/mem" --launcher="posix" --launcher_dir="/mesos/mesos-1.3.2/_build/src" --logbufsecs="0" --logging_level="INFO" --max_completed_executors_per_framework="150" --oversubscribed_resources_interval="15secs" --perf_duration="10secs" --perf_interval="1mins" --port="5051" --qos_correction_interval_min="0ns" --quiet="false" --recover="reconnect" --recovery_timeout="15mins" --registration_backoff_factor="10ms" --resources="cpus:2;gpus:0;mem:1024;disk:1024;ports:[31000-32000]" --revocable_cpu_low_priority="true" --runtime_dir="/tmp/Endpoint_SlaveEndpointTest_UnauthorizedRequest_1_PiazZ2" --sandbox_directory="/mnt/mesos/sandbox" --strict="true" --switch_user="true" --systemd_enable_support="true" --systemd_runtime_directory="/run/systemd/system" --version="false" --work_dir="/tmp/Endpoint_SlaveEndpointTest_UnauthorizedRequest_1_qLL8Qw"
I0824 17:47:14.019549 21499 credentials.hpp:86] Loading credential for authentication from '/tmp/Endpoint_SlaveEndpointTest_UnauthorizedRequest_1_PiazZ2/credential'
I0824 17:47:14.019739 21499 slave.cpp:264] Agent using credential for: test-principal
I0824 17:47:14.019760 21499 credentials.hpp:37] Loading credentials for authentication from '/tmp/Endpoint_SlaveEndpointTest_UnauthorizedRequest_1_PiazZ2/http_credentials'
I0824 17:47:14.020042 21499 http.cpp:975] Creating default 'basic' HTTP authenticator for realm 'mesos-agent-executor'
I0824 17:47:14.020162 21499 http.cpp:996] Creating default 'jwt' HTTP authenticator for realm 'mesos-agent-executor'
I0824 17:47:14.020368 21499 http.cpp:975] Creating default 'basic' HTTP authenticator for realm 'mesos-agent-readonly'
I0824 17:47:14.020499 21499 http.cpp:996] Creating default 'jwt' HTTP authenticator for realm 'mesos-agent-readonly'
I0824 17:47:14.020851 21499 http.cpp:975] Creating default 'basic' HTTP authenticator for realm 'mesos-agent-readwrite'
I0824 17:47:14.020977 21499 http.cpp:996] Creating default 'jwt' HTTP authenticator for realm 'mesos-agent-readwrite'
I0824 17:47:14.022464 21499 slave.cpp:531] Agent resources: cpus(*):2; mem(*):1024; disk(*):1024; ports(*):[31000-32000]
I0824 17:47:14.022552 21499 slave.cpp:539] Agent attributes: [ ]
I0824 17:47:14.022567 21499 slave.cpp:544] Agent hostname: dfcf3e75d200
I0824 17:47:14.022722 21481 status_update_manager.cpp:177] Pausing sending status updates
I0824 17:47:14.024260 21486 state.cpp:62] Recovering state from '/tmp/Endpoint_SlaveEndpointTest_UnauthorizedRequest_1_qLL8Qw/meta'
I0824 17:47:14.024530 21490 status_update_manager.cpp:203] Recovering status update manager
I0824 17:47:14.024806 21490 containerizer.cpp:608] Recovering containerizer
I0824 17:47:14.026399 21491 provisioner.cpp:410] Provisioner recovery complete
I0824 17:47:14.026809 21496 slave.cpp:6107] Finished recovery
I0824 17:47:14.027384 21496 slave.cpp:6289] Querying resource estimator for oversubscribable resources
I0824 17:47:14.027797 21478 slave.cpp:6303] Received oversubscribable resources {} from the resource estimator
I0824 17:47:14.030124 21488 process.cpp:3741] Handling HTTP event for process 'slave(745)' with path: '/slave(745)/monitor/statistics.json'
I0824 17:47:14.032058 21484 http.cpp:1115] HTTP GET for /slave(745)/monitor/statistics.json from 172.17.0.4:52360
I0824 17:47:14.032136 21484 http.cpp:936] Authorizing principal 'test-principal' to GET the '/monitor/statistics.json' endpoint
I0824 17:47:14.034385 21492 slave.cpp:796] Agent terminating
[ OK ] Endpoint/SlaveEndpointTest.UnauthorizedRequest/1 (29 ms)
[ RUN ] Endpoint/SlaveEndpointTest.UnauthorizedRequest/2
I0824 17:47:14.044800 2251 containerizer.cpp:221] Using isolation: posix/cpu,posix/mem,filesystem/posix,network/cni
W0824 17:47:14.045318 2251 backend.cpp:76] Failed to create 'aufs' backend: AufsBackend requires root privileges
W0824 17:47:14.045423 2251 backend.cpp:76] Failed to create 'bind' backend: BindBackend requires root privileges
I0824 17:47:14.045455 2251 provisioner.cpp:249] Using default backend 'copy'
I0824 17:47:14.048638 21480 slave.cpp:231] Mesos agent started on (746)@172.17.0.4:35835
I0824 17:47:14.048658 21480 slave.cpp:232] Flags at startup: --acls="" --appc_simple_discovery_uri_prefix="http://" --appc_store_dir="/tmp/mesos/store/appc" --authenticate_http_executors="true" --authenticate_http_readonly="true" --authenticate_http_readwrite="true" --authenticatee="crammd5" --authentication_backoff_factor="1secs" --authorizer="local" --cgroups_cpu_enable_pids_and_tids_count="false" --cgroups_enable_cfs="false" --cgroups_hierarchy="/sys/fs/cgroup" --cgroups_limit_swap="false" --cgroups_root="mesos" --container_disk_watch_interval="15secs" --containerizers="mesos" --credential="/tmp/Endpoint_SlaveEndpointTest_UnauthorizedRequest_2_NsIwM7/credential" --default_role="*" --disk_watch_interval="1mins" --docker="docker" --docker_kill_orphans="true" --docker_registry="https://registry-1.docker.io" --docker_remove_delay="6hrs" --docker_socket="/var/run/docker.sock" --docker_stop_timeout="0ns" --docker_store_dir="/tmp/mesos/store/docker" --docker_volume_checkpoint_dir="/var/run/mesos/isolators/docker/volume" --enforce_container_disk_quota="false" --executor_registration_timeout="1mins" --executor_reregistration_timeout="2secs" --executor_secret_key="/tmp/Endpoint_SlaveEndpointTest_UnauthorizedRequest_2_NsIwM7/executor_secret_key" --executor_shutdown_grace_period="5secs" --fetcher_cache_dir="/tmp/Endpoint_SlaveEndpointTest_UnauthorizedRequest_2_NsIwM7/fetch" --fetcher_cache_size="2GB" --frameworks_home="" --gc_delay="1weeks" --gc_disk_headroom="0.1" --hadoop_home="" --help="false" --hostname_lookup="true" --http_command_executor="false" --http_credentials="/tmp/Endpoint_SlaveEndpointTest_UnauthorizedRequest_2_NsIwM7/http_credentials" --http_heartbeat_interval="30secs" --initialize_driver_logging="true" --isolation="posix/cpu,posix/mem" --launcher="posix" --launcher_dir="/mesos/mesos-1.3.2/_build/src" --logbufsecs="0" --logging_level="INFO" --max_completed_executors_per_framework="150" --oversubscribed_resources_interval="15secs" --perf_duration="10secs" --perf_interval="1mins" --port="5051" --qos_correction_interval_min="0ns" --quiet="false" --recover="reconnect" --recovery_timeout="15mins" --registration_backoff_factor="10ms" --resources="cpus:2;gpus:0;mem:1024;disk:1024;ports:[31000-32000]" --revocable_cpu_low_priority="true" --runtime_dir="/tmp/Endpoint_SlaveEndpointTest_UnauthorizedRequest_2_NsIwM7" --sandbox_directory="/mnt/mesos/sandbox" --strict="true" --switch_user="true" --systemd_enable_support="true" --systemd_runtime_directory="/run/systemd/system" --version="false" --work_dir="/tmp/Endpoint_SlaveEndpointTest_UnauthorizedRequest_2_GJwDzB"
I0824 17:47:14.049089 21480 credentials.hpp:86] Loading credential for authentication from '/tmp/Endpoint_SlaveEndpointTest_UnauthorizedRequest_2_NsIwM7/credential'
I0824 17:47:14.049271 21480 slave.cpp:264] Agent using credential for: test-principal
I0824 17:47:14.049294 21480 credentials.hpp:37] Loading credentials for authentication from '/tmp/Endpoint_SlaveEndpointTest_UnauthorizedRequest_2_NsIwM7/http_credentials'
I0824 17:47:14.049569 21480 http.cpp:975] Creating default 'basic' HTTP authenticator for realm 'mesos-agent-executor'
I0824 17:47:14.049679 21480 http.cpp:996] Creating default 'jwt' HTTP authenticator for realm 'mesos-agent-executor'
I0824 17:47:14.050065 21480 http.cpp:975] Creating default 'basic' HTTP authenticator for realm 'mesos-agent-readonly'
I0824 17:47:14.050195 21480 http.cpp:996] Creating default 'jwt' HTTP authenticator for realm 'mesos-agent-readonly'
I0824 17:47:14.050535 21480 http.cpp:975] Creating default 'basic' HTTP authenticator for realm 'mesos-agent-readwrite'
I0824 17:47:14.050634 21480 http.cpp:996] Creating default 'jwt' HTTP authenticator for realm 'mesos-agent-readwrite'
I0824 17:47:14.051964 21480 slave.cpp:531] Agent resources: cpus(*):2; mem(*):1024; disk(*):1024; ports(*):[31000-32000]
I0824 17:47:14.052048 21480 slave.cpp:539] Agent attributes: [ ]
I0824 17:47:14.052062 21480 slave.cpp:544] Agent hostname: dfcf3e75d200
I0824 17:47:14.052189 21481 status_update_manager.cpp:177] Pausing sending status updates
I0824 17:47:14.053619 21486 state.cpp:62] Recovering state from '/tmp/Endpoint_SlaveEndpointTest_UnauthorizedRequest_2_GJwDzB/meta'
I0824 17:47:14.054078 21477 status_update_manager.cpp:203] Recovering status update manager
I0824 17:47:14.054378 21481 containerizer.cpp:608] Recovering containerizer
I0824 17:47:14.056000 21484 provisioner.cpp:410] Provisioner recovery complete
I0824 17:47:14.056484 21487 slave.cpp:6107] Finished recovery
I0824 17:47:14.057039 21487 slave.cpp:6289] Querying resource estimator for oversubscribable resources
I0824 17:47:14.057319 21486 slave.cpp:6303] Received oversubscribable resources {} from the resource estimator
I0824 17:47:14.059254 21495 process.cpp:3741] Handling HTTP event for process 'slave(746)' with path: '/slave(746)/containers'
I0824 17:47:14.061313 21479 http.cpp:1115] HTTP GET for /slave(746)/containers from 172.17.0.4:52362
I0824 17:47:14.061394 21479 http.cpp:936] Authorizing principal 'test-principal' to GET the '/containers' endpoint
I0824 17:47:14.063179 21479 slave.cpp:796] Agent terminating
[ OK ] Endpoint/SlaveEndpointTest.UnauthorizedRequest/2 (29 ms)
[ RUN ] Endpoint/SlaveEndpointTest.NoAuthorizer/0
I0824 17:47:14.074277 2251 containerizer.cpp:221] Using isolation: posix/cpu,posix/mem,filesystem/posix,network/cni
W0824 17:47:14.074795 2251 backend.cpp:76] Failed to create 'aufs' backend: AufsBackend requires root privileges
W0824 17:47:14.074904 2251 backend.cpp:76] Failed to create 'bind' backend: BindBackend requires root privileges
I0824 17:47:14.074936 2251 provisioner.cpp:249] Using default backend 'copy'
I0824 17:47:14.076412 2251 cluster.cpp:448] Creating default 'local' authorizer
I0824 17:47:14.078147 21486 slave.cpp:231] Mesos agent started on (747)@172.17.0.4:35835
I0824 17:47:14.078168 21486 slave.cpp:232] Flags at startup: --acls="" --appc_simple_discovery_uri_prefix="http://" --appc_store_dir="/tmp/mesos/store/appc" --authenticate_http_executors="true" --authenticate_http_readonly="true" --authenticate_http_readwrite="true" --authenticatee="crammd5" --authentication_backoff_factor="1secs" --authorizer="local" --cgroups_cpu_enable_pids_and_tids_count="false" --cgroups_enable_cfs="false" --cgroups_hierarchy="/sys/fs/cgroup" --cgroups_limit_swap="false" --cgroups_root="mesos" --container_disk_watch_interval="15secs" --containerizers="mesos" --credential="/tmp/Endpoint_SlaveEndpointTest_NoAuthorizer_0_BAJ0Qc/credential" --default_role="*" --disk_watch_interval="1mins" --docker="docker" --docker_kill_orphans="true" --docker_registry="https://registry-1.docker.io" --docker_remove_delay="6hrs" --docker_socket="/var/run/docker.sock" --docker_stop_timeout="0ns" --docker_store_dir="/tmp/mesos/store/docker" --docker_volume_checkpoint_dir="/var/run/mesos/isolators/docker/volume" --enforce_container_disk_quota="false" --executor_registration_timeout="1mins" --executor_reregistration_timeout="2secs" --executor_secret_key="/tmp/Endpoint_SlaveEndpointTest_NoAuthorizer_0_BAJ0Qc/executor_secret_key" --executor_shutdown_grace_period="5secs" --fetcher_cache_dir="/tmp/Endpoint_SlaveEndpointTest_NoAuthorizer_0_BAJ0Qc/fetch" --fetcher_cache_size="2GB" --frameworks_home="" --gc_delay="1weeks" --gc_disk_headroom="0.1" --hadoop_home="" --help="false" --hostname_lookup="true" --http_command_executor="false" --http_credentials="/tmp/Endpoint_SlaveEndpointTest_NoAuthorizer_0_BAJ0Qc/http_credentials" --http_heartbeat_interval="30secs" --initialize_driver_logging="true" --isolation="posix/cpu,posix/mem" --launcher="posix" --launcher_dir="/mesos/mesos-1.3.2/_build/src" --logbufsecs="0" --logging_level="INFO" --max_completed_executors_per_framework="150" --oversubscribed_resources_interval="15secs" --perf_duration="10secs" --perf_interval="1mins" --port="5051" --qos_correction_interval_min="0ns" --quiet="false" --recover="reconnect" --recovery_timeout="15mins" --registration_backoff_factor="10ms" --resources="cpus:2;gpus:0;mem:1024;disk:1024;ports:[31000-32000]" --revocable_cpu_low_priority="true" --runtime_dir="/tmp/Endpoint_SlaveEndpointTest_NoAuthorizer_0_BAJ0Qc" --sandbox_directory="/mnt/mesos/sandbox" --strict="true" --switch_user="true" --systemd_enable_support="true" --systemd_runtime_directory="/run/systemd/system" --version="false" --work_dir="/tmp/Endpoint_SlaveEndpointTest_NoAuthorizer_0_A9mLzG"
I0824 17:47:14.078608 21486 credentials.hpp:86] Loading credential for authentication from '/tmp/Endpoint_SlaveEndpointTest_NoAuthorizer_0_BAJ0Qc/credential'
I0824 17:47:14.078769 21486 slave.cpp:264] Agent using credential for: test-principal
I0824 17:47:14.078791 21486 credentials.hpp:37] Loading credentials for authentication from '/tmp/Endpoint_SlaveEndpointTest_NoAuthorizer_0_BAJ0Qc/http_credentials'
I0824 17:47:14.079059 21486 http.cpp:975] Creating default 'basic' HTTP authenticator for realm 'mesos-agent-executor'
I0824 17:47:14.079172 21486 http.cpp:996] Creating default 'jwt' HTTP authenticator for realm 'mesos-agent-executor'
I0824 17:47:14.079396 21486 http.cpp:975] Creating default 'basic' HTTP authenticator for realm 'mesos-agent-readonly'
I0824 17:47:14.079545 21486 http.cpp:996] Creating default 'jwt' HTTP authenticator for realm 'mesos-agent-readonly'
I0824 17:47:14.079825 21486 http.cpp:975] Creating default 'basic' HTTP authenticator for realm 'mesos-agent-readwrite'
I0824 17:47:14.079984 21486 http.cpp:996] Creating default 'jwt' HTTP authenticator for realm 'mesos-agent-readwrite'
I0824 17:47:14.081444 21486 slave.cpp:531] Agent resources: cpus(*):2; mem(*):1024; disk(*):1024; ports(*):[31000-32000]
I0824 17:47:14.081529 21486 slave.cpp:539] Agent attributes: [ ]
I0824 17:47:14.081543 21486 slave.cpp:544] Agent hostname: dfcf3e75d200
I0824 17:47:14.081673 21477 status_update_manager.cpp:177] Pausing sending status updates
I0824 17:47:14.083284 21480 state.cpp:62] Recovering state from '/tmp/Endpoint_SlaveEndpointTest_NoAuthorizer_0_A9mLzG/meta'
I0824 17:47:14.083645 21486 status_update_manager.cpp:203] Recovering status update manager
I0824 17:47:14.083925 21487 containerizer.cpp:608] Recovering containerizer
I0824 17:47:14.085551 21490 provisioner.cpp:410] Provisioner recovery complete
I0824 17:47:14.085985 21493 slave.cpp:6107] Finished recovery
I0824 17:47:14.086495 21493 slave.cpp:6289] Querying resource estimator for oversubscribable resources
I0824 17:47:14.086769 21491 slave.cpp:6303] Received oversubscribable resources {} from the resource estimator
I0824 17:47:14.088629 21486 process.cpp:3741] Handling HTTP event for process 'slave(747)' with path: '/slave(747)/monitor/statistics'
I0824 17:47:14.090679 21493 http.cpp:1115] HTTP GET for /slave(747)/monitor/statistics from 172.17.0.4:52364
I0824 17:47:14.090754 21493 http.cpp:936] Authorizing principal 'test-principal' to GET the '/monitor/statistics' endpoint
I0824 17:47:14.094056 21486 slave.cpp:796] Agent terminating
[ OK ] Endpoint/SlaveEndpointTest.NoAuthorizer/0 (30 ms)
[ RUN ] Endpoint/SlaveEndpointTest.NoAuthorizer/1
I0824 17:47:14.104656 2251 containerizer.cpp:221] Using isolation: posix/cpu,posix/mem,filesystem/posix,network/cni
W0824 17:47:14.105173 2251 backend.cpp:76] Failed to create 'aufs' backend: AufsBackend requires root privileges
W0824 17:47:14.105276 2251 backend.cpp:76] Failed to create 'bind' backend: BindBackend requires root privileges
I0824 17:47:14.105307 2251 provisioner.cpp:249] Using default backend 'copy'
I0824 17:47:14.106987 2251 cluster.cpp:448] Creating default 'local' authorizer
I0824 17:47:14.108686 21494 slave.cpp:231] Mesos agent started on (748)@172.17.0.4:35835
I0824 17:47:14.108710 21494 slave.cpp:232] Flags at startup: --acls="" --appc_simple_discovery_uri_prefix="http://" --appc_store_dir="/tmp/mesos/store/appc" --authenticate_http_executors="true" --authenticate_http_readonly="true" --authenticate_http_readwrite="true" --authenticatee="crammd5" --authentication_backoff_factor="1secs" --authorizer="local" --cgroups_cpu_enable_pids_and_tids_count="false" --cgroups_enable_cfs="false" --cgroups_hierarchy="/sys/fs/cgroup" --cgroups_limit_swap="false" --cgroups_root="mesos" --container_disk_watch_interval="15secs" --containerizers="mesos" --credential="/tmp/Endpoint_SlaveEndpointTest_NoAuthorizer_1_rAmsdi/credential" --default_role="*" --disk_watch_interval="1mins" --docker="docker" --docker_kill_orphans="true" --docker_registry="https://registry-1.docker.io" --docker_remove_delay="6hrs" --docker_socket="/var/run/docker.sock" --docker_stop_timeout="0ns" --docker_store_dir="/tmp/mesos/store/docker" --docker_volume_checkpoint_dir="/var/run/mesos/isolators/docker/volume" --enforce_container_disk_quota="false" --executor_registration_timeout="1mins" --executor_reregistration_timeout="2secs" --executor_secret_key="/tmp/Endpoint_SlaveEndpointTest_NoAuthorizer_1_rAmsdi/executor_secret_key" --executor_shutdown_grace_period="5secs" --fetcher_cache_dir="/tmp/Endpoint_SlaveEndpointTest_NoAuthorizer_1_rAmsdi/fetch" --fetcher_cache_size="2GB" --frameworks_home="" --gc_delay="1weeks" --gc_disk_headroom="0.1" --hadoop_home="" --help="false" --hostname_lookup="true" --http_command_executor="false" --http_credentials="/tmp/Endpoint_SlaveEndpointTest_NoAuthorizer_1_rAmsdi/http_credentials" --http_heartbeat_interval="30secs" --initialize_driver_logging="true" --isolation="posix/cpu,posix/mem" --launcher="posix" --launcher_dir="/mesos/mesos-1.3.2/_build/src" --logbufsecs="0" --logging_level="INFO" --max_completed_executors_per_framework="150" --oversubscribed_resources_interval="15secs" --perf_duration="10secs" --perf_interval="1mins" --port="5051" --qos_correction_interval_min="0ns" --quiet="false" --recover="reconnect" --recovery_timeout="15mins" --registration_backoff_factor="10ms" --resources="cpus:2;gpus:0;mem:1024;disk:1024;ports:[31000-32000]" --revocable_cpu_low_priority="true" --runtime_dir="/tmp/Endpoint_SlaveEndpointTest_NoAuthorizer_1_rAmsdi" --sandbox_directory="/mnt/mesos/sandbox" --strict="true" --switch_user="true" --systemd_enable_support="true" --systemd_runtime_directory="/run/systemd/system" --version="false" --work_dir="/tmp/Endpoint_SlaveEndpointTest_NoAuthorizer_1_mUsGRL"
I0824 17:47:14.109097 21494 credentials.hpp:86] Loading credential for authentication from '/tmp/Endpoint_SlaveEndpointTest_NoAuthorizer_1_rAmsdi/credential'
I0824 17:47:14.109284 21494 slave.cpp:264] Agent using credential for: test-principal
I0824 17:47:14.109308 21494 credentials.hpp:37] Loading credentials for authentication from '/tmp/Endpoint_SlaveEndpointTest_NoAuthorizer_1_rAmsdi/http_credentials'
I0824 17:47:14.109582 21494 http.cpp:975] Creating default 'basic' HTTP authenticator for realm 'mesos-agent-executor'
I0824 17:47:14.109697 21494 http.cpp:996] Creating default 'jwt' HTTP authenticator for realm 'mesos-agent-executor'
I0824 17:47:14.109905 21494 http.cpp:975] Creating default 'basic' HTTP authenticator for realm 'mesos-agent-readonly'
I0824 17:47:14.110028 21494 http.cpp:996] Creating default 'jwt' HTTP authenticator for realm 'mesos-agent-readonly'
I0824 17:47:14.110224 21494 http.cpp:975] Creating default 'basic' HTTP authenticator for realm 'mesos-agent-readwrite'
I0824 17:47:14.110333 21494 http.cpp:996] Creating default 'jwt' HTTP authenticator for realm 'mesos-agent-readwrite'
I0824 17:47:14.111744 21494 slave.cpp:531] Agent resources: cpus(*):2; mem(*):1024; disk(*):1024; ports(*):[31000-32000]
I0824 17:47:14.111829 21494 slave.cpp:539] Agent attributes: [ ]
I0824 17:47:14.111842 21494 slave.cpp:544] Agent hostname: dfcf3e75d200
I0824 17:47:14.111976 21492 status_update_manager.cpp:177] Pausing sending status updates
I0824 17:47:14.113462 21479 state.cpp:62] Recovering state from '/tmp/Endpoint_SlaveEndpointTest_NoAuthorizer_1_mUsGRL/meta'
I0824 17:47:14.113864 21500 status_update_manager.cpp:203] Recovering status update manager
I0824 17:47:14.114074 21496 containerizer.cpp:608] Recovering containerizer
I0824 17:47:14.115413 21494 provisioner.cpp:410] Provisioner recovery complete
I0824 17:47:14.115916 21499 slave.cpp:6107] Finished recovery
I0824 17:47:14.116469 21499 slave.cpp:6289] Querying resource estimator for oversubscribable resources
I0824 17:47:14.116861 21482 slave.cpp:6303] Received oversubscribable resources {} from the resource estimator
I0824 17:47:14.119112 21486 process.cpp:3741] Handling HTTP event for process 'slave(748)' with path: '/slave(748)/monitor/statistics.json'
I0824 17:47:14.120975 21485 http.cpp:1115] HTTP GET for /slave(748)/monitor/statistics.json from 172.17.0.4:52366
I0824 17:47:14.121062 21485 http.cpp:936] Authorizing principal 'test-principal' to GET the '/monitor/statistics.json' endpoint
I0824 17:47:14.124511 21483 slave.cpp:796] Agent terminating
[ OK ] Endpoint/SlaveEndpointTest.NoAuthorizer/1 (31 ms)
[ RUN ] Endpoint/SlaveEndpointTest.NoAuthorizer/2
I0824 17:47:14.135612 2251 containerizer.cpp:221] Using isolation: posix/cpu,posix/mem,filesystem/posix,network/cni
W0824 17:47:14.136170 2251 backend.cpp:76] Failed to create 'aufs' backend: AufsBackend requires root privileges
W0824 17:47:14.136298 2251 backend.cpp:76] Failed to create 'bind' backend: BindBackend requires root privileges
I0824 17:47:14.136340 2251 provisioner.cpp:249] Using default backend 'copy'
I0824 17:47:14.137907 2251 cluster.cpp:448] Creating default 'local' authorizer
I0824 17:47:14.139710 21494 slave.cpp:231] Mesos agent started on (749)@172.17.0.4:35835
I0824 17:47:14.139731 21494 slave.cpp:232] Flags at startup: --acls="" --appc_simple_discovery_uri_prefix="http://" --appc_store_dir="/tmp/mesos/store/appc" --authenticate_http_executors="true" --authenticate_http_readonly="true" --authenticate_http_readwrite="true" --authenticatee="crammd5" --authentication_backoff_factor="1secs" --authorizer="local" --cgroups_cpu_enable_pids_and_tids_count="false" --cgroups_enable_cfs="false" --cgroups_hierarchy="/sys/fs/cgroup" --cgroups_limit_swap="false" --cgroups_root="mesos" --container_disk_watch_interval="15secs" --containerizers="mesos" --credential="/tmp/Endpoint_SlaveEndpointTest_NoAuthorizer_2_hcL9Rn/credential" --default_role="*" --disk_watch_interval="1mins" --docker="docker" --docker_kill_orphans="true" --docker_registry="https://registry-1.docker.io" --docker_remove_delay="6hrs" --docker_socket="/var/run/docker.sock" --docker_stop_timeout="0ns" --docker_store_dir="/tmp/mesos/store/docker" --docker_volume_checkpoint_dir="/var/run/mesos/isolators/docker/volume" --enforce_container_disk_quota="false" --executor_registration_timeout="1mins" --executor_reregistration_timeout="2secs" --executor_secret_key="/tmp/Endpoint_SlaveEndpointTest_NoAuthorizer_2_hcL9Rn/executor_secret_key" --executor_shutdown_grace_period="5secs" --fetcher_cache_dir="/tmp/Endpoint_SlaveEndpointTest_NoAuthorizer_2_hcL9Rn/fetch" --fetcher_cache_size="2GB" --frameworks_home="" --gc_delay="1weeks" --gc_disk_headroom="0.1" --hadoop_home="" --help="false" --hostname_lookup="true" --http_command_executor="false" --http_credentials="/tmp/Endpoint_SlaveEndpointTest_NoAuthorizer_2_hcL9Rn/http_credentials" --http_heartbeat_interval="30secs" --initialize_driver_logging="true" --isolation="posix/cpu,posix/mem" --launcher="posix" --launcher_dir="/mesos/mesos-1.3.2/_build/src" --logbufsecs="0" --logging_level="INFO" --max_completed_executors_per_framework="150" --oversubscribed_resources_interval="15secs" --perf_duration="10secs" --perf_interval="1mins" --port="5051" --qos_correction_interval_min="0ns" --quiet="false" --recover="reconnect" --recovery_timeout="15mins" --registration_backoff_factor="10ms" --resources="cpus:2;gpus:0;mem:1024;disk:1024;ports:[31000-32000]" --revocable_cpu_low_priority="true" --runtime_dir="/tmp/Endpoint_SlaveEndpointTest_NoAuthorizer_2_hcL9Rn" --sandbox_directory="/mnt/mesos/sandbox" --strict="true" --switch_user="true" --systemd_enable_support="true" --systemd_runtime_directory="/run/systemd/system" --version="false" --work_dir="/tmp/Endpoint_SlaveEndpointTest_NoAuthorizer_2_uoDMrR"
I0824 17:47:14.140152 21494 credentials.hpp:86] Loading credential for authentication from '/tmp/Endpoint_SlaveEndpointTest_NoAuthorizer_2_hcL9Rn/credential'
I0824 17:47:14.140347 21494 slave.cpp:264] Agent using credential for: test-principal
I0824 17:47:14.140375 21494 credentials.hpp:37] Loading credentials for authentication from '/tmp/Endpoint_SlaveEndpointTest_NoAuthorizer_2_hcL9Rn/http_credentials'
I0824 17:47:14.140676 21494 http.cpp:975] Creating default 'basic' HTTP authenticator for realm 'mesos-agent-executor'
I0824 17:47:14.140811 21494 http.cpp:996] Creating default 'jwt' HTTP authenticator for realm 'mesos-agent-executor'
I0824 17:47:14.141139 21494 http.cpp:975] Creating default 'basic' HTTP authenticator for realm 'mesos-agent-readonly'
I0824 17:47:14.141250 21494 http.cpp:996] Creating default 'jwt' HTTP authenticator for realm 'mesos-agent-readonly'
I0824 17:47:14.141557 21494 http.cpp:975] Creating default 'basic' HTTP authenticator for realm 'mesos-agent-readwrite'
I0824 17:47:14.141679 21494 http.cpp:996] Creating default 'jwt' HTTP authenticator for realm 'mesos-agent-readwrite'
I0824 17:47:14.143226 21494 slave.cpp:531] Agent resources: cpus(*):2; mem(*):1024; disk(*):1024; ports(*):[31000-32000]
I0824 17:47:14.143327 21494 slave.cpp:539] Agent attributes: [ ]
I0824 17:47:14.143342 21494 slave.cpp:544] Agent hostname: dfcf3e75d200
I0824 17:47:14.143487 21491 status_update_manager.cpp:177] Pausing sending status updates
I0824 17:47:14.145015 21487 state.cpp:62] Recovering state from '/tmp/Endpoint_SlaveEndpointTest_NoAuthorizer_2_uoDMrR/meta'
I0824 17:47:14.145411 21495 status_update_manager.cpp:203] Recovering status update manager
I0824 17:47:14.145692 21500 containerizer.cpp:608] Recovering containerizer
I0824 17:47:14.147264 21478 provisioner.cpp:410] Provisioner recovery complete
I0824 17:47:14.147744 21499 slave.cpp:6107] Finished recovery
I0824 17:47:14.148217 21499 slave.cpp:6289] Querying resource estimator for oversubscribable resources
I0824 17:47:14.148519 21496 slave.cpp:6303] Received oversubscribable resources {} from the resource estimator
I0824 17:47:14.150885 21478 process.cpp:3741] Handling HTTP event for process 'slave(749)' with path: '/slave(749)/containers'
I0824 17:47:14.152719 21477 http.cpp:1115] HTTP GET for /slave(749)/containers from 172.17.0.4:52368
I0824 17:47:14.152801 21477 http.cpp:936] Authorizing principal 'test-principal' to GET the '/containers' endpoint
I0824 17:47:14.156240 21493 slave.cpp:796] Agent terminating
[ OK ] Endpoint/SlaveEndpointTest.NoAuthorizer/2 (31 ms)
[----------] 9 tests from Endpoint/SlaveEndpointTest (279 ms total)
[----------] Global test environment tear-down
[==========] 1575 tests from 177 test cases ran. (679190 ms total)
[ PASSED ] 1573 tests.
[ FAILED ] 2 tests, listed below:
[ FAILED ] CommandExecutorCheckTest.CommandCheckDeliveredAndReconciled
[ FAILED ] DefaultExecutorCheckTest.CommandCheckDeliveredAndReconciled
2 FAILED TESTS
YOU HAVE 22 DISABLED TESTS
E0824 17:47:14.227200 21501 process.cpp:956] Failed to accept socket: future discarded
make[4]: *** [check-local] Error 1
make[4]: Leaving directory `/mesos/mesos-1.3.2/_build/src'
make[3]: *** [check-am] Error 2
make[3]: Leaving directory `/mesos/mesos-1.3.2/_build/src'
make[2]: *** [check] Error 2
make[2]: Leaving directory `/mesos/mesos-1.3.2/_build/src'
make[1]: *** [check-recursive] Error 1
make[1]: Leaving directory `/mesos/mesos-1.3.2/_build'
make: *** [distcheck] Error 1
+ docker rmi mesos-1503593987-26676
Untagged: mesos-1503593987-26676:latest
Deleted: sha256:a1b7ddc059130f69e2647962ed8585a0b54a32b9834c7811168ff9aa1fadf9d2
Deleted: sha256:b9142e354ead1f42bff3a73bfba566483fd2f1a085e05e8ba22af680e05cf715
Deleted: sha256:7d9d99068b4a02ca1c238ae1bcb2e578e3c26c513551bbac96687b0f6e7d7cb0
Deleted: sha256:00a7900e64fb400701cb2590fb99ccc2d2941ca275fa55f0556734655091ed99
Deleted: sha256:5f1be15be8df76b6a2e998985246988160fa83b7bdd47bb5821cd8bab036f6d6
Deleted: sha256:09a595f22c1a63733bed9ac7ae0162e5755b05cbee2bde4640099c390a2d0db9
Deleted: sha256:ef03e133c75f24baeb3869de294d7d8fa49d4a94be48bf059f781a276d0d8016
Deleted: sha256:202cec0b885e26eed791fa3111111548dd25919067d61ee354e7ddb8754786bc
Deleted: sha256:272e96dcbece3edd468d22d635062098c24d13d7c96f59c334affb66dccaa18b
Deleted: sha256:1a28db6846deb7ae01cb7a2d772151c32110853b47410f82ceb3f389120c9631
Deleted: sha256:8af0fe7eccf44a47f2c73db8f7f1afb542b191668f7ef4118110e9807c377020
Deleted: sha256:b002be823161704a3f3f4c73b6e8641346968e83341472c721562c6e7a6e8dac
Deleted: sha256:7d40415ee869ef65993edaf903d6519c9b17a728225b03f96268b51e182faa8e
Deleted: sha256:de48db7c52fbbad45667bfc17d328123d6f6f73f8b6754611060fd0d26271be3
Deleted: sha256:78dc93af2c7ee08ddc2637f06bd3d46e0847b55de95d8d543a2d337f756632d9
Deleted: sha256:6ada99c15cb1ba41979fcd8381c33e3adfb427579c910b3e3bc2e6579016311f
Deleted: sha256:bf3062ce9b131061f5279d47db5810a8157d330f0f07b01c559aed281f312107
Deleted: sha256:dfe011e856051869d99a69c6692075819db5796048a0c840f7be44350bd21a85
Deleted: sha256:101ec3e84fb1d6b0b389948a9b3d15959d8c0f98cbf8a0b92aac9680386fab3e
Deleted: sha256:ce9154aacc3732fd2b2743acb94b970084cb290cdbd03d0bd2d7408996a3c66f
Deleted: sha256:22b61a24b45a997a3c68e747763f53daf5df37fc3eef38fe598736f121043a7a
Deleted: sha256:b24dc42f7f870807a735d548150d9c343a654811a60a71c69a6dee4a37a9321e
Deleted: sha256:467715d96936cd6e85839edaf7af67b3ffd59ec34a701938852cda5c6188ffc7
Deleted: sha256:9612a1f8358b5fb90f8b4d5defd0a70f675fa54ecd70967ed8d158154d01886c
Deleted: sha256:4568948762115508fd2228ed13b8b826f8d3bbfa83720ec94d030b6819b2919d
Build step 'Execute shell' marked build as failure
Not sending mail to unregistered user yujie.jay@gmail.com
Build failed in Jenkins: Mesos-Buildbot » autotools,gcc,--verbose --enable-libevent --enable-ssl,GLOG_v=1 MESOS_VERBOSE=1,centos:7,(ubuntu)&&(!ubuntu-us1)&&(!ubuntu-eu2) #4146
Posted by Apache Jenkins Server <je...@builds.apache.org>.
See <https://builds.apache.org/job/Mesos-Buildbot/BUILDTOOL=autotools,COMPILER=gcc,CONFIGURATION=--verbose%20--enable-libevent%20--enable-ssl,ENVIRONMENT=GLOG_v=1%20MESOS_VERBOSE=1,OS=centos%3A7,label_exp=(ubuntu)&&(!ubuntu-us1)&&(!ubuntu-eu2)/4146/display/redirect?page=changes>
Changes:
[bmahler] Fixed a bug where the agent kills and still launches a task.
[bmahler] Improved the reason and message for tasks killed before delivery.
[bmahler] Updated Framework::removePendingTask to take only a TaskID.
[bmahler] Introduced a Framework::idle function in the agent.
[bmahler] Renamed Framework::pending to Framework::pendingTasks in agent.
[bmahler] Introduced a CHECK_NOTNONE.
[bmahler] Fixed a bug where TASK_KILLED updates can be dropped by the agent.
[bmahler] Added a test to verify a fix for MESOS-7863.
[bmahler] Added a TODO to correctly represent framework lifecycle in agent.
[bmahler] Marked Framework::hasTask in agent as const.
[bmahler] Unschedule directories for GC in parallel in the agent.
[bmahler] Implemented LinkedHashMap copy construction and assignment.
[bmahler] Controlled queued task handling with helpers in the agent.
[bmahler] Added MESOS-7865 to the 1.1.3 CHANGELOG.
[bmahler] Added MESOS-7865 to the 1.2.3 CHANGELOG.
[bmahler] Added MESOS-7865 to the 1.3.2 CHANGELOG.
[bmahler] Added MESOS-7865 to the 1.4.1 CHANGELOG.
[bmahler] Added a missing return statement from 45c2444ad.
[bmahler] Added MESOS-7863 to the 1.4.1 CHANGELOG.
[bmahler] Added MESOS-7863 to the 1.3.2 CHANGELOG.
[yujie.jay] Adjusted the ContainerLaunchInfo.command merge logic.
[yujie.jay] Added MESOS-7909 to 1.4.1 CHANGELOG.
[yujie.jay] Added MESOS-7909 to 1.3.2 CHANGELOG.
[yujie.jay] Added MESOS-7909 to 1.2.3 CHANGELOG.
[yujie.jay] Added task env overwriting executor env glog print.
[yujie.jay] Added MESOS-7858 to 1.3.2 CHANGELOG.
[yujie.jay] Added MESOS-7858 to 1.2.3 CHANGELOG.
------------------------------------------
[...truncated 32.15 MB...]
W0824 12:50:38.111629 8735 backend.cpp:76] Failed to create 'bind' backend: BindBackend requires root privileges
I0824 12:50:38.111667 8735 provisioner.cpp:255] Using default backend 'copy'
I0824 12:50:38.116585 26992 slave.cpp:252] Mesos agent started on (806)@172.17.0.2:44944
I0824 12:50:38.116614 26992 slave.cpp:253] Flags at startup: --acls="" --appc_simple_discovery_uri_prefix="http://" --appc_store_dir="/tmp/Endpoint_SlaveEndpointTest_UnauthorizedRequest_0_Bx0xqX/store/appc" --authenticate_http_executors="true" --authenticate_http_readonly="true" --authenticate_http_readwrite="true" --authenticatee="crammd5" --authentication_backoff_factor="1secs" --authorizer="local" --cgroups_cpu_enable_pids_and_tids_count="false" --cgroups_enable_cfs="false" --cgroups_hierarchy="/sys/fs/cgroup" --cgroups_limit_swap="false" --cgroups_root="mesos" --container_disk_watch_interval="15secs" --containerizers="mesos" --credential="/tmp/Endpoint_SlaveEndpointTest_UnauthorizedRequest_0_Bx0xqX/credential" --default_role="*" --disallow_sharing_agent_pid_namespace="false" --disk_watch_interval="1mins" --docker="docker" --docker_kill_orphans="true" --docker_registry="https://registry-1.docker.io" --docker_remove_delay="6hrs" --docker_socket="/var/run/docker.sock" --docker_stop_timeout="0ns" --docker_store_dir="/tmp/Endpoint_SlaveEndpointTest_UnauthorizedRequest_0_Bx0xqX/store/docker" --docker_volume_checkpoint_dir="/var/run/mesos/isolators/docker/volume" --enforce_container_disk_quota="false" --executor_registration_timeout="1mins" --executor_reregistration_timeout="2secs" --executor_secret_key="/tmp/Endpoint_SlaveEndpointTest_UnauthorizedRequest_0_Bx0xqX/executor_secret_key" --executor_shutdown_grace_period="5secs" --fetcher_cache_dir="/tmp/Endpoint_SlaveEndpointTest_UnauthorizedRequest_0_Bx0xqX/fetch" --fetcher_cache_size="2GB" --frameworks_home="" --gc_delay="1weeks" --gc_disk_headroom="0.1" --hadoop_home="" --help="false" --hostname_lookup="true" --http_command_executor="false" --http_credentials="/tmp/Endpoint_SlaveEndpointTest_UnauthorizedRequest_0_Bx0xqX/http_credentials" --http_heartbeat_interval="30secs" --initialize_driver_logging="true" --isolation="posix/cpu,posix/mem" --launcher="posix" --launcher_dir="/mesos/mesos-1.5.0/_build/src" --logbufsecs="0" --logging_level="INFO" --max_completed_executors_per_framework="150" --oversubscribed_resources_interval="15secs" --perf_duration="10secs" --perf_interval="1mins" --port="5051" --qos_correction_interval_min="0ns" --quiet="false" --recover="reconnect" --recovery_timeout="15mins" --registration_backoff_factor="10ms" --resources="cpus:2;gpus:0;mem:1024;disk:1024;ports:[31000-32000]" --revocable_cpu_low_priority="true" --runtime_dir="/tmp/Endpoint_SlaveEndpointTest_UnauthorizedRequest_0_Bx0xqX" --sandbox_directory="/mnt/mesos/sandbox" --strict="true" --switch_user="true" --systemd_enable_support="true" --systemd_runtime_directory="/run/systemd/system" --version="false" --work_dir="/tmp/Endpoint_SlaveEndpointTest_UnauthorizedRequest_0_cUHwol"
I0824 12:50:38.117234 26992 credentials.hpp:86] Loading credential for authentication from '/tmp/Endpoint_SlaveEndpointTest_UnauthorizedRequest_0_Bx0xqX/credential'
I0824 12:50:38.117419 26992 slave.cpp:285] Agent using credential for: test-principal
I0824 12:50:38.117455 26992 credentials.hpp:37] Loading credentials for authentication from '/tmp/Endpoint_SlaveEndpointTest_UnauthorizedRequest_0_Bx0xqX/http_credentials'
I0824 12:50:38.117873 26992 http.cpp:1026] Creating default 'basic' HTTP authenticator for realm 'mesos-agent-executor'
I0824 12:50:38.118022 26992 http.cpp:1047] Creating default 'jwt' HTTP authenticator for realm 'mesos-agent-executor'
I0824 12:50:38.118336 26992 http.cpp:1026] Creating default 'basic' HTTP authenticator for realm 'mesos-agent-readonly'
I0824 12:50:38.118489 26992 http.cpp:1047] Creating default 'jwt' HTTP authenticator for realm 'mesos-agent-readonly'
I0824 12:50:38.118753 26992 http.cpp:1026] Creating default 'basic' HTTP authenticator for realm 'mesos-agent-readwrite'
I0824 12:50:38.118897 26992 http.cpp:1047] Creating default 'jwt' HTTP authenticator for realm 'mesos-agent-readwrite'
I0824 12:50:38.120728 26992 slave.cpp:581] Agent resources: [{"name":"cpus","scalar":{"value":2.0},"type":"SCALAR"},{"name":"mem","scalar":{"value":1024.0},"type":"SCALAR"},{"name":"disk","scalar":{"value":1024.0},"type":"SCALAR"},{"name":"ports","ranges":{"range":[{"begin":31000,"end":32000}]},"type":"RANGES"}]
I0824 12:50:38.121037 26992 slave.cpp:589] Agent attributes: [ ]
I0824 12:50:38.121053 26992 slave.cpp:598] Agent hostname: 6c25ae897a96
I0824 12:50:38.121260 26985 status_update_manager.cpp:177] Pausing sending status updates
I0824 12:50:38.123039 26981 state.cpp:64] Recovering state from '/tmp/Endpoint_SlaveEndpointTest_UnauthorizedRequest_0_cUHwol/meta'
I0824 12:50:38.123437 26995 status_update_manager.cpp:203] Recovering status update manager
I0824 12:50:38.123721 26995 containerizer.cpp:643] Recovering containerizer
I0824 12:50:38.125649 26989 provisioner.cpp:416] Provisioner recovery complete
I0824 12:50:38.126176 26994 slave.cpp:6235] Finished recovery
I0824 12:50:38.126680 26994 slave.cpp:6417] Querying resource estimator for oversubscribable resources
I0824 12:50:38.127023 26983 slave.cpp:6431] Received oversubscribable resources {} from the resource estimator
I0824 12:50:38.129650 26993 process.cpp:3933] Handling HTTP event for process 'slave(806)' with path: '/slave(806)/monitor/statistics'
I0824 12:50:38.131786 26990 http.cpp:1166] HTTP GET for /slave(806)/monitor/statistics from 172.17.0.2:48701
I0824 12:50:38.131862 26990 http.cpp:957] Authorizing principal 'test-principal' to GET the '/monitor/statistics' endpoint
I0824 12:50:38.134135 8735 slave.cpp:859] Agent terminating
[ OK ] Endpoint/SlaveEndpointTest.UnauthorizedRequest/0 (38 ms)
[ RUN ] Endpoint/SlaveEndpointTest.UnauthorizedRequest/1
I0824 12:50:38.148823 8735 containerizer.cpp:288] Using isolation { environment_secret, posix/cpu, posix/mem, filesystem/posix, network/cni }
W0824 12:50:38.149431 8735 backend.cpp:76] Failed to create 'aufs' backend: AufsBackend requires root privileges
W0824 12:50:38.149574 8735 backend.cpp:76] Failed to create 'bind' backend: BindBackend requires root privileges
I0824 12:50:38.149613 8735 provisioner.cpp:255] Using default backend 'copy'
I0824 12:50:38.153988 26989 slave.cpp:252] Mesos agent started on (807)@172.17.0.2:44944
I0824 12:50:38.154016 26989 slave.cpp:253] Flags at startup: --acls="" --appc_simple_discovery_uri_prefix="http://" --appc_store_dir="/tmp/Endpoint_SlaveEndpointTest_UnauthorizedRequest_1_56NNTp/store/appc" --authenticate_http_executors="true" --authenticate_http_readonly="true" --authenticate_http_readwrite="true" --authenticatee="crammd5" --authentication_backoff_factor="1secs" --authorizer="local" --cgroups_cpu_enable_pids_and_tids_count="false" --cgroups_enable_cfs="false" --cgroups_hierarchy="/sys/fs/cgroup" --cgroups_limit_swap="false" --cgroups_root="mesos" --container_disk_watch_interval="15secs" --containerizers="mesos" --credential="/tmp/Endpoint_SlaveEndpointTest_UnauthorizedRequest_1_56NNTp/credential" --default_role="*" --disallow_sharing_agent_pid_namespace="false" --disk_watch_interval="1mins" --docker="docker" --docker_kill_orphans="true" --docker_registry="https://registry-1.docker.io" --docker_remove_delay="6hrs" --docker_socket="/var/run/docker.sock" --docker_stop_timeout="0ns" --docker_store_dir="/tmp/Endpoint_SlaveEndpointTest_UnauthorizedRequest_1_56NNTp/store/docker" --docker_volume_checkpoint_dir="/var/run/mesos/isolators/docker/volume" --enforce_container_disk_quota="false" --executor_registration_timeout="1mins" --executor_reregistration_timeout="2secs" --executor_secret_key="/tmp/Endpoint_SlaveEndpointTest_UnauthorizedRequest_1_56NNTp/executor_secret_key" --executor_shutdown_grace_period="5secs" --fetcher_cache_dir="/tmp/Endpoint_SlaveEndpointTest_UnauthorizedRequest_1_56NNTp/fetch" --fetcher_cache_size="2GB" --frameworks_home="" --gc_delay="1weeks" --gc_disk_headroom="0.1" --hadoop_home="" --help="false" --hostname_lookup="true" --http_command_executor="false" --http_credentials="/tmp/Endpoint_SlaveEndpointTest_UnauthorizedRequest_1_56NNTp/http_credentials" --http_heartbeat_interval="30secs" --initialize_driver_logging="true" --isolation="posix/cpu,posix/mem" --launcher="posix" --launcher_dir="/mesos/mesos-1.5.0/_build/src" --logbufsecs="0" --logging_level="INFO" --max_completed_executors_per_framework="150" --oversubscribed_resources_interval="15secs" --perf_duration="10secs" --perf_interval="1mins" --port="5051" --qos_correction_interval_min="0ns" --quiet="false" --recover="reconnect" --recovery_timeout="15mins" --registration_backoff_factor="10ms" --resources="cpus:2;gpus:0;mem:1024;disk:1024;ports:[31000-32000]" --revocable_cpu_low_priority="true" --runtime_dir="/tmp/Endpoint_SlaveEndpointTest_UnauthorizedRequest_1_56NNTp" --sandbox_directory="/mnt/mesos/sandbox" --strict="true" --switch_user="true" --systemd_enable_support="true" --systemd_runtime_directory="/run/systemd/system" --version="false" --work_dir="/tmp/Endpoint_SlaveEndpointTest_UnauthorizedRequest_1_Q89BLN"
I0824 12:50:38.154649 26989 credentials.hpp:86] Loading credential for authentication from '/tmp/Endpoint_SlaveEndpointTest_UnauthorizedRequest_1_56NNTp/credential'
I0824 12:50:38.154830 26989 slave.cpp:285] Agent using credential for: test-principal
I0824 12:50:38.154928 26989 credentials.hpp:37] Loading credentials for authentication from '/tmp/Endpoint_SlaveEndpointTest_UnauthorizedRequest_1_56NNTp/http_credentials'
I0824 12:50:38.155326 26989 http.cpp:1026] Creating default 'basic' HTTP authenticator for realm 'mesos-agent-executor'
I0824 12:50:38.155469 26989 http.cpp:1047] Creating default 'jwt' HTTP authenticator for realm 'mesos-agent-executor'
I0824 12:50:38.155758 26989 http.cpp:1026] Creating default 'basic' HTTP authenticator for realm 'mesos-agent-readonly'
I0824 12:50:38.155948 26989 http.cpp:1047] Creating default 'jwt' HTTP authenticator for realm 'mesos-agent-readonly'
I0824 12:50:38.156213 26989 http.cpp:1026] Creating default 'basic' HTTP authenticator for realm 'mesos-agent-readwrite'
I0824 12:50:38.156364 26989 http.cpp:1047] Creating default 'jwt' HTTP authenticator for realm 'mesos-agent-readwrite'
I0824 12:50:38.158135 26989 slave.cpp:581] Agent resources: [{"name":"cpus","scalar":{"value":2.0},"type":"SCALAR"},{"name":"mem","scalar":{"value":1024.0},"type":"SCALAR"},{"name":"disk","scalar":{"value":1024.0},"type":"SCALAR"},{"name":"ports","ranges":{"range":[{"begin":31000,"end":32000}]},"type":"RANGES"}]
I0824 12:50:38.158432 26989 slave.cpp:589] Agent attributes: [ ]
I0824 12:50:38.158452 26989 slave.cpp:598] Agent hostname: 6c25ae897a96
I0824 12:50:38.158607 26988 status_update_manager.cpp:177] Pausing sending status updates
I0824 12:50:38.160114 26981 state.cpp:64] Recovering state from '/tmp/Endpoint_SlaveEndpointTest_UnauthorizedRequest_1_Q89BLN/meta'
I0824 12:50:38.160506 26992 status_update_manager.cpp:203] Recovering status update manager
I0824 12:50:38.160734 26990 containerizer.cpp:643] Recovering containerizer
I0824 12:50:38.162309 26993 provisioner.cpp:416] Provisioner recovery complete
I0824 12:50:38.162739 26984 slave.cpp:6235] Finished recovery
I0824 12:50:38.163233 26984 slave.cpp:6417] Querying resource estimator for oversubscribable resources
I0824 12:50:38.163548 26982 slave.cpp:6431] Received oversubscribable resources {} from the resource estimator
I0824 12:50:38.165940 26994 process.cpp:3933] Handling HTTP event for process 'slave(807)' with path: '/slave(807)/monitor/statistics.json'
I0824 12:50:38.167928 26992 http.cpp:1166] HTTP GET for /slave(807)/monitor/statistics.json from 172.17.0.2:48702
I0824 12:50:38.168009 26992 http.cpp:957] Authorizing principal 'test-principal' to GET the '/monitor/statistics.json' endpoint
I0824 12:50:38.170461 26990 slave.cpp:859] Agent terminating
[ OK ] Endpoint/SlaveEndpointTest.UnauthorizedRequest/1 (35 ms)
[ RUN ] Endpoint/SlaveEndpointTest.UnauthorizedRequest/2
I0824 12:50:38.184437 8735 containerizer.cpp:288] Using isolation { environment_secret, posix/cpu, posix/mem, filesystem/posix, network/cni }
W0824 12:50:38.185032 8735 backend.cpp:76] Failed to create 'aufs' backend: AufsBackend requires root privileges
W0824 12:50:38.185158 8735 backend.cpp:76] Failed to create 'bind' backend: BindBackend requires root privileges
I0824 12:50:38.185195 8735 provisioner.cpp:255] Using default backend 'copy'
I0824 12:50:38.189484 26992 slave.cpp:252] Mesos agent started on (808)@172.17.0.2:44944
I0824 12:50:38.189599 26992 slave.cpp:253] Flags at startup: --acls="" --appc_simple_discovery_uri_prefix="http://" --appc_store_dir="/tmp/Endpoint_SlaveEndpointTest_UnauthorizedRequest_2_qUMmKS/store/appc" --authenticate_http_executors="true" --authenticate_http_readonly="true" --authenticate_http_readwrite="true" --authenticatee="crammd5" --authentication_backoff_factor="1secs" --authorizer="local" --cgroups_cpu_enable_pids_and_tids_count="false" --cgroups_enable_cfs="false" --cgroups_hierarchy="/sys/fs/cgroup" --cgroups_limit_swap="false" --cgroups_root="mesos" --container_disk_watch_interval="15secs" --containerizers="mesos" --credential="/tmp/Endpoint_SlaveEndpointTest_UnauthorizedRequest_2_qUMmKS/credential" --default_role="*" --disallow_sharing_agent_pid_namespace="false" --disk_watch_interval="1mins" --docker="docker" --docker_kill_orphans="true" --docker_registry="https://registry-1.docker.io" --docker_remove_delay="6hrs" --docker_socket="/var/run/docker.sock" --docker_stop_timeout="0ns" --docker_store_dir="/tmp/Endpoint_SlaveEndpointTest_UnauthorizedRequest_2_qUMmKS/store/docker" --docker_volume_checkpoint_dir="/var/run/mesos/isolators/docker/volume" --enforce_container_disk_quota="false" --executor_registration_timeout="1mins" --executor_reregistration_timeout="2secs" --executor_secret_key="/tmp/Endpoint_SlaveEndpointTest_UnauthorizedRequest_2_qUMmKS/executor_secret_key" --executor_shutdown_grace_period="5secs" --fetcher_cache_dir="/tmp/Endpoint_SlaveEndpointTest_UnauthorizedRequest_2_qUMmKS/fetch" --fetcher_cache_size="2GB" --frameworks_home="" --gc_delay="1weeks" --gc_disk_headroom="0.1" --hadoop_home="" --help="false" --hostname_lookup="true" --http_command_executor="false" --http_credentials="/tmp/Endpoint_SlaveEndpointTest_UnauthorizedRequest_2_qUMmKS/http_credentials" --http_heartbeat_interval="30secs" --initialize_driver_logging="true" --isolation="posix/cpu,posix/mem" --launcher="posix" --launcher_dir="/mesos/mesos-1.5.0/_build/src" --logbufsecs="0" --logging_level="INFO" --max_completed_executors_per_framework="150" --oversubscribed_resources_interval="15secs" --perf_duration="10secs" --perf_interval="1mins" --port="5051" --qos_correction_interval_min="0ns" --quiet="false" --recover="reconnect" --recovery_timeout="15mins" --registration_backoff_factor="10ms" --resources="cpus:2;gpus:0;mem:1024;disk:1024;ports:[31000-32000]" --revocable_cpu_low_priority="true" --runtime_dir="/tmp/Endpoint_SlaveEndpointTest_UnauthorizedRequest_2_qUMmKS" --sandbox_directory="/mnt/mesos/sandbox" --strict="true" --switch_user="true" --systemd_enable_support="true" --systemd_runtime_directory="/run/systemd/system" --version="false" --work_dir="/tmp/Endpoint_SlaveEndpointTest_UnauthorizedRequest_2_p2kowg"
I0824 12:50:38.190116 26992 credentials.hpp:86] Loading credential for authentication from '/tmp/Endpoint_SlaveEndpointTest_UnauthorizedRequest_2_qUMmKS/credential'
I0824 12:50:38.190289 26992 slave.cpp:285] Agent using credential for: test-principal
I0824 12:50:38.190317 26992 credentials.hpp:37] Loading credentials for authentication from '/tmp/Endpoint_SlaveEndpointTest_UnauthorizedRequest_2_qUMmKS/http_credentials'
I0824 12:50:38.190659 26992 http.cpp:1026] Creating default 'basic' HTTP authenticator for realm 'mesos-agent-executor'
I0824 12:50:38.190795 26992 http.cpp:1047] Creating default 'jwt' HTTP authenticator for realm 'mesos-agent-executor'
I0824 12:50:38.191045 26992 http.cpp:1026] Creating default 'basic' HTTP authenticator for realm 'mesos-agent-readonly'
I0824 12:50:38.191174 26992 http.cpp:1047] Creating default 'jwt' HTTP authenticator for realm 'mesos-agent-readonly'
I0824 12:50:38.191429 26992 http.cpp:1026] Creating default 'basic' HTTP authenticator for realm 'mesos-agent-readwrite'
I0824 12:50:38.191562 26992 http.cpp:1047] Creating default 'jwt' HTTP authenticator for realm 'mesos-agent-readwrite'
I0824 12:50:38.193282 26992 slave.cpp:581] Agent resources: [{"name":"cpus","scalar":{"value":2.0},"type":"SCALAR"},{"name":"mem","scalar":{"value":1024.0},"type":"SCALAR"},{"name":"disk","scalar":{"value":1024.0},"type":"SCALAR"},{"name":"ports","ranges":{"range":[{"begin":31000,"end":32000}]},"type":"RANGES"}]
I0824 12:50:38.193593 26992 slave.cpp:589] Agent attributes: [ ]
I0824 12:50:38.193609 26992 slave.cpp:598] Agent hostname: 6c25ae897a96
I0824 12:50:38.193773 26993 status_update_manager.cpp:177] Pausing sending status updates
I0824 12:50:38.195329 26989 state.cpp:64] Recovering state from '/tmp/Endpoint_SlaveEndpointTest_UnauthorizedRequest_2_p2kowg/meta'
I0824 12:50:38.195691 26987 status_update_manager.cpp:203] Recovering status update manager
I0824 12:50:38.195915 26987 containerizer.cpp:643] Recovering containerizer
I0824 12:50:38.197558 26988 provisioner.cpp:416] Provisioner recovery complete
I0824 12:50:38.197980 26986 slave.cpp:6235] Finished recovery
I0824 12:50:38.198460 26986 slave.cpp:6417] Querying resource estimator for oversubscribable resources
I0824 12:50:38.198719 26980 slave.cpp:6431] Received oversubscribable resources {} from the resource estimator
I0824 12:50:38.200862 26981 process.cpp:3933] Handling HTTP event for process 'slave(808)' with path: '/slave(808)/containers'
I0824 12:50:38.202829 26985 http.cpp:1166] HTTP GET for /slave(808)/containers from 172.17.0.2:48703
I0824 12:50:38.202919 26985 http.cpp:957] Authorizing principal 'test-principal' to GET the '/containers' endpoint
I0824 12:50:38.205457 26980 slave.cpp:859] Agent terminating
[ OK ] Endpoint/SlaveEndpointTest.UnauthorizedRequest/2 (35 ms)
[ RUN ] Endpoint/SlaveEndpointTest.NoAuthorizer/0
I0824 12:50:38.218716 8735 containerizer.cpp:288] Using isolation { environment_secret, posix/cpu, posix/mem, filesystem/posix, network/cni }
W0824 12:50:38.219177 8735 backend.cpp:76] Failed to create 'aufs' backend: AufsBackend requires root privileges
W0824 12:50:38.219277 8735 backend.cpp:76] Failed to create 'bind' backend: BindBackend requires root privileges
I0824 12:50:38.219328 8735 provisioner.cpp:255] Using default backend 'copy'
I0824 12:50:38.220949 8735 cluster.cpp:448] Creating default 'local' authorizer
I0824 12:50:38.222847 26985 slave.cpp:252] Mesos agent started on (809)@172.17.0.2:44944
I0824 12:50:38.222873 26985 slave.cpp:253] Flags at startup: --acls="" --appc_simple_discovery_uri_prefix="http://" --appc_store_dir="/tmp/Endpoint_SlaveEndpointTest_NoAuthorizer_0_cxjIXl/store/appc" --authenticate_http_executors="true" --authenticate_http_readonly="true" --authenticate_http_readwrite="true" --authenticatee="crammd5" --authentication_backoff_factor="1secs" --authorizer="local" --cgroups_cpu_enable_pids_and_tids_count="false" --cgroups_enable_cfs="false" --cgroups_hierarchy="/sys/fs/cgroup" --cgroups_limit_swap="false" --cgroups_root="mesos" --container_disk_watch_interval="15secs" --containerizers="mesos" --credential="/tmp/Endpoint_SlaveEndpointTest_NoAuthorizer_0_cxjIXl/credential" --default_role="*" --disallow_sharing_agent_pid_namespace="false" --disk_watch_interval="1mins" --docker="docker" --docker_kill_orphans="true" --docker_registry="https://registry-1.docker.io" --docker_remove_delay="6hrs" --docker_socket="/var/run/docker.sock" --docker_stop_timeout="0ns" --docker_store_dir="/tmp/Endpoint_SlaveEndpointTest_NoAuthorizer_0_cxjIXl/store/docker" --docker_volume_checkpoint_dir="/var/run/mesos/isolators/docker/volume" --enforce_container_disk_quota="false" --executor_registration_timeout="1mins" --executor_reregistration_timeout="2secs" --executor_secret_key="/tmp/Endpoint_SlaveEndpointTest_NoAuthorizer_0_cxjIXl/executor_secret_key" --executor_shutdown_grace_period="5secs" --fetcher_cache_dir="/tmp/Endpoint_SlaveEndpointTest_NoAuthorizer_0_cxjIXl/fetch" --fetcher_cache_size="2GB" --frameworks_home="" --gc_delay="1weeks" --gc_disk_headroom="0.1" --hadoop_home="" --help="false" --hostname_lookup="true" --http_command_executor="false" --http_credentials="/tmp/Endpoint_SlaveEndpointTest_NoAuthorizer_0_cxjIXl/http_credentials" --http_heartbeat_interval="30secs" --initialize_driver_logging="true" --isolation="posix/cpu,posix/mem" --launcher="posix" --launcher_dir="/mesos/mesos-1.5.0/_build/src" --logbufsecs="0" --logging_level="INFO" --max_completed_executors_per_framework="150" --oversubscribed_resources_interval="15secs" --perf_duration="10secs" --perf_interval="1mins" --port="5051" --qos_correction_interval_min="0ns" --quiet="false" --recover="reconnect" --recovery_timeout="15mins" --registration_backoff_factor="10ms" --resources="cpus:2;gpus:0;mem:1024;disk:1024;ports:[31000-32000]" --revocable_cpu_low_priority="true" --runtime_dir="/tmp/Endpoint_SlaveEndpointTest_NoAuthorizer_0_cxjIXl" --sandbox_directory="/mnt/mesos/sandbox" --strict="true" --switch_user="true" --systemd_enable_support="true" --systemd_runtime_directory="/run/systemd/system" --version="false" --work_dir="/tmp/Endpoint_SlaveEndpointTest_NoAuthorizer_0_zNq5DJ"
I0824 12:50:38.223471 26985 credentials.hpp:86] Loading credential for authentication from '/tmp/Endpoint_SlaveEndpointTest_NoAuthorizer_0_cxjIXl/credential'
I0824 12:50:38.223666 26985 slave.cpp:285] Agent using credential for: test-principal
I0824 12:50:38.223695 26985 credentials.hpp:37] Loading credentials for authentication from '/tmp/Endpoint_SlaveEndpointTest_NoAuthorizer_0_cxjIXl/http_credentials'
I0824 12:50:38.224048 26985 http.cpp:1026] Creating default 'basic' HTTP authenticator for realm 'mesos-agent-executor'
I0824 12:50:38.224194 26985 http.cpp:1047] Creating default 'jwt' HTTP authenticator for realm 'mesos-agent-executor'
I0824 12:50:38.224452 26985 http.cpp:1026] Creating default 'basic' HTTP authenticator for realm 'mesos-agent-readonly'
I0824 12:50:38.224577 26985 http.cpp:1047] Creating default 'jwt' HTTP authenticator for realm 'mesos-agent-readonly'
I0824 12:50:38.224809 26985 http.cpp:1026] Creating default 'basic' HTTP authenticator for realm 'mesos-agent-readwrite'
I0824 12:50:38.224937 26985 http.cpp:1047] Creating default 'jwt' HTTP authenticator for realm 'mesos-agent-readwrite'
I0824 12:50:38.226760 26985 slave.cpp:581] Agent resources: [{"name":"cpus","scalar":{"value":2.0},"type":"SCALAR"},{"name":"mem","scalar":{"value":1024.0},"type":"SCALAR"},{"name":"disk","scalar":{"value":1024.0},"type":"SCALAR"},{"name":"ports","ranges":{"range":[{"begin":31000,"end":32000}]},"type":"RANGES"}]
I0824 12:50:38.227069 26985 slave.cpp:589] Agent attributes: [ ]
I0824 12:50:38.227087 26985 slave.cpp:598] Agent hostname: 6c25ae897a96
I0824 12:50:38.227250 26993 status_update_manager.cpp:177] Pausing sending status updates
I0824 12:50:38.229090 26984 state.cpp:64] Recovering state from '/tmp/Endpoint_SlaveEndpointTest_NoAuthorizer_0_zNq5DJ/meta'
I0824 12:50:38.229421 26990 status_update_manager.cpp:203] Recovering status update manager
I0824 12:50:38.229657 26982 containerizer.cpp:643] Recovering containerizer
I0824 12:50:38.231361 26990 provisioner.cpp:416] Provisioner recovery complete
I0824 12:50:38.231796 26993 slave.cpp:6235] Finished recovery
I0824 12:50:38.232290 26993 slave.cpp:6417] Querying resource estimator for oversubscribable resources
I0824 12:50:38.232633 26995 slave.cpp:6431] Received oversubscribable resources {} from the resource estimator
I0824 12:50:38.235061 26989 process.cpp:3933] Handling HTTP event for process 'slave(809)' with path: '/slave(809)/monitor/statistics'
I0824 12:50:38.237267 26984 http.cpp:1166] HTTP GET for /slave(809)/monitor/statistics from 172.17.0.2:48704
I0824 12:50:38.237355 26984 http.cpp:957] Authorizing principal 'test-principal' to GET the '/monitor/statistics' endpoint
I0824 12:50:38.241185 26993 slave.cpp:859] Agent terminating
[ OK ] Endpoint/SlaveEndpointTest.NoAuthorizer/0 (36 ms)
[ RUN ] Endpoint/SlaveEndpointTest.NoAuthorizer/1
I0824 12:50:38.256466 8735 containerizer.cpp:288] Using isolation { environment_secret, posix/cpu, posix/mem, filesystem/posix, network/cni }
W0824 12:50:38.257112 8735 backend.cpp:76] Failed to create 'aufs' backend: AufsBackend requires root privileges
W0824 12:50:38.257243 8735 backend.cpp:76] Failed to create 'bind' backend: BindBackend requires root privileges
I0824 12:50:38.257283 8735 provisioner.cpp:255] Using default backend 'copy'
I0824 12:50:38.258901 8735 cluster.cpp:448] Creating default 'local' authorizer
I0824 12:50:38.260843 26984 slave.cpp:252] Mesos agent started on (810)@172.17.0.2:44944
I0824 12:50:38.260870 26984 slave.cpp:253] Flags at startup: --acls="" --appc_simple_discovery_uri_prefix="http://" --appc_store_dir="/tmp/Endpoint_SlaveEndpointTest_NoAuthorizer_1_cxfmyP/store/appc" --authenticate_http_executors="true" --authenticate_http_readonly="true" --authenticate_http_readwrite="true" --authenticatee="crammd5" --authentication_backoff_factor="1secs" --authorizer="local" --cgroups_cpu_enable_pids_and_tids_count="false" --cgroups_enable_cfs="false" --cgroups_hierarchy="/sys/fs/cgroup" --cgroups_limit_swap="false" --cgroups_root="mesos" --container_disk_watch_interval="15secs" --containerizers="mesos" --credential="/tmp/Endpoint_SlaveEndpointTest_NoAuthorizer_1_cxfmyP/credential" --default_role="*" --disallow_sharing_agent_pid_namespace="false" --disk_watch_interval="1mins" --docker="docker" --docker_kill_orphans="true" --docker_registry="https://registry-1.docker.io" --docker_remove_delay="6hrs" --docker_socket="/var/run/docker.sock" --docker_stop_timeout="0ns" --docker_store_dir="/tmp/Endpoint_SlaveEndpointTest_NoAuthorizer_1_cxfmyP/store/docker" --docker_volume_checkpoint_dir="/var/run/mesos/isolators/docker/volume" --enforce_container_disk_quota="false" --executor_registration_timeout="1mins" --executor_reregistration_timeout="2secs" --executor_secret_key="/tmp/Endpoint_SlaveEndpointTest_NoAuthorizer_1_cxfmyP/executor_secret_key" --executor_shutdown_grace_period="5secs" --fetcher_cache_dir="/tmp/Endpoint_SlaveEndpointTest_NoAuthorizer_1_cxfmyP/fetch" --fetcher_cache_size="2GB" --frameworks_home="" --gc_delay="1weeks" --gc_disk_headroom="0.1" --hadoop_home="" --help="false" --hostname_lookup="true" --http_command_executor="false" --http_credentials="/tmp/Endpoint_SlaveEndpointTest_NoAuthorizer_1_cxfmyP/http_credentials" --http_heartbeat_interval="30secs" --initialize_driver_logging="true" --isolation="posix/cpu,posix/mem" --launcher="posix" --launcher_dir="/mesos/mesos-1.5.0/_build/src" --logbufsecs="0" --logging_level="INFO" --max_completed_executors_per_framework="150" --oversubscribed_resources_interval="15secs" --perf_duration="10secs" --perf_interval="1mins" --port="5051" --qos_correction_interval_min="0ns" --quiet="false" --recover="reconnect" --recovery_timeout="15mins" --registration_backoff_factor="10ms" --resources="cpus:2;gpus:0;mem:1024;disk:1024;ports:[31000-32000]" --revocable_cpu_low_priority="true" --runtime_dir="/tmp/Endpoint_SlaveEndpointTest_NoAuthorizer_1_cxfmyP" --sandbox_directory="/mnt/mesos/sandbox" --strict="true" --switch_user="true" --systemd_enable_support="true" --systemd_runtime_directory="/run/systemd/system" --version="false" --work_dir="/tmp/Endpoint_SlaveEndpointTest_NoAuthorizer_1_pU8K8c"
I0824 12:50:38.261401 26984 credentials.hpp:86] Loading credential for authentication from '/tmp/Endpoint_SlaveEndpointTest_NoAuthorizer_1_cxfmyP/credential'
I0824 12:50:38.261641 26984 slave.cpp:285] Agent using credential for: test-principal
I0824 12:50:38.261667 26984 credentials.hpp:37] Loading credentials for authentication from '/tmp/Endpoint_SlaveEndpointTest_NoAuthorizer_1_cxfmyP/http_credentials'
I0824 12:50:38.262015 26984 http.cpp:1026] Creating default 'basic' HTTP authenticator for realm 'mesos-agent-executor'
I0824 12:50:38.262154 26984 http.cpp:1047] Creating default 'jwt' HTTP authenticator for realm 'mesos-agent-executor'
I0824 12:50:38.262400 26984 http.cpp:1026] Creating default 'basic' HTTP authenticator for realm 'mesos-agent-readonly'
I0824 12:50:38.262557 26984 http.cpp:1047] Creating default 'jwt' HTTP authenticator for realm 'mesos-agent-readonly'
I0824 12:50:38.262797 26984 http.cpp:1026] Creating default 'basic' HTTP authenticator for realm 'mesos-agent-readwrite'
I0824 12:50:38.262925 26984 http.cpp:1047] Creating default 'jwt' HTTP authenticator for realm 'mesos-agent-readwrite'
I0824 12:50:38.264679 26984 slave.cpp:581] Agent resources: [{"name":"cpus","scalar":{"value":2.0},"type":"SCALAR"},{"name":"mem","scalar":{"value":1024.0},"type":"SCALAR"},{"name":"disk","scalar":{"value":1024.0},"type":"SCALAR"},{"name":"ports","ranges":{"range":[{"begin":31000,"end":32000}]},"type":"RANGES"}]
I0824 12:50:38.264981 26984 slave.cpp:589] Agent attributes: [ ]
I0824 12:50:38.264998 26984 slave.cpp:598] Agent hostname: 6c25ae897a96
I0824 12:50:38.265250 26988 status_update_manager.cpp:177] Pausing sending status updates
I0824 12:50:38.266999 26980 state.cpp:64] Recovering state from '/tmp/Endpoint_SlaveEndpointTest_NoAuthorizer_1_pU8K8c/meta'
I0824 12:50:38.267383 26993 status_update_manager.cpp:203] Recovering status update manager
I0824 12:50:38.267611 26995 containerizer.cpp:643] Recovering containerizer
I0824 12:50:38.269196 26985 provisioner.cpp:416] Provisioner recovery complete
I0824 12:50:38.269686 26987 slave.cpp:6235] Finished recovery
I0824 12:50:38.270169 26987 slave.cpp:6417] Querying resource estimator for oversubscribable resources
I0824 12:50:38.270454 26986 slave.cpp:6431] Received oversubscribable resources {} from the resource estimator
I0824 12:50:38.273020 26982 process.cpp:3933] Handling HTTP event for process 'slave(810)' with path: '/slave(810)/monitor/statistics.json'
I0824 12:50:38.275157 26994 http.cpp:1166] HTTP GET for /slave(810)/monitor/statistics.json from 172.17.0.2:48705
I0824 12:50:38.275241 26994 http.cpp:957] Authorizing principal 'test-principal' to GET the '/monitor/statistics.json' endpoint
I0824 12:50:38.278859 26983 slave.cpp:859] Agent terminating
[ OK ] Endpoint/SlaveEndpointTest.NoAuthorizer/1 (37 ms)
[ RUN ] Endpoint/SlaveEndpointTest.NoAuthorizer/2
I0824 12:50:38.293279 8735 containerizer.cpp:288] Using isolation { environment_secret, posix/cpu, posix/mem, filesystem/posix, network/cni }
W0824 12:50:38.293857 8735 backend.cpp:76] Failed to create 'aufs' backend: AufsBackend requires root privileges
W0824 12:50:38.293980 8735 backend.cpp:76] Failed to create 'bind' backend: BindBackend requires root privileges
I0824 12:50:38.294018 8735 provisioner.cpp:255] Using default backend 'copy'
I0824 12:50:38.295938 8735 cluster.cpp:448] Creating default 'local' authorizer
I0824 12:50:38.298187 26987 slave.cpp:252] Mesos agent started on (811)@172.17.0.2:44944
I0824 12:50:38.298210 26987 slave.cpp:253] Flags at startup: --acls="" --appc_simple_discovery_uri_prefix="http://" --appc_store_dir="/tmp/Endpoint_SlaveEndpointTest_NoAuthorizer_2_FDPfxj/store/appc" --authenticate_http_executors="true" --authenticate_http_readonly="true" --authenticate_http_readwrite="true" --authenticatee="crammd5" --authentication_backoff_factor="1secs" --authorizer="local" --cgroups_cpu_enable_pids_and_tids_count="false" --cgroups_enable_cfs="false" --cgroups_hierarchy="/sys/fs/cgroup" --cgroups_limit_swap="false" --cgroups_root="mesos" --container_disk_watch_interval="15secs" --containerizers="mesos" --credential="/tmp/Endpoint_SlaveEndpointTest_NoAuthorizer_2_FDPfxj/credential" --default_role="*" --disallow_sharing_agent_pid_namespace="false" --disk_watch_interval="1mins" --docker="docker" --docker_kill_orphans="true" --docker_registry="https://registry-1.docker.io" --docker_remove_delay="6hrs" --docker_socket="/var/run/docker.sock" --docker_stop_timeout="0ns" --docker_store_dir="/tmp/Endpoint_SlaveEndpointTest_NoAuthorizer_2_FDPfxj/store/docker" --docker_volume_checkpoint_dir="/var/run/mesos/isolators/docker/volume" --enforce_container_disk_quota="false" --executor_registration_timeout="1mins" --executor_reregistration_timeout="2secs" --executor_secret_key="/tmp/Endpoint_SlaveEndpointTest_NoAuthorizer_2_FDPfxj/executor_secret_key" --executor_shutdown_grace_period="5secs" --fetcher_cache_dir="/tmp/Endpoint_SlaveEndpointTest_NoAuthorizer_2_FDPfxj/fetch" --fetcher_cache_size="2GB" --frameworks_home="" --gc_delay="1weeks" --gc_disk_headroom="0.1" --hadoop_home="" --help="false" --hostname_lookup="true" --http_command_executor="false" --http_credentials="/tmp/Endpoint_SlaveEndpointTest_NoAuthorizer_2_FDPfxj/http_credentials" --http_heartbeat_interval="30secs" --initialize_driver_logging="true" --isolation="posix/cpu,posix/mem" --launcher="posix" --launcher_dir="/mesos/mesos-1.5.0/_build/src" --logbufsecs="0" --logging_level="INFO" --max_completed_executors_per_framework="150" --oversubscribed_resources_interval="15secs" --perf_duration="10secs" --perf_interval="1mins" --port="5051" --qos_correction_interval_min="0ns" --quiet="false" --recover="reconnect" --recovery_timeout="15mins" --registration_backoff_factor="10ms" --resources="cpus:2;gpus:0;mem:1024;disk:1024;ports:[31000-32000]" --revocable_cpu_low_priority="true" --runtime_dir="/tmp/Endpoint_SlaveEndpointTest_NoAuthorizer_2_FDPfxj" --sandbox_directory="/mnt/mesos/sandbox" --strict="true" --switch_user="true" --systemd_enable_support="true" --systemd_runtime_directory="/run/systemd/system" --version="false" --work_dir="/tmp/Endpoint_SlaveEndpointTest_NoAuthorizer_2_DKdD1G"
I0824 12:50:38.298580 26987 credentials.hpp:86] Loading credential for authentication from '/tmp/Endpoint_SlaveEndpointTest_NoAuthorizer_2_FDPfxj/credential'
I0824 12:50:38.298758 26987 slave.cpp:285] Agent using credential for: test-principal
I0824 12:50:38.298785 26987 credentials.hpp:37] Loading credentials for authentication from '/tmp/Endpoint_SlaveEndpointTest_NoAuthorizer_2_FDPfxj/http_credentials'
I0824 12:50:38.299159 26987 http.cpp:1026] Creating default 'basic' HTTP authenticator for realm 'mesos-agent-executor'
I0824 12:50:38.299311 26987 http.cpp:1047] Creating default 'jwt' HTTP authenticator for realm 'mesos-agent-executor'
I0824 12:50:38.299585 26987 http.cpp:1026] Creating default 'basic' HTTP authenticator for realm 'mesos-agent-readonly'
I0824 12:50:38.299721 26987 http.cpp:1047] Creating default 'jwt' HTTP authenticator for realm 'mesos-agent-readonly'
I0824 12:50:38.299973 26987 http.cpp:1026] Creating default 'basic' HTTP authenticator for realm 'mesos-agent-readwrite'
I0824 12:50:38.300114 26987 http.cpp:1047] Creating default 'jwt' HTTP authenticator for realm 'mesos-agent-readwrite'
I0824 12:50:38.301895 26987 slave.cpp:581] Agent resources: [{"name":"cpus","scalar":{"value":2.0},"type":"SCALAR"},{"name":"mem","scalar":{"value":1024.0},"type":"SCALAR"},{"name":"disk","scalar":{"value":1024.0},"type":"SCALAR"},{"name":"ports","ranges":{"range":[{"begin":31000,"end":32000}]},"type":"RANGES"}]
I0824 12:50:38.302201 26987 slave.cpp:589] Agent attributes: [ ]
I0824 12:50:38.302219 26987 slave.cpp:598] Agent hostname: 6c25ae897a96
I0824 12:50:38.302459 26995 status_update_manager.cpp:177] Pausing sending status updates
I0824 12:50:38.303776 26989 state.cpp:64] Recovering state from '/tmp/Endpoint_SlaveEndpointTest_NoAuthorizer_2_DKdD1G/meta'
I0824 12:50:38.304186 26994 status_update_manager.cpp:203] Recovering status update manager
I0824 12:50:38.304409 26994 containerizer.cpp:643] Recovering containerizer
I0824 12:50:38.306169 26992 provisioner.cpp:416] Provisioner recovery complete
I0824 12:50:38.306627 26995 slave.cpp:6235] Finished recovery
I0824 12:50:38.307114 26995 slave.cpp:6417] Querying resource estimator for oversubscribable resources
I0824 12:50:38.307377 26989 slave.cpp:6431] Received oversubscribable resources {} from the resource estimator
I0824 12:50:38.309599 26992 process.cpp:3933] Handling HTTP event for process 'slave(811)' with path: '/slave(811)/containers'
I0824 12:50:38.311583 26985 http.cpp:1166] HTTP GET for /slave(811)/containers from 172.17.0.2:48706
I0824 12:50:38.311662 26985 http.cpp:957] Authorizing principal 'test-principal' to GET the '/containers' endpoint
I0824 12:50:38.315578 26990 slave.cpp:859] Agent terminating
[ OK ] Endpoint/SlaveEndpointTest.NoAuthorizer/2 (36 ms)
[----------] 9 tests from Endpoint/SlaveEndpointTest (334 ms total)
[----------] 2 tests from ContainerizerType/DefaultContainerDNSFlagTest
[ RUN ] ContainerizerType/DefaultContainerDNSFlagTest.ValidateFlag/0
[ OK ] ContainerizerType/DefaultContainerDNSFlagTest.ValidateFlag/0 (11 ms)
[ RUN ] ContainerizerType/DefaultContainerDNSFlagTest.ValidateFlag/1
[ OK ] ContainerizerType/DefaultContainerDNSFlagTest.ValidateFlag/1 (9 ms)
[----------] 2 tests from ContainerizerType/DefaultContainerDNSFlagTest (20 ms total)
[----------] Global test environment tear-down
[==========] 1661 tests from 183 test cases ran. (662541 ms total)
[ PASSED ] 1660 tests.
[ FAILED ] 1 test, listed below:
[ FAILED ] ExamplesTest.NoExecutorFramework
1 FAILED TEST
YOU HAVE 20 DISABLED TESTS
I0824 12:50:38.406441 26996 process.cpp:1072] Failed to accept socket: future discarded
make[4]: *** [check-local] Error 1
make[4]: Leaving directory `/mesos/mesos-1.5.0/_build/src'
make[3]: *** [check-am] Error 2
make[3]: Leaving directory `/mesos/mesos-1.5.0/_build/src'
make[2]: *** [check] Error 2
make[2]: Leaving directory `/mesos/mesos-1.5.0/_build/src'
make[1]: *** [check-recursive] Error 1
make[1]: Leaving directory `/mesos/mesos-1.5.0/_build'
make: *** [distcheck] Error 1
+ docker rmi mesos-1503575753-302
Untagged: mesos-1503575753-302:latest
Deleted: sha256:7fbf16f7f5540a851e8c20148edcd8de6b75fa54c6aa73c9c88609de9cf4b3d7
Deleted: sha256:7b0b0605b113f4dcc74465cf22a30ca2e33e9c41a062604ae2d82f3358ec8a86
Deleted: sha256:7f1c9ef69aaf10d6151d9f1823a99d16fde330cd972827d1bfea5d090fd37b67
Deleted: sha256:006c68610bdcf8b916c39ed95cf40a79b6c38b76553a98943b32794cc9300615
Deleted: sha256:e5d62abe39c908180a65f9b8d9d60fbdbd5131f6975dd6ce47483e6a9b68124f
Deleted: sha256:6067c6bcb2f56d66e7d114b9135dbfb239bc76530ad40af0c3a7cc81c1c8679d
Deleted: sha256:128de1d08132bcc5f683bcd6333a52c8b9f8eb17d82a80621429c1d33c9fab18
Deleted: sha256:4d7da6d0b3f16971ae0c86139aaa694ac2da7f862bb7e1e1fc77b3d78ebf5b50
Deleted: sha256:8045effabb3b8c468b6559091deedc35110e9b84f86f1260be346abc6aa3a2ba
Deleted: sha256:5fa18c2a17e45f7a3e100054212f13cd994a8994dcf39244703a39f5c1a261e6
Deleted: sha256:ea90cb2211e6ba88452c02ce68c969e6aa25fa42858d89a74a5324587fbd5dff
Deleted: sha256:ce8ff8732daf0d467c6dc2c243161ae5296746e2019dc6473b420e36d34447a5
Deleted: sha256:f0d0275247e0d0462bbfd083e4517f4ac842ce3ce394b60a323115373b2f19de
Deleted: sha256:0d115940f352c081204de6a43ed5def4fdcb0c33e61446de6e63d7d8ee31ad1e
Deleted: sha256:d747cceee8f40683f7ce769718029841cf38ef37b403b256dad799f9ba94e9d4
Deleted: sha256:f5dc5f0cba43cc2918151c6b74270ed7492b893ac4dd59dc21253b25e916a8fa
Deleted: sha256:eadefe78be96b7a27deb905fbae39ba7b719f205111d00f165b1343a88119a4f
Deleted: sha256:c36256f716c17c85ff23bbdddc1c8b33d9546355b18b8e6fb07efbf707623ce7
Deleted: sha256:15d0e344e20bf3c91c4ef0e74c74d79cf4fad456e77a8f08b332ce0aea0325d8
Deleted: sha256:5a7f01fafc3af62ed031a16513f5935d997fa236425f629d1f1dfda13ad4b692
Deleted: sha256:f28197d540b4b914d42e19c3d002a0b58809a040024594b69a035b537465d65b
Deleted: sha256:3c66929af644c42a9268a065b3dc17d00fdfffe3501f6cbf5a20282f7b268a0e
Deleted: sha256:f1a1a9e5c9036fcaf27fcb286969afae217b14a00b791346bc26efe8ffb60223
Deleted: sha256:e5ee441d4746f2f9731b3824f190ce9b4cb405819ea13c69a882c90bffcbf235
Deleted: sha256:22cbcf4cf609f8f295a19406f8acff5f2b1f074e3351b529d5d21f88ded1eb05
Build step 'Execute shell' marked build as failure
Not sending mail to unregistered user yujie.jay@gmail.com
Build failed in Jenkins: Mesos-Buildbot » autotools,gcc,--verbose --enable-libevent --enable-ssl,GLOG_v=1 MESOS_VERBOSE=1,centos:7,(ubuntu)&&(!ubuntu-us1)&&(!ubuntu-eu2) #4145
Posted by Apache Jenkins Server <je...@builds.apache.org>.
See <https://builds.apache.org/job/Mesos-Buildbot/BUILDTOOL=autotools,COMPILER=gcc,CONFIGURATION=--verbose%20--enable-libevent%20--enable-ssl,ENVIRONMENT=GLOG_v=1%20MESOS_VERBOSE=1,OS=centos%3A7,label_exp=(ubuntu)&&(!ubuntu-us1)&&(!ubuntu-eu2)/4145/display/redirect?page=changes>
Changes:
[bmahler] Fixed a bug where the agent kills and still launches a task.
[bmahler] Added MESOS-7865 to the 1.4.1 CHANGELOG.
[bmahler] Improved the reason and message for tasks killed before delivery.
[bmahler] Updated Framework::removePendingTask to take only a TaskID.
[bmahler] Introduced a Framework::idle function in the agent.
[bmahler] Renamed Framework::pending to Framework::pendingTasks in agent.
[bmahler] Introduced a CHECK_NOTNONE.
[bmahler] Fixed a bug where TASK_KILLED updates can be dropped by the agent.
[bmahler] Added a missing return statement from 45c2444ad.
[bmahler] Added MESOS-7863 to the 1.4.1 CHANGELOG.
[yujie.jay] Adjusted the ContainerLaunchInfo.command merge logic.
[yujie.jay] Added MESOS-7909 to 1.4.1 CHANGELOG.
------------------------------------------
[...truncated 32.19 MB...]
W0824 07:34:53.286106 9437 backend.cpp:76] Failed to create 'bind' backend: BindBackend requires root privileges
I0824 07:34:53.286139 9437 provisioner.cpp:255] Using default backend 'copy'
I0824 07:34:53.289728 30403 slave.cpp:250] Mesos agent started on (803)@172.17.0.7:45620
I0824 07:34:53.289755 30403 slave.cpp:251] Flags at startup: --acls="" --appc_simple_discovery_uri_prefix="http://" --appc_store_dir="/tmp/Endpoint_SlaveEndpointTest_UnauthorizedRequest_0_Cie0NR/store/appc" --authenticate_http_executors="true" --authenticate_http_readonly="true" --authenticate_http_readwrite="true" --authenticatee="crammd5" --authentication_backoff_factor="1secs" --authorizer="local" --cgroups_cpu_enable_pids_and_tids_count="false" --cgroups_enable_cfs="false" --cgroups_hierarchy="/sys/fs/cgroup" --cgroups_limit_swap="false" --cgroups_root="mesos" --container_disk_watch_interval="15secs" --containerizers="mesos" --credential="/tmp/Endpoint_SlaveEndpointTest_UnauthorizedRequest_0_Cie0NR/credential" --default_role="*" --disallow_sharing_agent_pid_namespace="false" --disk_watch_interval="1mins" --docker="docker" --docker_kill_orphans="true" --docker_registry="https://registry-1.docker.io" --docker_remove_delay="6hrs" --docker_socket="/var/run/docker.sock" --docker_stop_timeout="0ns" --docker_store_dir="/tmp/Endpoint_SlaveEndpointTest_UnauthorizedRequest_0_Cie0NR/store/docker" --docker_volume_checkpoint_dir="/var/run/mesos/isolators/docker/volume" --enforce_container_disk_quota="false" --executor_registration_timeout="1mins" --executor_reregistration_timeout="2secs" --executor_secret_key="/tmp/Endpoint_SlaveEndpointTest_UnauthorizedRequest_0_Cie0NR/executor_secret_key" --executor_shutdown_grace_period="5secs" --fetcher_cache_dir="/tmp/Endpoint_SlaveEndpointTest_UnauthorizedRequest_0_Cie0NR/fetch" --fetcher_cache_size="2GB" --frameworks_home="" --gc_delay="1weeks" --gc_disk_headroom="0.1" --hadoop_home="" --help="false" --hostname_lookup="true" --http_command_executor="false" --http_credentials="/tmp/Endpoint_SlaveEndpointTest_UnauthorizedRequest_0_Cie0NR/http_credentials" --http_heartbeat_interval="30secs" --initialize_driver_logging="true" --isolation="posix/cpu,posix/mem" --launcher="posix" --launcher_dir="/mesos/mesos-1.4.0/_build/src" --logbufsecs="0" --logging_level="INFO" --max_completed_executors_per_framework="150" --oversubscribed_resources_interval="15secs" --perf_duration="10secs" --perf_interval="1mins" --port="5051" --qos_correction_interval_min="0ns" --quiet="false" --recover="reconnect" --recovery_timeout="15mins" --registration_backoff_factor="10ms" --resources="cpus:2;gpus:0;mem:1024;disk:1024;ports:[31000-32000]" --revocable_cpu_low_priority="true" --runtime_dir="/tmp/Endpoint_SlaveEndpointTest_UnauthorizedRequest_0_Cie0NR" --sandbox_directory="/mnt/mesos/sandbox" --strict="true" --switch_user="true" --systemd_enable_support="true" --systemd_runtime_directory="/run/systemd/system" --version="false" --work_dir="/tmp/Endpoint_SlaveEndpointTest_UnauthorizedRequest_0_3YbGF7"
I0824 07:34:53.290225 30403 credentials.hpp:86] Loading credential for authentication from '/tmp/Endpoint_SlaveEndpointTest_UnauthorizedRequest_0_Cie0NR/credential'
I0824 07:34:53.290403 30403 slave.cpp:283] Agent using credential for: test-principal
I0824 07:34:53.290426 30403 credentials.hpp:37] Loading credentials for authentication from '/tmp/Endpoint_SlaveEndpointTest_UnauthorizedRequest_0_Cie0NR/http_credentials'
I0824 07:34:53.290691 30403 http.cpp:1026] Creating default 'basic' HTTP authenticator for realm 'mesos-agent-executor'
I0824 07:34:53.290812 30403 http.cpp:1047] Creating default 'jwt' HTTP authenticator for realm 'mesos-agent-executor'
I0824 07:34:53.291007 30403 http.cpp:1026] Creating default 'basic' HTTP authenticator for realm 'mesos-agent-readonly'
I0824 07:34:53.291096 30403 http.cpp:1047] Creating default 'jwt' HTTP authenticator for realm 'mesos-agent-readonly'
I0824 07:34:53.291260 30403 http.cpp:1026] Creating default 'basic' HTTP authenticator for realm 'mesos-agent-readwrite'
I0824 07:34:53.291350 30403 http.cpp:1047] Creating default 'jwt' HTTP authenticator for realm 'mesos-agent-readwrite'
I0824 07:34:53.292641 30403 slave.cpp:565] Agent resources: [{"name":"cpus","scalar":{"value":2.0},"type":"SCALAR"},{"name":"mem","scalar":{"value":1024.0},"type":"SCALAR"},{"name":"disk","scalar":{"value":1024.0},"type":"SCALAR"},{"name":"ports","ranges":{"range":[{"begin":31000,"end":32000}]},"type":"RANGES"}]
I0824 07:34:53.292855 30403 slave.cpp:573] Agent attributes: [ ]
I0824 07:34:53.292870 30403 slave.cpp:582] Agent hostname: e2acee88e78e
I0824 07:34:53.292996 30405 status_update_manager.cpp:177] Pausing sending status updates
I0824 07:34:53.294445 30415 state.cpp:64] Recovering state from '/tmp/Endpoint_SlaveEndpointTest_UnauthorizedRequest_0_3YbGF7/meta'
I0824 07:34:53.294723 30413 status_update_manager.cpp:203] Recovering status update manager
I0824 07:34:53.294922 30417 containerizer.cpp:609] Recovering containerizer
I0824 07:34:53.296314 30405 provisioner.cpp:416] Provisioner recovery complete
I0824 07:34:53.296689 30403 slave.cpp:6242] Finished recovery
I0824 07:34:53.297204 30403 slave.cpp:6424] Querying resource estimator for oversubscribable resources
I0824 07:34:53.297425 30402 slave.cpp:6438] Received oversubscribable resources {} from the resource estimator
I0824 07:34:53.299532 30410 process.cpp:3933] Handling HTTP event for process 'slave(803)' with path: '/slave(803)/monitor/statistics'
I0824 07:34:53.301141 30413 http.cpp:1166] HTTP GET for /slave(803)/monitor/statistics from 172.17.0.7:45070
I0824 07:34:53.301211 30413 http.cpp:957] Authorizing principal 'test-principal' to GET the '/monitor/statistics' endpoint
I0824 07:34:53.302646 30406 slave.cpp:843] Agent terminating
[ OK ] Endpoint/SlaveEndpointTest.UnauthorizedRequest/0 (28 ms)
[ RUN ] Endpoint/SlaveEndpointTest.UnauthorizedRequest/1
I0824 07:34:53.313596 9437 containerizer.cpp:246] Using isolation: posix/cpu,posix/mem,filesystem/posix,network/cni,environment_secret
W0824 07:34:53.314081 9437 backend.cpp:76] Failed to create 'aufs' backend: AufsBackend requires root privileges
W0824 07:34:53.314213 9437 backend.cpp:76] Failed to create 'bind' backend: BindBackend requires root privileges
I0824 07:34:53.314254 9437 provisioner.cpp:255] Using default backend 'copy'
I0824 07:34:53.317518 30411 slave.cpp:250] Mesos agent started on (804)@172.17.0.7:45620
I0824 07:34:53.317545 30411 slave.cpp:251] Flags at startup: --acls="" --appc_simple_discovery_uri_prefix="http://" --appc_store_dir="/tmp/Endpoint_SlaveEndpointTest_UnauthorizedRequest_1_RY4CzQ/store/appc" --authenticate_http_executors="true" --authenticate_http_readonly="true" --authenticate_http_readwrite="true" --authenticatee="crammd5" --authentication_backoff_factor="1secs" --authorizer="local" --cgroups_cpu_enable_pids_and_tids_count="false" --cgroups_enable_cfs="false" --cgroups_hierarchy="/sys/fs/cgroup" --cgroups_limit_swap="false" --cgroups_root="mesos" --container_disk_watch_interval="15secs" --containerizers="mesos" --credential="/tmp/Endpoint_SlaveEndpointTest_UnauthorizedRequest_1_RY4CzQ/credential" --default_role="*" --disallow_sharing_agent_pid_namespace="false" --disk_watch_interval="1mins" --docker="docker" --docker_kill_orphans="true" --docker_registry="https://registry-1.docker.io" --docker_remove_delay="6hrs" --docker_socket="/var/run/docker.sock" --docker_stop_timeout="0ns" --docker_store_dir="/tmp/Endpoint_SlaveEndpointTest_UnauthorizedRequest_1_RY4CzQ/store/docker" --docker_volume_checkpoint_dir="/var/run/mesos/isolators/docker/volume" --enforce_container_disk_quota="false" --executor_registration_timeout="1mins" --executor_reregistration_timeout="2secs" --executor_secret_key="/tmp/Endpoint_SlaveEndpointTest_UnauthorizedRequest_1_RY4CzQ/executor_secret_key" --executor_shutdown_grace_period="5secs" --fetcher_cache_dir="/tmp/Endpoint_SlaveEndpointTest_UnauthorizedRequest_1_RY4CzQ/fetch" --fetcher_cache_size="2GB" --frameworks_home="" --gc_delay="1weeks" --gc_disk_headroom="0.1" --hadoop_home="" --help="false" --hostname_lookup="true" --http_command_executor="false" --http_credentials="/tmp/Endpoint_SlaveEndpointTest_UnauthorizedRequest_1_RY4CzQ/http_credentials" --http_heartbeat_interval="30secs" --initialize_driver_logging="true" --isolation="posix/cpu,posix/mem" --launcher="posix" --launcher_dir="/mesos/mesos-1.4.0/_build/src" --logbufsecs="0" --logging_level="INFO" --max_completed_executors_per_framework="150" --oversubscribed_resources_interval="15secs" --perf_duration="10secs" --perf_interval="1mins" --port="5051" --qos_correction_interval_min="0ns" --quiet="false" --recover="reconnect" --recovery_timeout="15mins" --registration_backoff_factor="10ms" --resources="cpus:2;gpus:0;mem:1024;disk:1024;ports:[31000-32000]" --revocable_cpu_low_priority="true" --runtime_dir="/tmp/Endpoint_SlaveEndpointTest_UnauthorizedRequest_1_RY4CzQ" --sandbox_directory="/mnt/mesos/sandbox" --strict="true" --switch_user="true" --systemd_enable_support="true" --systemd_runtime_directory="/run/systemd/system" --version="false" --work_dir="/tmp/Endpoint_SlaveEndpointTest_UnauthorizedRequest_1_Coy7m6"
I0824 07:34:53.318123 30411 credentials.hpp:86] Loading credential for authentication from '/tmp/Endpoint_SlaveEndpointTest_UnauthorizedRequest_1_RY4CzQ/credential'
I0824 07:34:53.318339 30411 slave.cpp:283] Agent using credential for: test-principal
I0824 07:34:53.318368 30411 credentials.hpp:37] Loading credentials for authentication from '/tmp/Endpoint_SlaveEndpointTest_UnauthorizedRequest_1_RY4CzQ/http_credentials'
I0824 07:34:53.318693 30411 http.cpp:1026] Creating default 'basic' HTTP authenticator for realm 'mesos-agent-executor'
I0824 07:34:53.318812 30411 http.cpp:1047] Creating default 'jwt' HTTP authenticator for realm 'mesos-agent-executor'
I0824 07:34:53.319015 30411 http.cpp:1026] Creating default 'basic' HTTP authenticator for realm 'mesos-agent-readonly'
I0824 07:34:53.319108 30411 http.cpp:1047] Creating default 'jwt' HTTP authenticator for realm 'mesos-agent-readonly'
I0824 07:34:53.319274 30411 http.cpp:1026] Creating default 'basic' HTTP authenticator for realm 'mesos-agent-readwrite'
I0824 07:34:53.319362 30411 http.cpp:1047] Creating default 'jwt' HTTP authenticator for realm 'mesos-agent-readwrite'
I0824 07:34:53.320667 30411 slave.cpp:565] Agent resources: [{"name":"cpus","scalar":{"value":2.0},"type":"SCALAR"},{"name":"mem","scalar":{"value":1024.0},"type":"SCALAR"},{"name":"disk","scalar":{"value":1024.0},"type":"SCALAR"},{"name":"ports","ranges":{"range":[{"begin":31000,"end":32000}]},"type":"RANGES"}]
I0824 07:34:53.320885 30411 slave.cpp:573] Agent attributes: [ ]
I0824 07:34:53.320899 30411 slave.cpp:582] Agent hostname: e2acee88e78e
I0824 07:34:53.321019 30400 status_update_manager.cpp:177] Pausing sending status updates
I0824 07:34:53.322408 30413 state.cpp:64] Recovering state from '/tmp/Endpoint_SlaveEndpointTest_UnauthorizedRequest_1_Coy7m6/meta'
I0824 07:34:53.322686 30404 status_update_manager.cpp:203] Recovering status update manager
I0824 07:34:53.322952 30403 containerizer.cpp:609] Recovering containerizer
I0824 07:34:53.324452 30409 provisioner.cpp:416] Provisioner recovery complete
I0824 07:34:53.324721 30411 slave.cpp:6242] Finished recovery
I0824 07:34:53.325176 30411 slave.cpp:6424] Querying resource estimator for oversubscribable resources
I0824 07:34:53.325408 30402 slave.cpp:6438] Received oversubscribable resources {} from the resource estimator
I0824 07:34:53.327631 30418 process.cpp:3933] Handling HTTP event for process 'slave(804)' with path: '/slave(804)/monitor/statistics.json'
I0824 07:34:53.329154 30397 http.cpp:1166] HTTP GET for /slave(804)/monitor/statistics.json from 172.17.0.7:45072
I0824 07:34:53.329222 30397 http.cpp:957] Authorizing principal 'test-principal' to GET the '/monitor/statistics.json' endpoint
I0824 07:34:53.330673 30411 slave.cpp:843] Agent terminating
[ OK ] Endpoint/SlaveEndpointTest.UnauthorizedRequest/1 (27 ms)
[ RUN ] Endpoint/SlaveEndpointTest.UnauthorizedRequest/2
I0824 07:34:53.341804 9437 containerizer.cpp:246] Using isolation: posix/cpu,posix/mem,filesystem/posix,network/cni,environment_secret
W0824 07:34:53.342303 9437 backend.cpp:76] Failed to create 'aufs' backend: AufsBackend requires root privileges
W0824 07:34:53.342422 9437 backend.cpp:76] Failed to create 'bind' backend: BindBackend requires root privileges
I0824 07:34:53.342456 9437 provisioner.cpp:255] Using default backend 'copy'
I0824 07:34:53.346412 30413 slave.cpp:250] Mesos agent started on (805)@172.17.0.7:45620
I0824 07:34:53.346444 30413 slave.cpp:251] Flags at startup: --acls="" --appc_simple_discovery_uri_prefix="http://" --appc_store_dir="/tmp/Endpoint_SlaveEndpointTest_UnauthorizedRequest_2_xWwVBP/store/appc" --authenticate_http_executors="true" --authenticate_http_readonly="true" --authenticate_http_readwrite="true" --authenticatee="crammd5" --authentication_backoff_factor="1secs" --authorizer="local" --cgroups_cpu_enable_pids_and_tids_count="false" --cgroups_enable_cfs="false" --cgroups_hierarchy="/sys/fs/cgroup" --cgroups_limit_swap="false" --cgroups_root="mesos" --container_disk_watch_interval="15secs" --containerizers="mesos" --credential="/tmp/Endpoint_SlaveEndpointTest_UnauthorizedRequest_2_xWwVBP/credential" --default_role="*" --disallow_sharing_agent_pid_namespace="false" --disk_watch_interval="1mins" --docker="docker" --docker_kill_orphans="true" --docker_registry="https://registry-1.docker.io" --docker_remove_delay="6hrs" --docker_socket="/var/run/docker.sock" --docker_stop_timeout="0ns" --docker_store_dir="/tmp/Endpoint_SlaveEndpointTest_UnauthorizedRequest_2_xWwVBP/store/docker" --docker_volume_checkpoint_dir="/var/run/mesos/isolators/docker/volume" --enforce_container_disk_quota="false" --executor_registration_timeout="1mins" --executor_reregistration_timeout="2secs" --executor_secret_key="/tmp/Endpoint_SlaveEndpointTest_UnauthorizedRequest_2_xWwVBP/executor_secret_key" --executor_shutdown_grace_period="5secs" --fetcher_cache_dir="/tmp/Endpoint_SlaveEndpointTest_UnauthorizedRequest_2_xWwVBP/fetch" --fetcher_cache_size="2GB" --frameworks_home="" --gc_delay="1weeks" --gc_disk_headroom="0.1" --hadoop_home="" --help="false" --hostname_lookup="true" --http_command_executor="false" --http_credentials="/tmp/Endpoint_SlaveEndpointTest_UnauthorizedRequest_2_xWwVBP/http_credentials" --http_heartbeat_interval="30secs" --initialize_driver_logging="true" --isolation="posix/cpu,posix/mem" --launcher="posix" --launcher_dir="/mesos/mesos-1.4.0/_build/src" --logbufsecs="0" --logging_level="INFO" --max_completed_executors_per_framework="150" --oversubscribed_resources_interval="15secs" --perf_duration="10secs" --perf_interval="1mins" --port="5051" --qos_correction_interval_min="0ns" --quiet="false" --recover="reconnect" --recovery_timeout="15mins" --registration_backoff_factor="10ms" --resources="cpus:2;gpus:0;mem:1024;disk:1024;ports:[31000-32000]" --revocable_cpu_low_priority="true" --runtime_dir="/tmp/Endpoint_SlaveEndpointTest_UnauthorizedRequest_2_xWwVBP" --sandbox_directory="/mnt/mesos/sandbox" --strict="true" --switch_user="true" --systemd_enable_support="true" --systemd_runtime_directory="/run/systemd/system" --version="false" --work_dir="/tmp/Endpoint_SlaveEndpointTest_UnauthorizedRequest_2_WZOel5"
I0824 07:34:53.346835 30413 credentials.hpp:86] Loading credential for authentication from '/tmp/Endpoint_SlaveEndpointTest_UnauthorizedRequest_2_xWwVBP/credential'
I0824 07:34:53.347026 30413 slave.cpp:283] Agent using credential for: test-principal
I0824 07:34:53.347051 30413 credentials.hpp:37] Loading credentials for authentication from '/tmp/Endpoint_SlaveEndpointTest_UnauthorizedRequest_2_xWwVBP/http_credentials'
I0824 07:34:53.347339 30413 http.cpp:1026] Creating default 'basic' HTTP authenticator for realm 'mesos-agent-executor'
I0824 07:34:53.347470 30413 http.cpp:1047] Creating default 'jwt' HTTP authenticator for realm 'mesos-agent-executor'
I0824 07:34:53.347682 30413 http.cpp:1026] Creating default 'basic' HTTP authenticator for realm 'mesos-agent-readonly'
I0824 07:34:53.347784 30413 http.cpp:1047] Creating default 'jwt' HTTP authenticator for realm 'mesos-agent-readonly'
I0824 07:34:53.347959 30413 http.cpp:1026] Creating default 'basic' HTTP authenticator for realm 'mesos-agent-readwrite'
I0824 07:34:53.348057 30413 http.cpp:1047] Creating default 'jwt' HTTP authenticator for realm 'mesos-agent-readwrite'
I0824 07:34:53.349376 30413 slave.cpp:565] Agent resources: [{"name":"cpus","scalar":{"value":2.0},"type":"SCALAR"},{"name":"mem","scalar":{"value":1024.0},"type":"SCALAR"},{"name":"disk","scalar":{"value":1024.0},"type":"SCALAR"},{"name":"ports","ranges":{"range":[{"begin":31000,"end":32000}]},"type":"RANGES"}]
I0824 07:34:53.349597 30413 slave.cpp:573] Agent attributes: [ ]
I0824 07:34:53.349616 30413 slave.cpp:582] Agent hostname: e2acee88e78e
I0824 07:34:53.349742 30404 status_update_manager.cpp:177] Pausing sending status updates
I0824 07:34:53.351306 30400 state.cpp:64] Recovering state from '/tmp/Endpoint_SlaveEndpointTest_UnauthorizedRequest_2_WZOel5/meta'
I0824 07:34:53.351594 30415 status_update_manager.cpp:203] Recovering status update manager
I0824 07:34:53.351830 30408 containerizer.cpp:609] Recovering containerizer
I0824 07:34:53.353164 30409 provisioner.cpp:416] Provisioner recovery complete
I0824 07:34:53.353518 30397 slave.cpp:6242] Finished recovery
I0824 07:34:53.353983 30397 slave.cpp:6424] Querying resource estimator for oversubscribable resources
I0824 07:34:53.354226 30414 slave.cpp:6438] Received oversubscribable resources {} from the resource estimator
I0824 07:34:53.356333 30410 process.cpp:3933] Handling HTTP event for process 'slave(805)' with path: '/slave(805)/containers'
I0824 07:34:53.357910 30415 http.cpp:1166] HTTP GET for /slave(805)/containers from 172.17.0.7:45078
I0824 07:34:53.357985 30415 http.cpp:957] Authorizing principal 'test-principal' to GET the '/containers' endpoint
I0824 07:34:53.359617 30412 slave.cpp:843] Agent terminating
[ OK ] Endpoint/SlaveEndpointTest.UnauthorizedRequest/2 (29 ms)
[ RUN ] Endpoint/SlaveEndpointTest.NoAuthorizer/0
I0824 07:34:53.371240 9437 containerizer.cpp:246] Using isolation: posix/cpu,posix/mem,filesystem/posix,network/cni,environment_secret
W0824 07:34:53.371784 9437 backend.cpp:76] Failed to create 'aufs' backend: AufsBackend requires root privileges
W0824 07:34:53.371903 9437 backend.cpp:76] Failed to create 'bind' backend: BindBackend requires root privileges
I0824 07:34:53.371937 9437 provisioner.cpp:255] Using default backend 'copy'
I0824 07:34:53.373634 9437 cluster.cpp:448] Creating default 'local' authorizer
I0824 07:34:53.375421 30412 slave.cpp:250] Mesos agent started on (806)@172.17.0.7:45620
I0824 07:34:53.375442 30412 slave.cpp:251] Flags at startup: --acls="" --appc_simple_discovery_uri_prefix="http://" --appc_store_dir="/tmp/Endpoint_SlaveEndpointTest_NoAuthorizer_0_aJECVO/store/appc" --authenticate_http_executors="true" --authenticate_http_readonly="true" --authenticate_http_readwrite="true" --authenticatee="crammd5" --authentication_backoff_factor="1secs" --authorizer="local" --cgroups_cpu_enable_pids_and_tids_count="false" --cgroups_enable_cfs="false" --cgroups_hierarchy="/sys/fs/cgroup" --cgroups_limit_swap="false" --cgroups_root="mesos" --container_disk_watch_interval="15secs" --containerizers="mesos" --credential="/tmp/Endpoint_SlaveEndpointTest_NoAuthorizer_0_aJECVO/credential" --default_role="*" --disallow_sharing_agent_pid_namespace="false" --disk_watch_interval="1mins" --docker="docker" --docker_kill_orphans="true" --docker_registry="https://registry-1.docker.io" --docker_remove_delay="6hrs" --docker_socket="/var/run/docker.sock" --docker_stop_timeout="0ns" --docker_store_dir="/tmp/Endpoint_SlaveEndpointTest_NoAuthorizer_0_aJECVO/store/docker" --docker_volume_checkpoint_dir="/var/run/mesos/isolators/docker/volume" --enforce_container_disk_quota="false" --executor_registration_timeout="1mins" --executor_reregistration_timeout="2secs" --executor_secret_key="/tmp/Endpoint_SlaveEndpointTest_NoAuthorizer_0_aJECVO/executor_secret_key" --executor_shutdown_grace_period="5secs" --fetcher_cache_dir="/tmp/Endpoint_SlaveEndpointTest_NoAuthorizer_0_aJECVO/fetch" --fetcher_cache_size="2GB" --frameworks_home="" --gc_delay="1weeks" --gc_disk_headroom="0.1" --hadoop_home="" --help="false" --hostname_lookup="true" --http_command_executor="false" --http_credentials="/tmp/Endpoint_SlaveEndpointTest_NoAuthorizer_0_aJECVO/http_credentials" --http_heartbeat_interval="30secs" --initialize_driver_logging="true" --isolation="posix/cpu,posix/mem" --launcher="posix" --launcher_dir="/mesos/mesos-1.4.0/_build/src" --logbufsecs="0" --logging_level="INFO" --max_completed_executors_per_framework="150" --oversubscribed_resources_interval="15secs" --perf_duration="10secs" --perf_interval="1mins" --port="5051" --qos_correction_interval_min="0ns" --quiet="false" --recover="reconnect" --recovery_timeout="15mins" --registration_backoff_factor="10ms" --resources="cpus:2;gpus:0;mem:1024;disk:1024;ports:[31000-32000]" --revocable_cpu_low_priority="true" --runtime_dir="/tmp/Endpoint_SlaveEndpointTest_NoAuthorizer_0_aJECVO" --sandbox_directory="/mnt/mesos/sandbox" --strict="true" --switch_user="true" --systemd_enable_support="true" --systemd_runtime_directory="/run/systemd/system" --version="false" --work_dir="/tmp/Endpoint_SlaveEndpointTest_NoAuthorizer_0_JW7zA4"
I0824 07:34:53.375831 30412 credentials.hpp:86] Loading credential for authentication from '/tmp/Endpoint_SlaveEndpointTest_NoAuthorizer_0_aJECVO/credential'
I0824 07:34:53.375990 30412 slave.cpp:283] Agent using credential for: test-principal
I0824 07:34:53.376011 30412 credentials.hpp:37] Loading credentials for authentication from '/tmp/Endpoint_SlaveEndpointTest_NoAuthorizer_0_aJECVO/http_credentials'
I0824 07:34:53.376273 30412 http.cpp:1026] Creating default 'basic' HTTP authenticator for realm 'mesos-agent-executor'
I0824 07:34:53.376389 30412 http.cpp:1047] Creating default 'jwt' HTTP authenticator for realm 'mesos-agent-executor'
I0824 07:34:53.376612 30412 http.cpp:1026] Creating default 'basic' HTTP authenticator for realm 'mesos-agent-readonly'
I0824 07:34:53.376725 30412 http.cpp:1047] Creating default 'jwt' HTTP authenticator for realm 'mesos-agent-readonly'
I0824 07:34:53.376888 30412 http.cpp:1026] Creating default 'basic' HTTP authenticator for realm 'mesos-agent-readwrite'
I0824 07:34:53.376976 30412 http.cpp:1047] Creating default 'jwt' HTTP authenticator for realm 'mesos-agent-readwrite'
I0824 07:34:53.378756 30412 slave.cpp:565] Agent resources: [{"name":"cpus","scalar":{"value":2.0},"type":"SCALAR"},{"name":"mem","scalar":{"value":1024.0},"type":"SCALAR"},{"name":"disk","scalar":{"value":1024.0},"type":"SCALAR"},{"name":"ports","ranges":{"range":[{"begin":31000,"end":32000}]},"type":"RANGES"}]
I0824 07:34:53.378967 30412 slave.cpp:573] Agent attributes: [ ]
I0824 07:34:53.378979 30412 slave.cpp:582] Agent hostname: e2acee88e78e
I0824 07:34:53.379096 30397 status_update_manager.cpp:177] Pausing sending status updates
I0824 07:34:53.380518 30405 state.cpp:64] Recovering state from '/tmp/Endpoint_SlaveEndpointTest_NoAuthorizer_0_JW7zA4/meta'
I0824 07:34:53.380760 30414 status_update_manager.cpp:203] Recovering status update manager
I0824 07:34:53.380929 30401 containerizer.cpp:609] Recovering containerizer
I0824 07:34:53.382158 30402 provisioner.cpp:416] Provisioner recovery complete
I0824 07:34:53.382452 30399 slave.cpp:6242] Finished recovery
I0824 07:34:53.382930 30399 slave.cpp:6424] Querying resource estimator for oversubscribable resources
I0824 07:34:53.383157 30416 slave.cpp:6438] Received oversubscribable resources {} from the resource estimator
I0824 07:34:53.385077 30417 process.cpp:3933] Handling HTTP event for process 'slave(806)' with path: '/slave(806)/monitor/statistics'
I0824 07:34:53.386721 30414 http.cpp:1166] HTTP GET for /slave(806)/monitor/statistics from 172.17.0.7:45084
I0824 07:34:53.386788 30414 http.cpp:957] Authorizing principal 'test-principal' to GET the '/monitor/statistics' endpoint
I0824 07:34:53.389196 30416 slave.cpp:843] Agent terminating
[ OK ] Endpoint/SlaveEndpointTest.NoAuthorizer/0 (28 ms)
[ RUN ] Endpoint/SlaveEndpointTest.NoAuthorizer/1
I0824 07:34:53.400540 9437 containerizer.cpp:246] Using isolation: posix/cpu,posix/mem,filesystem/posix,network/cni,environment_secret
W0824 07:34:53.401024 9437 backend.cpp:76] Failed to create 'aufs' backend: AufsBackend requires root privileges
W0824 07:34:53.401134 9437 backend.cpp:76] Failed to create 'bind' backend: BindBackend requires root privileges
I0824 07:34:53.401165 9437 provisioner.cpp:255] Using default backend 'copy'
I0824 07:34:53.403098 9437 cluster.cpp:448] Creating default 'local' authorizer
I0824 07:34:53.404878 30399 slave.cpp:250] Mesos agent started on (807)@172.17.0.7:45620
I0824 07:34:53.404901 30399 slave.cpp:251] Flags at startup: --acls="" --appc_simple_discovery_uri_prefix="http://" --appc_store_dir="/tmp/Endpoint_SlaveEndpointTest_NoAuthorizer_1_rPGBwO/store/appc" --authenticate_http_executors="true" --authenticate_http_readonly="true" --authenticate_http_readwrite="true" --authenticatee="crammd5" --authentication_backoff_factor="1secs" --authorizer="local" --cgroups_cpu_enable_pids_and_tids_count="false" --cgroups_enable_cfs="false" --cgroups_hierarchy="/sys/fs/cgroup" --cgroups_limit_swap="false" --cgroups_root="mesos" --container_disk_watch_interval="15secs" --containerizers="mesos" --credential="/tmp/Endpoint_SlaveEndpointTest_NoAuthorizer_1_rPGBwO/credential" --default_role="*" --disallow_sharing_agent_pid_namespace="false" --disk_watch_interval="1mins" --docker="docker" --docker_kill_orphans="true" --docker_registry="https://registry-1.docker.io" --docker_remove_delay="6hrs" --docker_socket="/var/run/docker.sock" --docker_stop_timeout="0ns" --docker_store_dir="/tmp/Endpoint_SlaveEndpointTest_NoAuthorizer_1_rPGBwO/store/docker" --docker_volume_checkpoint_dir="/var/run/mesos/isolators/docker/volume" --enforce_container_disk_quota="false" --executor_registration_timeout="1mins" --executor_reregistration_timeout="2secs" --executor_secret_key="/tmp/Endpoint_SlaveEndpointTest_NoAuthorizer_1_rPGBwO/executor_secret_key" --executor_shutdown_grace_period="5secs" --fetcher_cache_dir="/tmp/Endpoint_SlaveEndpointTest_NoAuthorizer_1_rPGBwO/fetch" --fetcher_cache_size="2GB" --frameworks_home="" --gc_delay="1weeks" --gc_disk_headroom="0.1" --hadoop_home="" --help="false" --hostname_lookup="true" --http_command_executor="false" --http_credentials="/tmp/Endpoint_SlaveEndpointTest_NoAuthorizer_1_rPGBwO/http_credentials" --http_heartbeat_interval="30secs" --initialize_driver_logging="true" --isolation="posix/cpu,posix/mem" --launcher="posix" --launcher_dir="/mesos/mesos-1.4.0/_build/src" --logbufsecs="0" --logging_level="INFO" --max_completed_executors_per_framework="150" --oversubscribed_resources_interval="15secs" --perf_duration="10secs" --perf_interval="1mins" --port="5051" --qos_correction_interval_min="0ns" --quiet="false" --recover="reconnect" --recovery_timeout="15mins" --registration_backoff_factor="10ms" --resources="cpus:2;gpus:0;mem:1024;disk:1024;ports:[31000-32000]" --revocable_cpu_low_priority="true" --runtime_dir="/tmp/Endpoint_SlaveEndpointTest_NoAuthorizer_1_rPGBwO" --sandbox_directory="/mnt/mesos/sandbox" --strict="true" --switch_user="true" --systemd_enable_support="true" --systemd_runtime_directory="/run/systemd/system" --version="false" --work_dir="/tmp/Endpoint_SlaveEndpointTest_NoAuthorizer_1_w4Ue73"
I0824 07:34:53.405275 30399 credentials.hpp:86] Loading credential for authentication from '/tmp/Endpoint_SlaveEndpointTest_NoAuthorizer_1_rPGBwO/credential'
I0824 07:34:53.405455 30399 slave.cpp:283] Agent using credential for: test-principal
I0824 07:34:53.405478 30399 credentials.hpp:37] Loading credentials for authentication from '/tmp/Endpoint_SlaveEndpointTest_NoAuthorizer_1_rPGBwO/http_credentials'
I0824 07:34:53.405748 30399 http.cpp:1026] Creating default 'basic' HTTP authenticator for realm 'mesos-agent-executor'
I0824 07:34:53.405870 30399 http.cpp:1047] Creating default 'jwt' HTTP authenticator for realm 'mesos-agent-executor'
I0824 07:34:53.406074 30399 http.cpp:1026] Creating default 'basic' HTTP authenticator for realm 'mesos-agent-readonly'
I0824 07:34:53.406162 30399 http.cpp:1047] Creating default 'jwt' HTTP authenticator for realm 'mesos-agent-readonly'
I0824 07:34:53.406347 30399 http.cpp:1026] Creating default 'basic' HTTP authenticator for realm 'mesos-agent-readwrite'
I0824 07:34:53.406438 30399 http.cpp:1047] Creating default 'jwt' HTTP authenticator for realm 'mesos-agent-readwrite'
I0824 07:34:53.407786 30399 slave.cpp:565] Agent resources: [{"name":"cpus","scalar":{"value":2.0},"type":"SCALAR"},{"name":"mem","scalar":{"value":1024.0},"type":"SCALAR"},{"name":"disk","scalar":{"value":1024.0},"type":"SCALAR"},{"name":"ports","ranges":{"range":[{"begin":31000,"end":32000}]},"type":"RANGES"}]
I0824 07:34:53.408004 30399 slave.cpp:573] Agent attributes: [ ]
I0824 07:34:53.408017 30399 slave.cpp:582] Agent hostname: e2acee88e78e
I0824 07:34:53.408143 30405 status_update_manager.cpp:177] Pausing sending status updates
I0824 07:34:53.409612 30416 state.cpp:64] Recovering state from '/tmp/Endpoint_SlaveEndpointTest_NoAuthorizer_1_w4Ue73/meta'
I0824 07:34:53.409929 30401 status_update_manager.cpp:203] Recovering status update manager
I0824 07:34:53.410188 30398 containerizer.cpp:609] Recovering containerizer
I0824 07:34:53.411631 30413 provisioner.cpp:416] Provisioner recovery complete
I0824 07:34:53.411973 30407 slave.cpp:6242] Finished recovery
I0824 07:34:53.412502 30407 slave.cpp:6424] Querying resource estimator for oversubscribable resources
I0824 07:34:53.412741 30403 slave.cpp:6438] Received oversubscribable resources {} from the resource estimator
I0824 07:34:53.414893 30419 process.cpp:3933] Handling HTTP event for process 'slave(807)' with path: '/slave(807)/monitor/statistics.json'
I0824 07:34:53.416607 30418 http.cpp:1166] HTTP GET for /slave(807)/monitor/statistics.json from 172.17.0.7:45088
I0824 07:34:53.416676 30418 http.cpp:957] Authorizing principal 'test-principal' to GET the '/monitor/statistics.json' endpoint
I0824 07:34:53.420136 9437 slave.cpp:843] Agent terminating
[ OK ] Endpoint/SlaveEndpointTest.NoAuthorizer/1 (30 ms)
[ RUN ] Endpoint/SlaveEndpointTest.NoAuthorizer/2
I0824 07:34:53.430620 9437 containerizer.cpp:246] Using isolation: posix/cpu,posix/mem,filesystem/posix,network/cni,environment_secret
W0824 07:34:53.431121 9437 backend.cpp:76] Failed to create 'aufs' backend: AufsBackend requires root privileges
W0824 07:34:53.431232 9437 backend.cpp:76] Failed to create 'bind' backend: BindBackend requires root privileges
I0824 07:34:53.431274 9437 provisioner.cpp:255] Using default backend 'copy'
I0824 07:34:53.432834 9437 cluster.cpp:448] Creating default 'local' authorizer
I0824 07:34:53.434495 30412 slave.cpp:250] Mesos agent started on (808)@172.17.0.7:45620
I0824 07:34:53.434517 30412 slave.cpp:251] Flags at startup: --acls="" --appc_simple_discovery_uri_prefix="http://" --appc_store_dir="/tmp/Endpoint_SlaveEndpointTest_NoAuthorizer_2_FyvxpO/store/appc" --authenticate_http_executors="true" --authenticate_http_readonly="true" --authenticate_http_readwrite="true" --authenticatee="crammd5" --authentication_backoff_factor="1secs" --authorizer="local" --cgroups_cpu_enable_pids_and_tids_count="false" --cgroups_enable_cfs="false" --cgroups_hierarchy="/sys/fs/cgroup" --cgroups_limit_swap="false" --cgroups_root="mesos" --container_disk_watch_interval="15secs" --containerizers="mesos" --credential="/tmp/Endpoint_SlaveEndpointTest_NoAuthorizer_2_FyvxpO/credential" --default_role="*" --disallow_sharing_agent_pid_namespace="false" --disk_watch_interval="1mins" --docker="docker" --docker_kill_orphans="true" --docker_registry="https://registry-1.docker.io" --docker_remove_delay="6hrs" --docker_socket="/var/run/docker.sock" --docker_stop_timeout="0ns" --docker_store_dir="/tmp/Endpoint_SlaveEndpointTest_NoAuthorizer_2_FyvxpO/store/docker" --docker_volume_checkpoint_dir="/var/run/mesos/isolators/docker/volume" --enforce_container_disk_quota="false" --executor_registration_timeout="1mins" --executor_reregistration_timeout="2secs" --executor_secret_key="/tmp/Endpoint_SlaveEndpointTest_NoAuthorizer_2_FyvxpO/executor_secret_key" --executor_shutdown_grace_period="5secs" --fetcher_cache_dir="/tmp/Endpoint_SlaveEndpointTest_NoAuthorizer_2_FyvxpO/fetch" --fetcher_cache_size="2GB" --frameworks_home="" --gc_delay="1weeks" --gc_disk_headroom="0.1" --hadoop_home="" --help="false" --hostname_lookup="true" --http_command_executor="false" --http_credentials="/tmp/Endpoint_SlaveEndpointTest_NoAuthorizer_2_FyvxpO/http_credentials" --http_heartbeat_interval="30secs" --initialize_driver_logging="true" --isolation="posix/cpu,posix/mem" --launcher="posix" --launcher_dir="/mesos/mesos-1.4.0/_build/src" --logbufsecs="0" --logging_level="INFO" --max_completed_executors_per_framework="150" --oversubscribed_resources_interval="15secs" --perf_duration="10secs" --perf_interval="1mins" --port="5051" --qos_correction_interval_min="0ns" --quiet="false" --recover="reconnect" --recovery_timeout="15mins" --registration_backoff_factor="10ms" --resources="cpus:2;gpus:0;mem:1024;disk:1024;ports:[31000-32000]" --revocable_cpu_low_priority="true" --runtime_dir="/tmp/Endpoint_SlaveEndpointTest_NoAuthorizer_2_FyvxpO" --sandbox_directory="/mnt/mesos/sandbox" --strict="true" --switch_user="true" --systemd_enable_support="true" --systemd_runtime_directory="/run/systemd/system" --version="false" --work_dir="/tmp/Endpoint_SlaveEndpointTest_NoAuthorizer_2_6JQEV3"
I0824 07:34:53.434856 30412 credentials.hpp:86] Loading credential for authentication from '/tmp/Endpoint_SlaveEndpointTest_NoAuthorizer_2_FyvxpO/credential'
I0824 07:34:53.435039 30412 slave.cpp:283] Agent using credential for: test-principal
I0824 07:34:53.435062 30412 credentials.hpp:37] Loading credentials for authentication from '/tmp/Endpoint_SlaveEndpointTest_NoAuthorizer_2_FyvxpO/http_credentials'
I0824 07:34:53.435348 30412 http.cpp:1026] Creating default 'basic' HTTP authenticator for realm 'mesos-agent-executor'
I0824 07:34:53.435475 30412 http.cpp:1047] Creating default 'jwt' HTTP authenticator for realm 'mesos-agent-executor'
I0824 07:34:53.435679 30412 http.cpp:1026] Creating default 'basic' HTTP authenticator for realm 'mesos-agent-readonly'
I0824 07:34:53.435789 30412 http.cpp:1047] Creating default 'jwt' HTTP authenticator for realm 'mesos-agent-readonly'
I0824 07:34:53.435976 30412 http.cpp:1026] Creating default 'basic' HTTP authenticator for realm 'mesos-agent-readwrite'
I0824 07:34:53.436086 30412 http.cpp:1047] Creating default 'jwt' HTTP authenticator for realm 'mesos-agent-readwrite'
I0824 07:34:53.437333 30412 slave.cpp:565] Agent resources: [{"name":"cpus","scalar":{"value":2.0},"type":"SCALAR"},{"name":"mem","scalar":{"value":1024.0},"type":"SCALAR"},{"name":"disk","scalar":{"value":1024.0},"type":"SCALAR"},{"name":"ports","ranges":{"range":[{"begin":31000,"end":32000}]},"type":"RANGES"}]
I0824 07:34:53.437542 30412 slave.cpp:573] Agent attributes: [ ]
I0824 07:34:53.437561 30412 slave.cpp:582] Agent hostname: e2acee88e78e
I0824 07:34:53.437682 30409 status_update_manager.cpp:177] Pausing sending status updates
I0824 07:34:53.439046 30410 state.cpp:64] Recovering state from '/tmp/Endpoint_SlaveEndpointTest_NoAuthorizer_2_6JQEV3/meta'
I0824 07:34:53.439293 30400 status_update_manager.cpp:203] Recovering status update manager
I0824 07:34:53.439441 30418 containerizer.cpp:609] Recovering containerizer
I0824 07:34:53.440567 30402 provisioner.cpp:416] Provisioner recovery complete
I0824 07:34:53.440852 30420 slave.cpp:6242] Finished recovery
I0824 07:34:53.441279 30420 slave.cpp:6424] Querying resource estimator for oversubscribable resources
I0824 07:34:53.441484 30415 slave.cpp:6438] Received oversubscribable resources {} from the resource estimator
I0824 07:34:53.443348 30405 process.cpp:3933] Handling HTTP event for process 'slave(808)' with path: '/slave(808)/containers'
I0824 07:34:53.444932 30400 http.cpp:1166] HTTP GET for /slave(808)/containers from 172.17.0.7:45094
I0824 07:34:53.444995 30400 http.cpp:957] Authorizing principal 'test-principal' to GET the '/containers' endpoint
I0824 07:34:53.447490 30418 slave.cpp:843] Agent terminating
[ OK ] Endpoint/SlaveEndpointTest.NoAuthorizer/2 (27 ms)
[----------] 9 tests from Endpoint/SlaveEndpointTest (260 ms total)
[----------] 2 tests from ContainerizerType/DefaultContainerDNSFlagTest
[ RUN ] ContainerizerType/DefaultContainerDNSFlagTest.ValidateFlag/0
[ OK ] ContainerizerType/DefaultContainerDNSFlagTest.ValidateFlag/0 (9 ms)
[ RUN ] ContainerizerType/DefaultContainerDNSFlagTest.ValidateFlag/1
[ OK ] ContainerizerType/DefaultContainerDNSFlagTest.ValidateFlag/1 (9 ms)
[----------] 2 tests from ContainerizerType/DefaultContainerDNSFlagTest (18 ms total)
[----------] Global test environment tear-down
[==========] 1660 tests from 184 test cases ran. (558385 ms total)
[ PASSED ] 1659 tests.
[ FAILED ] 1 test, listed below:
[ FAILED ] DefaultExecutorCheckTest.CommandCheckDeliveredAndReconciled
1 FAILED TEST
YOU HAVE 20 DISABLED TESTS
I0824 07:34:53.526466 30421 process.cpp:1072] Failed to accept socket: future discarded
make[4]: *** [check-local] Error 1
make[4]: Leaving directory `/mesos/mesos-1.4.0/_build/src'
make[3]: *** [check-am] Error 2
make[3]: Leaving directory `/mesos/mesos-1.4.0/_build/src'
make[2]: *** [check] Error 2
make[2]: Leaving directory `/mesos/mesos-1.4.0/_build/src'
make[1]: *** [check-recursive] Error 1
make[1]: Leaving directory `/mesos/mesos-1.4.0/_build'
make: *** [distcheck] Error 1
+ docker rmi mesos-1503557335-13130
Untagged: mesos-1503557335-13130:latest
Deleted: sha256:966aed9ebcfa85eac182c23cf4a74e324028a926f4d80004ac89d9cef6c61952
Deleted: sha256:5aa94608cb3699152c8053661f0715a5045a0a21df7abd98b5ed6db1b4b98e7f
Deleted: sha256:1428a8f2f6061e34eb48d5b5e13a166aa1c5d76f086434a05c1224105ca95740
Deleted: sha256:59de69a26f5dc53e19a46a130b526ca18cfe942bb395e056f5bfa706ae8b188e
Deleted: sha256:c37c18f9ebad95f2a969d3defa9fcffe838bec26cda36223ef992d4abddc4167
Deleted: sha256:23cb419fae859fa8f04175eb68c17b7403fa4f7caa93efa9e720a5cdc95e24ba
Deleted: sha256:6dcd0c857daa68bd846b5eb90e2756cafdbc2d31e7bde5facc8503b1fcdf5af6
Deleted: sha256:02d27c09ecf1587ad403e239c23d0d96fff196014978724d5a431dde7c1978ae
Deleted: sha256:ad59c5a370485826671227be844d76d83f9a3678a769a950292ffb51e44afd81
Deleted: sha256:666e5cd42a74b5e2ee7671fc0c155e201e13fb65ab002f714b6104cd627c10aa
Deleted: sha256:933e45539e933da0203b1e1419c541ba83d9bf7e31e6b3e8c123d8c2f2a95633
Deleted: sha256:2042bde5e2720c1360ebc35fb8dd344f008fc70cfb39b0e8c7f6308efe2098ba
Deleted: sha256:32625200fb72c00390f696be8db0f4c3dd47f0c8f77534bf46cb5954e50950c9
Deleted: sha256:3e2bfe27828a1aca11e6917157779b36626e0ffab9f1e9f862e9d17a6c1b0221
Deleted: sha256:e52beda749a3451c0f7e6dee104ed4d5da795b99e110ee6667077a30ad05a702
Deleted: sha256:61fce9c320dc052d19dbe51a4c65206bb3e4a39f30e4f650b0dfd1ae5240851a
Deleted: sha256:15d78e9a598875c3ba1d21aceb61d11399643ac8ec51491cc6c44806a1ae70c4
Deleted: sha256:5b01356594ed84826b44b59530684b40ae30776b5a445ae729ac3ae533127e9f
Deleted: sha256:cffae2d05eb3aa4222ba5feb603afc98a8fce6729bf1fb36f4f1cdc7c23e7212
Deleted: sha256:93c487ba492e870fcd49bd6b53448a8000043540e9302fe0657ac06b5295df1b
Deleted: sha256:276d8bdf6da07e2e322aa58e020ce9b5ec5be9f1e468d5cc3d976dacc66578ac
Deleted: sha256:ddd8e98c28e015ace0cf0c36803c5e112a7b6d6b8317fe8e469003c9ca0c2523
Deleted: sha256:ce8e6acc16fdd69d86b911840112b8b6331e19e1fe10b4c27eb32ebb405ea023
Deleted: sha256:21faaf8b6758625bcfa1d3cdebc4660e325fa10072b51e0214c7f4de24f58edc
Deleted: sha256:9161ae2e2ea9ce7cda88606c06e0560eb43418650ab5839bbccd33a4d8cea58f
Build step 'Execute shell' marked build as failure
Not sending mail to unregistered user yujie.jay@gmail.com