You are viewing a plain text version of this content. The canonical link for it is here.
Posted to builds@solr.apache.org by Apache Jenkins Server <je...@builds.apache.org> on 2026/04/30 00:24:18 UTC

[JENKINS] Solr » Solr-Test-main - Build # 13877 - Still Failing!

Build: https://ci-builds.apache.org/job/Solr/job/Solr-Test-main/13877/

No tests ran.

Build Log:
[...truncated 168 lines...]
BUILD FAILED in 1m 25s
55 actionable tasks: 55 executed

Publishing Build Scan to Develocity...
https://develocity.apache.org/s/uxdwfbptxzznu

Build step 'Invoke Gradle script' changed build result to FAILURE
Build step 'Invoke Gradle script' marked build as failure
Archiving artifacts
Recording test results
ERROR: Step ‘Publish JUnit test result report’ failed: No test report files were found. Configuration error?
Email was triggered for: Failure - Any
Sending email for trigger: Failure - Any

[JENKINS] Solr » Solr-Test-main - Build # 13899 - Still unstable!

Posted by Apache Jenkins Server <je...@builds.apache.org>.
Build: https://ci-builds.apache.org/job/Solr/job/Solr-Test-main/13899/

1 tests failed.
FAILED:  org.apache.solr.cloud.api.collections.TestReplicaProperties.classMethod

Error Message:
java.lang.AssertionError: ObjectTracker found 1 object(s) that were not released!!! [ZkShardTerms]
org.apache.solr.cloud.ZkShardTerms:org.apache.solr.common.util.ObjectReleaseTracker$ObjectTrackerException: org.apache.solr.cloud.ZkShardTerms@1264081114
	at org.apache.solr.common.util.ObjectReleaseTracker.track(ObjectReleaseTracker.java:57)
	at org.apache.solr.cloud.ZkShardTerms.<init>(ZkShardTerms.java:114)
	at org.apache.solr.cloud.ZkCollectionTerms.lambda$getShard$0(ZkCollectionTerms.java:45)
	at java.base/java.util.HashMap.compute(HashMap.java:1324)
	at org.apache.solr.cloud.ZkCollectionTerms.getShard(ZkCollectionTerms.java:41)
	at org.apache.solr.cloud.ZkController.getShardTerms(ZkController.java:1939)
	at org.apache.solr.cloud.SyncStrategy.syncToMe(SyncStrategy.java:268)
	at org.apache.solr.cloud.SyncStrategy.syncReplicas(SyncStrategy.java:171)
	at org.apache.solr.cloud.SyncStrategy.sync(SyncStrategy.java:108)
	at org.apache.solr.cloud.ShardLeaderElectionContext.runLeaderProcess(ShardLeaderElectionContext.java:219)
	at org.apache.solr.cloud.LeaderElector.runIamLeaderProcess(LeaderElector.java:168)
	at org.apache.solr.cloud.LeaderElector.checkIfIamLeader(LeaderElector.java:129)
	at org.apache.solr.cloud.LeaderElector$ElectionWatcher.process(LeaderElector.java:342)
	at org.apache.solr.common.cloud.SolrZkClient$ProcessWatchWithExecutor.lambda$process$0(SolrZkClient.java:1061)
	at org.apache.solr.common.util.ExecutorUtil$MDCAwareThreadPoolExecutor.lambda$execute$0(ExecutorUtil.java:381)
	at java.base/java.util.concurrent.ThreadPoolExecutor.runWorker(ThreadPoolExecutor.java:1144)
	at java.base/java.util.concurrent.ThreadPoolExecutor$Worker.run(ThreadPoolExecutor.java:642)
	at java.base/java.lang.Thread.run(Thread.java:1583)
Caused by: java.lang.Exception: Submitter stack trace
	at org.apache.solr.common.util.ExecutorUtil$MDCAwareThreadPoolExecutor.execute(ExecutorUtil.java:348)
	at org.apache.solr.common.cloud.SolrZkClient$ProcessWatchWithExecutor.process(SolrZkClient.java:1057)
	at org.apache.curator.framework.imps.NamespaceWatcher.process(NamespaceWatcher.java:69)
	at org.apache.zookeeper.ClientCnxn$EventThread.processEvent(ClientCnxn.java:566)
	at org.apache.zookeeper.ClientCnxn$EventThread.run(ClientCnxn.java:541)

 expected null, but was:<ObjectTracker found 1 object(s) that were not released!!! [ZkShardTerms]
org.apache.solr.cloud.ZkShardTerms:org.apache.solr.common.util.ObjectReleaseTracker$ObjectTrackerException: org.apache.solr.cloud.ZkShardTerms@1264081114
	at org.apache.solr.common.util.ObjectReleaseTracker.track(ObjectReleaseTracker.java:57)
	at org.apache.solr.cloud.ZkShardTerms.<init>(ZkShardTerms.java:114)
	at org.apache.solr.cloud.ZkCollectionTerms.lambda$getShard$0(ZkCollectionTerms.java:45)
	at java.base/java.util.HashMap.compute(HashMap.java:1324)
	at org.apache.solr.cloud.ZkCollectionTerms.getShard(ZkCollectionTerms.java:41)
	at org.apache.solr.cloud.ZkController.getShardTerms(ZkController.java:1939)
	at org.apache.solr.cloud.SyncStrategy.syncToMe(SyncStrategy.java:268)
	at org.apache.solr.cloud.SyncStrategy.syncReplicas(SyncStrategy.java:171)
	at org.apache.solr.cloud.SyncStrategy.sync(SyncStrategy.java:108)
	at org.apache.solr.cloud.ShardLeaderElectionContext.runLeaderProcess(ShardLeaderElectionContext.java:219)
	at org.apache.solr.cloud.LeaderElector.runIamLeaderProcess(LeaderElector.java:168)
	at org.apache.solr.cloud.LeaderElector.checkIfIamLeader(LeaderElector.java:129)
	at org.apache.solr.cloud.LeaderElector$ElectionWatcher.process(LeaderElector.java:342)
	at org.apache.solr.common.cloud.SolrZkClient$ProcessWatchWithExecutor.lambda$process$0(SolrZkClient.java:1061)
	at org.apache.solr.common.util.ExecutorUtil$MDCAwareThreadPoolExecutor.lambda$execute$0(ExecutorUtil.java:381)
	at java.base/java.util.concurrent.ThreadPoolExecutor.runWorker(ThreadPoolExecutor.java:1144)
	at java.base/java.util.concurrent.ThreadPoolExecutor$Worker.run(ThreadPoolExecutor.java:642)
	at java.base/java.lang.Thread.run(Thread.java:1583)
Caused by: java.lang.Exception: Submitter stack trace
	at org.apache.solr.common.util.ExecutorUtil$MDCAwareThreadPoolExecutor.execute(ExecutorUtil.java:348)
	at org.apache.solr.common.cloud.SolrZkClient$ProcessWatchWithExecutor.process(SolrZkClient.java:1057)
	at org.apache.curator.framework.imps.NamespaceWatcher.process(NamespaceWatcher.java:69)
	at org.apache.zookeeper.ClientCnxn$EventThread.processEvent(ClientCnxn.java:566)
	at org.apache.zookeeper.ClientCnxn$EventThread.run(ClientCnxn.java:541)

>

Stack Trace:
java.lang.AssertionError: ObjectTracker found 1 object(s) that were not released!!! [ZkShardTerms]
org.apache.solr.cloud.ZkShardTerms:org.apache.solr.common.util.ObjectReleaseTracker$ObjectTrackerException: org.apache.solr.cloud.ZkShardTerms@1264081114
	at org.apache.solr.common.util.ObjectReleaseTracker.track(ObjectReleaseTracker.java:57)
	at org.apache.solr.cloud.ZkShardTerms.<init>(ZkShardTerms.java:114)
	at org.apache.solr.cloud.ZkCollectionTerms.lambda$getShard$0(ZkCollectionTerms.java:45)
	at java.base/java.util.HashMap.compute(HashMap.java:1324)
	at org.apache.solr.cloud.ZkCollectionTerms.getShard(ZkCollectionTerms.java:41)
	at org.apache.solr.cloud.ZkController.getShardTerms(ZkController.java:1939)
	at org.apache.solr.cloud.SyncStrategy.syncToMe(SyncStrategy.java:268)
	at org.apache.solr.cloud.SyncStrategy.syncReplicas(SyncStrategy.java:171)
	at org.apache.solr.cloud.SyncStrategy.sync(SyncStrategy.java:108)
	at org.apache.solr.cloud.ShardLeaderElectionContext.runLeaderProcess(ShardLeaderElectionContext.java:219)
	at org.apache.solr.cloud.LeaderElector.runIamLeaderProcess(LeaderElector.java:168)
	at org.apache.solr.cloud.LeaderElector.checkIfIamLeader(LeaderElector.java:129)
	at org.apache.solr.cloud.LeaderElector$ElectionWatcher.process(LeaderElector.java:342)
	at org.apache.solr.common.cloud.SolrZkClient$ProcessWatchWithExecutor.lambda$process$0(SolrZkClient.java:1061)
	at org.apache.solr.common.util.ExecutorUtil$MDCAwareThreadPoolExecutor.lambda$execute$0(ExecutorUtil.java:381)
	at java.base/java.util.concurrent.ThreadPoolExecutor.runWorker(ThreadPoolExecutor.java:1144)
	at java.base/java.util.concurrent.ThreadPoolExecutor$Worker.run(ThreadPoolExecutor.java:642)
	at java.base/java.lang.Thread.run(Thread.java:1583)
Caused by: java.lang.Exception: Submitter stack trace
	at org.apache.solr.common.util.ExecutorUtil$MDCAwareThreadPoolExecutor.execute(ExecutorUtil.java:348)
	at org.apache.solr.common.cloud.SolrZkClient$ProcessWatchWithExecutor.process(SolrZkClient.java:1057)
	at org.apache.curator.framework.imps.NamespaceWatcher.process(NamespaceWatcher.java:69)
	at org.apache.zookeeper.ClientCnxn$EventThread.processEvent(ClientCnxn.java:566)
	at org.apache.zookeeper.ClientCnxn$EventThread.run(ClientCnxn.java:541)

 expected null, but was:<ObjectTracker found 1 object(s) that were not released!!! [ZkShardTerms]
org.apache.solr.cloud.ZkShardTerms:org.apache.solr.common.util.ObjectReleaseTracker$ObjectTrackerException: org.apache.solr.cloud.ZkShardTerms@1264081114
	at org.apache.solr.common.util.ObjectReleaseTracker.track(ObjectReleaseTracker.java:57)
	at org.apache.solr.cloud.ZkShardTerms.<init>(ZkShardTerms.java:114)
	at org.apache.solr.cloud.ZkCollectionTerms.lambda$getShard$0(ZkCollectionTerms.java:45)
	at java.base/java.util.HashMap.compute(HashMap.java:1324)
	at org.apache.solr.cloud.ZkCollectionTerms.getShard(ZkCollectionTerms.java:41)
	at org.apache.solr.cloud.ZkController.getShardTerms(ZkController.java:1939)
	at org.apache.solr.cloud.SyncStrategy.syncToMe(SyncStrategy.java:268)
	at org.apache.solr.cloud.SyncStrategy.syncReplicas(SyncStrategy.java:171)
	at org.apache.solr.cloud.SyncStrategy.sync(SyncStrategy.java:108)
	at org.apache.solr.cloud.ShardLeaderElectionContext.runLeaderProcess(ShardLeaderElectionContext.java:219)
	at org.apache.solr.cloud.LeaderElector.runIamLeaderProcess(LeaderElector.java:168)
	at org.apache.solr.cloud.LeaderElector.checkIfIamLeader(LeaderElector.java:129)
	at org.apache.solr.cloud.LeaderElector$ElectionWatcher.process(LeaderElector.java:342)
	at org.apache.solr.common.cloud.SolrZkClient$ProcessWatchWithExecutor.lambda$process$0(SolrZkClient.java:1061)
	at org.apache.solr.common.util.ExecutorUtil$MDCAwareThreadPoolExecutor.lambda$execute$0(ExecutorUtil.java:381)
	at java.base/java.util.concurrent.ThreadPoolExecutor.runWorker(ThreadPoolExecutor.java:1144)
	at java.base/java.util.concurrent.ThreadPoolExecutor$Worker.run(ThreadPoolExecutor.java:642)
	at java.base/java.lang.Thread.run(Thread.java:1583)
Caused by: java.lang.Exception: Submitter stack trace
	at org.apache.solr.common.util.ExecutorUtil$MDCAwareThreadPoolExecutor.execute(ExecutorUtil.java:348)
	at org.apache.solr.common.cloud.SolrZkClient$ProcessWatchWithExecutor.process(SolrZkClient.java:1057)
	at org.apache.curator.framework.imps.NamespaceWatcher.process(NamespaceWatcher.java:69)
	at org.apache.zookeeper.ClientCnxn$EventThread.processEvent(ClientCnxn.java:566)
	at org.apache.zookeeper.ClientCnxn$EventThread.run(ClientCnxn.java:541)

>
	at __randomizedtesting.SeedInfo.seed([5DFF6FAAE1DEDE46]:0)
	at org.junit.Assert.fail(Assert.java:89)
	at org.junit.Assert.failNotNull(Assert.java:756)
	at org.junit.Assert.assertNull(Assert.java:738)
	at org.apache.solr.SolrTestCase$1.afterIfSuccessful(SolrTestCase.java:100)
	at com.carrotsearch.randomizedtesting.rules.TestRuleAdapter$1.afterIfSuccessful(TestRuleAdapter.java:36)
	at com.carrotsearch.randomizedtesting.rules.StatementAdapter.evaluate(StatementAdapter.java:37)
	at com.carrotsearch.randomizedtesting.rules.StatementAdapter.evaluate(StatementAdapter.java:36)
	at org.apache.lucene.tests.util.AbstractBeforeAfterRule$1.evaluate(AbstractBeforeAfterRule.java:43)
	at com.carrotsearch.randomizedtesting.rules.SystemPropertiesRestoreRule$1.evaluate(SystemPropertiesRestoreRule.java:80)
	at org.junit.rules.RunRules.evaluate(RunRules.java:20)
	at org.apache.lucene.tests.util.AbstractBeforeAfterRule$1.evaluate(AbstractBeforeAfterRule.java:43)
	at com.carrotsearch.randomizedtesting.rules.StatementAdapter.evaluate(StatementAdapter.java:36)
	at org.apache.lucene.tests.util.TestRuleStoreClassName$1.evaluate(TestRuleStoreClassName.java:38)
	at com.carrotsearch.randomizedtesting.rules.NoShadowingOrOverridesOnMethodsRule$1.evaluate(NoShadowingOrOverridesOnMethodsRule.java:40)
	at com.carrotsearch.randomizedtesting.rules.NoShadowingOrOverridesOnMethodsRule$1.evaluate(NoShadowingOrOverridesOnMethodsRule.java:40)
	at com.carrotsearch.randomizedtesting.rules.StatementAdapter.evaluate(StatementAdapter.java:36)
	at com.carrotsearch.randomizedtesting.rules.StatementAdapter.evaluate(StatementAdapter.java:36)
	at org.apache.lucene.tests.util.TestRuleAssertionsRequired$1.evaluate(TestRuleAssertionsRequired.java:53)
	at org.apache.lucene.tests.util.AbstractBeforeAfterRule$1.evaluate(AbstractBeforeAfterRule.java:43)
	at org.apache.lucene.tests.util.TestRuleMarkFailure$1.evaluate(TestRuleMarkFailure.java:44)
	at org.apache.lucene.tests.util.TestRuleIgnoreAfterMaxFailures$1.evaluate(TestRuleIgnoreAfterMaxFailures.java:60)
	at org.apache.lucene.tests.util.TestRuleIgnoreTestSuites$1.evaluate(TestRuleIgnoreTestSuites.java:47)
	at org.junit.rules.RunRules.evaluate(RunRules.java:20)
	at com.carrotsearch.randomizedtesting.rules.StatementAdapter.evaluate(StatementAdapter.java:36)
	at com.carrotsearch.randomizedtesting.ThreadLeakControl$StatementRunner.run(ThreadLeakControl.java:390)
	at com.carrotsearch.randomizedtesting.ThreadLeakControl.lambda$forkTimeoutingTask$0(ThreadLeakControl.java:850)
	at java.base/java.lang.Thread.run(Thread.java:1583)




Build Log:
[...truncated 13289 lines...]
ERROR: The following test(s) have failed:
  - org.apache.solr.cloud.api.collections.TestReplicaProperties (:solr:core)
    Test history: https://develocity.apache.org/scans/tests?search.rootProjectNames=solr-root&tests.container=org.apache.solr.cloud.api.collections.TestReplicaProperties
    Test output: /home/jenkins/jenkins-agent/workspace/Solr/Solr-Test-main/solr/core/build/test-results/test/outputs/OUTPUT-org.apache.solr.cloud.api.collections.TestReplicaProperties.txt
    Reproduce with: ./gradlew :solr:core:test --tests "org.apache.solr.cloud.api.collections.TestReplicaProperties" -Ptests.haltonfailure=false "-Ptests.jvmargs=-XX:TieredStopAtLevel=1 -XX:+UseParallelGC -XX:ActiveProcessorCount=1 -XX:ReservedCodeCacheSize=120m" -Ptests.seed=5DFF6FAAE1DEDE46 -Ptests.multiplier=2 -Ptests.useSecurityManager=true -Ptests.badapples=false -Ptests.file.encoding=UTF-8


Deprecated Gradle features were used in this build, making it incompatible with Gradle 9.0.

You can use '--warning-mode all' to show the individual deprecation warnings and determine if they come from your own scripts or plugins.

For more on this, please refer to https://docs.gradle.org/8.10/userguide/command_line_interface.html#sec:command_line_warnings in the Gradle documentation.

BUILD SUCCESSFUL in 42m 58s
152 actionable tasks: 152 executed

Publishing Build Scan to Develocity...
https://develocity.apache.org/s/3v3ohtkhymcyg

Build step 'Invoke Gradle script' changed build result to SUCCESS
Archiving artifacts
‘**/*.events’ doesn’t match anything: ‘**’ exists but not ‘**/*.events’
No artifacts found that match the file pattern "**/*.events,heapdumps/**,**/hs_err_pid*". Configuration error?
Recording test results
[Checks API] No suitable checks publisher found.
Build step 'Publish JUnit test result report' changed build result to UNSTABLE
Email was triggered for: Unstable (Test Failures)
Sending email for trigger: Unstable (Test Failures)

[JENKINS] Solr » Solr-Test-main - Build # 13898 - Still Failing!

Posted by Apache Jenkins Server <je...@builds.apache.org>.
Build: https://ci-builds.apache.org/job/Solr/job/Solr-Test-main/13898/

No tests ran.

Build Log:
[...truncated 168 lines...]
BUILD FAILED in 1m 33s
55 actionable tasks: 55 executed

Publishing Build Scan to Develocity...
https://develocity.apache.org/s/f7gf7onzarfkk

Build step 'Invoke Gradle script' changed build result to FAILURE
Build step 'Invoke Gradle script' marked build as failure
Archiving artifacts
Recording test results
ERROR: Step ‘Publish JUnit test result report’ failed: No test report files were found. Configuration error?
Email was triggered for: Failure - Any
Sending email for trigger: Failure - Any

[JENKINS] Solr » Solr-Test-main - Build # 13897 - Still Failing!

Posted by Apache Jenkins Server <je...@builds.apache.org>.
Build: https://ci-builds.apache.org/job/Solr/job/Solr-Test-main/13897/

No tests ran.

Build Log:
[...truncated 168 lines...]
BUILD FAILED in 1m 23s
55 actionable tasks: 55 executed

Publishing Build Scan to Develocity...
https://develocity.apache.org/s/q6q32xxqq2ryo

Build step 'Invoke Gradle script' changed build result to FAILURE
Build step 'Invoke Gradle script' marked build as failure
Archiving artifacts
Recording test results
ERROR: Step ‘Publish JUnit test result report’ failed: No test report files were found. Configuration error?
Email was triggered for: Failure - Any
Sending email for trigger: Failure - Any

[JENKINS] Solr » Solr-Test-main - Build # 13896 - Still Failing!

Posted by Apache Jenkins Server <je...@builds.apache.org>.
Build: https://ci-builds.apache.org/job/Solr/job/Solr-Test-main/13896/

No tests ran.

Build Log:
[...truncated 169 lines...]
BUILD FAILED in 1m 23s
55 actionable tasks: 55 executed

Publishing Build Scan to Develocity...
https://develocity.apache.org/s/kogbzxeaojbhu

Build step 'Invoke Gradle script' changed build result to FAILURE
Build step 'Invoke Gradle script' marked build as failure
Archiving artifacts
Recording test results
ERROR: Step ‘Publish JUnit test result report’ failed: No test report files were found. Configuration error?
Email was triggered for: Failure - Any
Sending email for trigger: Failure - Any

[JENKINS] Solr » Solr-Test-main - Build # 13895 - Still Failing!

Posted by Apache Jenkins Server <je...@builds.apache.org>.
Build: https://ci-builds.apache.org/job/Solr/job/Solr-Test-main/13895/

No tests ran.

Build Log:
[...truncated 169 lines...]
BUILD FAILED in 1m 21s
55 actionable tasks: 55 executed

Publishing Build Scan to Develocity...
https://develocity.apache.org/s/xjvkf77phq6dg

Build step 'Invoke Gradle script' changed build result to FAILURE
Build step 'Invoke Gradle script' marked build as failure
Archiving artifacts
Recording test results
ERROR: Step ‘Publish JUnit test result report’ failed: No test report files were found. Configuration error?
Email was triggered for: Failure - Any
Sending email for trigger: Failure - Any

[JENKINS] Solr » Solr-Test-main - Build # 13894 - Still Failing!

Posted by Apache Jenkins Server <je...@builds.apache.org>.
Build: https://ci-builds.apache.org/job/Solr/job/Solr-Test-main/13894/

No tests ran.

Build Log:
[...truncated 168 lines...]
BUILD FAILED in 1m 20s
55 actionable tasks: 55 executed

Publishing Build Scan to Develocity...
https://develocity.apache.org/s/6pwgtfgwytqss

Build step 'Invoke Gradle script' changed build result to FAILURE
Build step 'Invoke Gradle script' marked build as failure
Archiving artifacts
Recording test results
ERROR: Step ‘Publish JUnit test result report’ failed: No test report files were found. Configuration error?
Email was triggered for: Failure - Any
Sending email for trigger: Failure - Any

[JENKINS] Solr » Solr-Test-main - Build # 13893 - Still Failing!

Posted by Apache Jenkins Server <je...@builds.apache.org>.
Build: https://ci-builds.apache.org/job/Solr/job/Solr-Test-main/13893/

No tests ran.

Build Log:
[...truncated 168 lines...]
BUILD FAILED in 1m 30s
55 actionable tasks: 55 executed

Publishing Build Scan to Develocity...
https://develocity.apache.org/s/shwqkoxvesynu

Build step 'Invoke Gradle script' changed build result to FAILURE
Build step 'Invoke Gradle script' marked build as failure
Archiving artifacts
Recording test results
ERROR: Step ‘Publish JUnit test result report’ failed: No test report files were found. Configuration error?
Email was triggered for: Failure - Any
Sending email for trigger: Failure - Any

[JENKINS] Solr » Solr-Test-main - Build # 13892 - Still Failing!

Posted by Apache Jenkins Server <je...@builds.apache.org>.
Build: https://ci-builds.apache.org/job/Solr/job/Solr-Test-main/13892/

No tests ran.

Build Log:
[...truncated 169 lines...]
BUILD FAILED in 1m 31s
55 actionable tasks: 55 executed

Publishing Build Scan to Develocity...
https://develocity.apache.org/s/2fhulhh5dqox6

Build step 'Invoke Gradle script' changed build result to FAILURE
Build step 'Invoke Gradle script' marked build as failure
Archiving artifacts
Recording test results
ERROR: Step ‘Publish JUnit test result report’ failed: No test report files were found. Configuration error?
Email was triggered for: Failure - Any
Sending email for trigger: Failure - Any

[JENKINS] Solr » Solr-Test-main - Build # 13891 - Still Failing!

Posted by Apache Jenkins Server <je...@builds.apache.org>.
Build: https://ci-builds.apache.org/job/Solr/job/Solr-Test-main/13891/

No tests ran.

Build Log:
[...truncated 168 lines...]
BUILD FAILED in 1m 22s
55 actionable tasks: 55 executed

Publishing Build Scan to Develocity...
https://develocity.apache.org/s/t6lodacnb4efu

Build step 'Invoke Gradle script' changed build result to FAILURE
Build step 'Invoke Gradle script' marked build as failure
Archiving artifacts
Recording test results
ERROR: Step ‘Publish JUnit test result report’ failed: No test report files were found. Configuration error?
Email was triggered for: Failure - Any
Sending email for trigger: Failure - Any

[JENKINS] Solr » Solr-Test-main - Build # 13890 - Still Failing!

Posted by Apache Jenkins Server <je...@builds.apache.org>.
Build: https://ci-builds.apache.org/job/Solr/job/Solr-Test-main/13890/

No tests ran.

Build Log:
[...truncated 170 lines...]
BUILD FAILED in 1m 46s
55 actionable tasks: 55 executed

Publishing Build Scan to Develocity...
https://develocity.apache.org/s/zkpmc5tsum4z2

Build step 'Invoke Gradle script' changed build result to FAILURE
Build step 'Invoke Gradle script' marked build as failure
Archiving artifacts
Recording test results
ERROR: Step ‘Publish JUnit test result report’ failed: No test report files were found. Configuration error?
Email was triggered for: Failure - Any
Sending email for trigger: Failure - Any

[JENKINS] Solr » Solr-Test-main - Build # 13889 - Still Failing!

Posted by Apache Jenkins Server <je...@builds.apache.org>.
Build: https://ci-builds.apache.org/job/Solr/job/Solr-Test-main/13889/

No tests ran.

Build Log:
[...truncated 169 lines...]
BUILD FAILED in 1m 26s
55 actionable tasks: 55 executed

Publishing Build Scan to Develocity...
https://develocity.apache.org/s/yolv3wxc2255a

Build step 'Invoke Gradle script' changed build result to FAILURE
Build step 'Invoke Gradle script' marked build as failure
Archiving artifacts
Recording test results
ERROR: Step ‘Publish JUnit test result report’ failed: No test report files were found. Configuration error?
Email was triggered for: Failure - Any
Sending email for trigger: Failure - Any

[JENKINS] Solr » Solr-Test-main - Build # 13888 - Still Failing!

Posted by Apache Jenkins Server <je...@builds.apache.org>.
Build: https://ci-builds.apache.org/job/Solr/job/Solr-Test-main/13888/

No tests ran.

Build Log:
[...truncated 170 lines...]
BUILD FAILED in 1m 26s
55 actionable tasks: 55 executed

Publishing Build Scan to Develocity...
https://develocity.apache.org/s/k54siv5qkhy6k

Build step 'Invoke Gradle script' changed build result to FAILURE
Build step 'Invoke Gradle script' marked build as failure
Archiving artifacts
Recording test results
ERROR: Step ‘Publish JUnit test result report’ failed: No test report files were found. Configuration error?
Email was triggered for: Failure - Any
Sending email for trigger: Failure - Any

[JENKINS] Solr » Solr-Test-main - Build # 13887 - Still Failing!

Posted by Apache Jenkins Server <je...@builds.apache.org>.
Build: https://ci-builds.apache.org/job/Solr/job/Solr-Test-main/13887/

No tests ran.

Build Log:
[...truncated 178 lines...]
BUILD FAILED in 1m 38s
55 actionable tasks: 55 executed

Publishing Build Scan to Develocity...
https://develocity.apache.org/s/tlfch6ldwxtzs

Build step 'Invoke Gradle script' changed build result to FAILURE
Build step 'Invoke Gradle script' marked build as failure
Archiving artifacts
Recording test results
ERROR: Step ‘Publish JUnit test result report’ failed: No test report files were found. Configuration error?
Email was triggered for: Failure - Any
Sending email for trigger: Failure - Any

[JENKINS] Solr » Solr-Test-main - Build # 13886 - Still Failing!

Posted by Apache Jenkins Server <je...@builds.apache.org>.
Build: https://ci-builds.apache.org/job/Solr/job/Solr-Test-main/13886/

No tests ran.

Build Log:
[...truncated 168 lines...]
BUILD FAILED in 1m 42s
55 actionable tasks: 55 executed

Publishing Build Scan to Develocity...
https://develocity.apache.org/s/2l3sslf6hhtvs

Build step 'Invoke Gradle script' changed build result to FAILURE
Build step 'Invoke Gradle script' marked build as failure
Archiving artifacts
Recording test results
ERROR: Step ‘Publish JUnit test result report’ failed: No test report files were found. Configuration error?
Email was triggered for: Failure - Any
Sending email for trigger: Failure - Any

[JENKINS] Solr » Solr-Test-main - Build # 13885 - Still Failing!

Posted by Apache Jenkins Server <je...@builds.apache.org>.
Build: https://ci-builds.apache.org/job/Solr/job/Solr-Test-main/13885/

No tests ran.

Build Log:
[...truncated 169 lines...]
BUILD FAILED in 1m 18s
55 actionable tasks: 55 executed

Publishing Build Scan to Develocity...
https://develocity.apache.org/s/4q5bial3vs22o

Build step 'Invoke Gradle script' changed build result to FAILURE
Build step 'Invoke Gradle script' marked build as failure
Archiving artifacts
Recording test results
ERROR: Step ‘Publish JUnit test result report’ failed: No test report files were found. Configuration error?
Email was triggered for: Failure - Any
Sending email for trigger: Failure - Any

[JENKINS] Solr » Solr-Test-main - Build # 13884 - Still Failing!

Posted by Apache Jenkins Server <je...@builds.apache.org>.
Build: https://ci-builds.apache.org/job/Solr/job/Solr-Test-main/13884/

No tests ran.

Build Log:
[...truncated 168 lines...]
BUILD FAILED in 1m 17s
55 actionable tasks: 55 executed

Publishing Build Scan to Develocity...
https://develocity.apache.org/s/5dec557b2fyne

Build step 'Invoke Gradle script' changed build result to FAILURE
Build step 'Invoke Gradle script' marked build as failure
Archiving artifacts
Recording test results
ERROR: Step ‘Publish JUnit test result report’ failed: No test report files were found. Configuration error?
Email was triggered for: Failure - Any
Sending email for trigger: Failure - Any

[JENKINS] Solr » Solr-Test-main - Build # 13883 - Still Failing!

Posted by Apache Jenkins Server <je...@builds.apache.org>.
Build: https://ci-builds.apache.org/job/Solr/job/Solr-Test-main/13883/

No tests ran.

Build Log:
[...truncated 169 lines...]
BUILD FAILED in 1m 32s
55 actionable tasks: 55 executed

Publishing Build Scan to Develocity...
https://develocity.apache.org/s/w3hun4k4lxymw

Build step 'Invoke Gradle script' changed build result to FAILURE
Build step 'Invoke Gradle script' marked build as failure
Archiving artifacts
Recording test results
ERROR: Step ‘Publish JUnit test result report’ failed: No test report files were found. Configuration error?
Email was triggered for: Failure - Any
Sending email for trigger: Failure - Any

[JENKINS] Solr » Solr-Test-main - Build # 13882 - Still Failing!

Posted by Apache Jenkins Server <je...@builds.apache.org>.
Build: https://ci-builds.apache.org/job/Solr/job/Solr-Test-main/13882/

No tests ran.

Build Log:
[...truncated 170 lines...]
BUILD FAILED in 1m 31s
55 actionable tasks: 55 executed

Publishing Build Scan to Develocity...
https://develocity.apache.org/s/dorg4aetyqwfm

Build step 'Invoke Gradle script' changed build result to FAILURE
Build step 'Invoke Gradle script' marked build as failure
Archiving artifacts
Recording test results
ERROR: Step ‘Publish JUnit test result report’ failed: No test report files were found. Configuration error?
Email was triggered for: Failure - Any
Sending email for trigger: Failure - Any

[JENKINS] Solr » Solr-Test-main - Build # 13881 - Still Failing!

Posted by Apache Jenkins Server <je...@builds.apache.org>.
Build: https://ci-builds.apache.org/job/Solr/job/Solr-Test-main/13881/

No tests ran.

Build Log:
[...truncated 168 lines...]
BUILD FAILED in 1m 23s
55 actionable tasks: 55 executed

Publishing Build Scan to Develocity...
https://develocity.apache.org/s/gddxux6uxgbe4

Build step 'Invoke Gradle script' changed build result to FAILURE
Build step 'Invoke Gradle script' marked build as failure
Archiving artifacts
Recording test results
ERROR: Step ‘Publish JUnit test result report’ failed: No test report files were found. Configuration error?
Email was triggered for: Failure - Any
Sending email for trigger: Failure - Any

[JENKINS] Solr » Solr-Test-main - Build # 13880 - Still Failing!

Posted by Apache Jenkins Server <je...@builds.apache.org>.
Build: https://ci-builds.apache.org/job/Solr/job/Solr-Test-main/13880/

No tests ran.

Build Log:
[...truncated 169 lines...]
BUILD FAILED in 1m 31s
55 actionable tasks: 55 executed

Publishing Build Scan to Develocity...
https://develocity.apache.org/s/sq5n6bgrvkf5w

Build step 'Invoke Gradle script' changed build result to FAILURE
Build step 'Invoke Gradle script' marked build as failure
Archiving artifacts
Recording test results
ERROR: Step ‘Publish JUnit test result report’ failed: No test report files were found. Configuration error?
Email was triggered for: Failure - Any
Sending email for trigger: Failure - Any

[JENKINS] Solr » Solr-Test-main - Build # 13879 - Still Failing!

Posted by Apache Jenkins Server <je...@builds.apache.org>.
Build: https://ci-builds.apache.org/job/Solr/job/Solr-Test-main/13879/

No tests ran.

Build Log:
[...truncated 169 lines...]
BUILD FAILED in 1m 30s
55 actionable tasks: 55 executed

Publishing Build Scan to Develocity...
https://develocity.apache.org/s/v7umr6532wnic

Build step 'Invoke Gradle script' changed build result to FAILURE
Build step 'Invoke Gradle script' marked build as failure
Archiving artifacts
Recording test results
ERROR: Step ‘Publish JUnit test result report’ failed: No test report files were found. Configuration error?
Email was triggered for: Failure - Any
Sending email for trigger: Failure - Any

[JENKINS] Solr » Solr-Test-main - Build # 13878 - Still Failing!

Posted by Apache Jenkins Server <je...@builds.apache.org>.
Build: https://ci-builds.apache.org/job/Solr/job/Solr-Test-main/13878/

No tests ran.

Build Log:
[...truncated 168 lines...]
BUILD FAILED in 1m 32s
55 actionable tasks: 55 executed

Publishing Build Scan to Develocity...
https://develocity.apache.org/s/vgpkugob57nte

Build step 'Invoke Gradle script' changed build result to FAILURE
Build step 'Invoke Gradle script' marked build as failure
Archiving artifacts
Recording test results
ERROR: Step ‘Publish JUnit test result report’ failed: No test report files were found. Configuration error?
Email was triggered for: Failure - Any
Sending email for trigger: Failure - Any