You are viewing a plain text version of this content. The canonical link for it is here.
Posted to builds@lucene.apache.org by Policeman Jenkins Server <je...@thetaphi.de> on 2020/06/04 08:53:56 UTC

[JENKINS] Lucene-Solr-master-MacOSX (64bit/jdk-13.0.2) - Build # 6113 - Still Unstable!

Build: https://jenkins.thetaphi.de/job/Lucene-Solr-master-MacOSX/6113/
Java: 64bit/jdk-13.0.2 -XX:+UseCompressedOops -XX:+UseParallelGC

3 tests failed.
FAILED:  org.apache.solr.cloud.MultiThreadedOCPTest.test

Error Message:
acoll: 1591257158031 bcoll: 1591257158300

Stack Trace:
java.lang.AssertionError: acoll: 1591257158031 bcoll: 1591257158300
	at __randomizedtesting.SeedInfo.seed([42E782E498BF95C6:CAB3BD3E3643F83E]:0)
	at org.junit.Assert.fail(Assert.java:88)
	at org.junit.Assert.assertTrue(Assert.java:41)
	at org.apache.solr.cloud.MultiThreadedOCPTest.testFillWorkQueue(MultiThreadedOCPTest.java:113)
	at org.apache.solr.cloud.MultiThreadedOCPTest.test(MultiThreadedOCPTest.java:68)
	at java.base/jdk.internal.reflect.NativeMethodAccessorImpl.invoke0(Native Method)
	at java.base/jdk.internal.reflect.NativeMethodAccessorImpl.invoke(NativeMethodAccessorImpl.java:62)
	at java.base/jdk.internal.reflect.DelegatingMethodAccessorImpl.invoke(DelegatingMethodAccessorImpl.java:43)
	at java.base/java.lang.reflect.Method.invoke(Method.java:567)
	at com.carrotsearch.randomizedtesting.RandomizedRunner.invoke(RandomizedRunner.java:1754)
	at com.carrotsearch.randomizedtesting.RandomizedRunner$8.evaluate(RandomizedRunner.java:942)
	at com.carrotsearch.randomizedtesting.RandomizedRunner$9.evaluate(RandomizedRunner.java:978)
	at com.carrotsearch.randomizedtesting.RandomizedRunner$10.evaluate(RandomizedRunner.java:992)
	at org.apache.solr.BaseDistributedSearchTestCase$ShardsRepeatRule$ShardsFixedStatement.callStatement(BaseDistributedSearchTestCase.java:1081)
	at org.apache.solr.BaseDistributedSearchTestCase$ShardsRepeatRule$ShardsStatement.evaluate(BaseDistributedSearchTestCase.java:1053)
	at com.carrotsearch.randomizedtesting.rules.SystemPropertiesRestoreRule$1.evaluate(SystemPropertiesRestoreRule.java:57)
	at org.apache.lucene.util.TestRuleSetupTeardownChained$1.evaluate(TestRuleSetupTeardownChained.java:49)
	at org.apache.lucene.util.AbstractBeforeAfterRule$1.evaluate(AbstractBeforeAfterRule.java:45)
	at org.apache.lucene.util.TestRuleThreadAndTestName$1.evaluate(TestRuleThreadAndTestName.java:48)
	at org.apache.lucene.util.TestRuleIgnoreAfterMaxFailures$1.evaluate(TestRuleIgnoreAfterMaxFailures.java:64)
	at org.apache.lucene.util.TestRuleMarkFailure$1.evaluate(TestRuleMarkFailure.java:47)
	at com.carrotsearch.randomizedtesting.rules.StatementAdapter.evaluate(StatementAdapter.java:36)
	at com.carrotsearch.randomizedtesting.ThreadLeakControl$StatementRunner.run(ThreadLeakControl.java:370)
	at com.carrotsearch.randomizedtesting.ThreadLeakControl.forkTimeoutingTask(ThreadLeakControl.java:819)
	at com.carrotsearch.randomizedtesting.ThreadLeakControl$3.evaluate(ThreadLeakControl.java:470)
	at com.carrotsearch.randomizedtesting.RandomizedRunner.runSingleTest(RandomizedRunner.java:951)
	at com.carrotsearch.randomizedtesting.RandomizedRunner$5.evaluate(RandomizedRunner.java:836)
	at com.carrotsearch.randomizedtesting.RandomizedRunner$6.evaluate(RandomizedRunner.java:887)
	at com.carrotsearch.randomizedtesting.RandomizedRunner$7.evaluate(RandomizedRunner.java:898)
	at com.carrotsearch.randomizedtesting.rules.StatementAdapter.evaluate(StatementAdapter.java:36)
	at com.carrotsearch.randomizedtesting.rules.SystemPropertiesRestoreRule$1.evaluate(SystemPropertiesRestoreRule.java:57)
	at org.apache.lucene.util.AbstractBeforeAfterRule$1.evaluate(AbstractBeforeAfterRule.java:45)
	at com.carrotsearch.randomizedtesting.rules.StatementAdapter.evaluate(StatementAdapter.java:36)
	at org.apache.lucene.util.TestRuleStoreClassName$1.evaluate(TestRuleStoreClassName.java:41)
	at com.carrotsearch.randomizedtesting.rules.NoShadowingOrOverridesOnMethodsRule$1.evaluate(NoShadowingOrOverridesOnMethodsRule.java:40)
	at com.carrotsearch.randomizedtesting.rules.NoShadowingOrOverridesOnMethodsRule$1.evaluate(NoShadowingOrOverridesOnMethodsRule.java:40)
	at com.carrotsearch.randomizedtesting.rules.StatementAdapter.evaluate(StatementAdapter.java:36)
	at com.carrotsearch.randomizedtesting.rules.StatementAdapter.evaluate(StatementAdapter.java:36)
	at org.apache.lucene.util.TestRuleAssertionsRequired$1.evaluate(TestRuleAssertionsRequired.java:53)
	at org.apache.lucene.util.TestRuleMarkFailure$1.evaluate(TestRuleMarkFailure.java:47)
	at org.apache.lucene.util.TestRuleIgnoreAfterMaxFailures$1.evaluate(TestRuleIgnoreAfterMaxFailures.java:64)
	at org.apache.lucene.util.TestRuleIgnoreTestSuites$1.evaluate(TestRuleIgnoreTestSuites.java:54)
	at com.carrotsearch.randomizedtesting.rules.StatementAdapter.evaluate(StatementAdapter.java:36)
	at com.carrotsearch.randomizedtesting.ThreadLeakControl$StatementRunner.run(ThreadLeakControl.java:370)
	at com.carrotsearch.randomizedtesting.ThreadLeakControl.lambda$forkTimeoutingTask$0(ThreadLeakControl.java:826)
	at java.base/java.lang.Thread.run(Thread.java:830)


FAILED:  org.apache.solr.cloud.TestCloudSearcherWarming.testPeersyncFailureReplicationSuccess

Error Message:
No registered leader was found after waiting for 4000ms , collection: testPeersyncFailureReplicationSuccess slice: shard1 saw state=DocCollection(testPeersyncFailureReplicationSuccess//collections/testPeersyncFailureReplicationSuccess/state.json/10)={   "pullReplicas":"0",   "replicationFactor":"1",   "shards":{"shard1":{       "range":"80000000-7fffffff",       "state":"active",       "replicas":{         "core_node2":{           "core":"testPeersyncFailureReplicationSuccess_shard1_replica_n1",           "base_url":"http://127.0.0.1:55379/solr",           "node_name":"127.0.0.1:55379_solr",           "state":"down",           "type":"NRT",           "force_set_state":"false"},         "core_node4":{           "core":"testPeersyncFailureReplicationSuccess_shard1_replica_n3",           "base_url":"http://127.0.0.1:55443/solr",           "node_name":"127.0.0.1:55443_solr",           "state":"active",           "type":"NRT",           "force_set_state":"false"}}}},   "router":{"name":"compositeId"},   "maxShardsPerNode":"2",   "autoAddReplicas":"false",   "nrtReplicas":"1",   "tlogReplicas":"0"} with live_nodes=[127.0.0.1:55443_solr]

Stack Trace:
org.apache.solr.common.SolrException: No registered leader was found after waiting for 4000ms , collection: testPeersyncFailureReplicationSuccess slice: shard1 saw state=DocCollection(testPeersyncFailureReplicationSuccess//collections/testPeersyncFailureReplicationSuccess/state.json/10)={
  "pullReplicas":"0",
  "replicationFactor":"1",
  "shards":{"shard1":{
      "range":"80000000-7fffffff",
      "state":"active",
      "replicas":{
        "core_node2":{
          "core":"testPeersyncFailureReplicationSuccess_shard1_replica_n1",
          "base_url":"http://127.0.0.1:55379/solr",
          "node_name":"127.0.0.1:55379_solr",
          "state":"down",
          "type":"NRT",
          "force_set_state":"false"},
        "core_node4":{
          "core":"testPeersyncFailureReplicationSuccess_shard1_replica_n3",
          "base_url":"http://127.0.0.1:55443/solr",
          "node_name":"127.0.0.1:55443_solr",
          "state":"active",
          "type":"NRT",
          "force_set_state":"false"}}}},
  "router":{"name":"compositeId"},
  "maxShardsPerNode":"2",
  "autoAddReplicas":"false",
  "nrtReplicas":"1",
  "tlogReplicas":"0"} with live_nodes=[127.0.0.1:55443_solr]
	at __randomizedtesting.SeedInfo.seed([42E782E498BF95C6:96B6E1AB4901A2A5]:0)
	at org.apache.solr.common.cloud.ZkStateReader.getLeaderRetry(ZkStateReader.java:976)
	at org.apache.solr.common.cloud.ZkStateReader.getLeaderRetry(ZkStateReader.java:953)
	at org.apache.solr.cloud.TestCloudSearcherWarming.testPeersyncFailureReplicationSuccess(TestCloudSearcherWarming.java:205)
	at java.base/jdk.internal.reflect.NativeMethodAccessorImpl.invoke0(Native Method)
	at java.base/jdk.internal.reflect.NativeMethodAccessorImpl.invoke(NativeMethodAccessorImpl.java:62)
	at java.base/jdk.internal.reflect.DelegatingMethodAccessorImpl.invoke(DelegatingMethodAccessorImpl.java:43)
	at java.base/java.lang.reflect.Method.invoke(Method.java:567)
	at com.carrotsearch.randomizedtesting.RandomizedRunner.invoke(RandomizedRunner.java:1754)
	at com.carrotsearch.randomizedtesting.RandomizedRunner$8.evaluate(RandomizedRunner.java:942)
	at com.carrotsearch.randomizedtesting.RandomizedRunner$9.evaluate(RandomizedRunner.java:978)
	at com.carrotsearch.randomizedtesting.RandomizedRunner$10.evaluate(RandomizedRunner.java:992)
	at com.carrotsearch.randomizedtesting.rules.SystemPropertiesRestoreRule$1.evaluate(SystemPropertiesRestoreRule.java:57)
	at org.apache.lucene.util.TestRuleSetupTeardownChained$1.evaluate(TestRuleSetupTeardownChained.java:49)
	at org.apache.lucene.util.AbstractBeforeAfterRule$1.evaluate(AbstractBeforeAfterRule.java:45)
	at org.apache.lucene.util.TestRuleThreadAndTestName$1.evaluate(TestRuleThreadAndTestName.java:48)
	at org.apache.lucene.util.TestRuleIgnoreAfterMaxFailures$1.evaluate(TestRuleIgnoreAfterMaxFailures.java:64)
	at org.apache.lucene.util.TestRuleMarkFailure$1.evaluate(TestRuleMarkFailure.java:47)
	at com.carrotsearch.randomizedtesting.rules.StatementAdapter.evaluate(StatementAdapter.java:36)
	at com.carrotsearch.randomizedtesting.ThreadLeakControl$StatementRunner.run(ThreadLeakControl.java:370)
	at com.carrotsearch.randomizedtesting.ThreadLeakControl.forkTimeoutingTask(ThreadLeakControl.java:819)
	at com.carrotsearch.randomizedtesting.ThreadLeakControl$3.evaluate(ThreadLeakControl.java:470)
	at com.carrotsearch.randomizedtesting.RandomizedRunner.runSingleTest(RandomizedRunner.java:951)
	at com.carrotsearch.randomizedtesting.RandomizedRunner$5.evaluate(RandomizedRunner.java:836)
	at com.carrotsearch.randomizedtesting.RandomizedRunner$6.evaluate(RandomizedRunner.java:887)
	at com.carrotsearch.randomizedtesting.RandomizedRunner$7.evaluate(RandomizedRunner.java:898)
	at com.carrotsearch.randomizedtesting.rules.StatementAdapter.evaluate(StatementAdapter.java:36)
	at com.carrotsearch.randomizedtesting.rules.SystemPropertiesRestoreRule$1.evaluate(SystemPropertiesRestoreRule.java:57)
	at org.apache.lucene.util.AbstractBeforeAfterRule$1.evaluate(AbstractBeforeAfterRule.java:45)
	at com.carrotsearch.randomizedtesting.rules.StatementAdapter.evaluate(StatementAdapter.java:36)
	at org.apache.lucene.util.TestRuleStoreClassName$1.evaluate(TestRuleStoreClassName.java:41)
	at com.carrotsearch.randomizedtesting.rules.NoShadowingOrOverridesOnMethodsRule$1.evaluate(NoShadowingOrOverridesOnMethodsRule.java:40)
	at com.carrotsearch.randomizedtesting.rules.NoShadowingOrOverridesOnMethodsRule$1.evaluate(NoShadowingOrOverridesOnMethodsRule.java:40)
	at com.carrotsearch.randomizedtesting.rules.StatementAdapter.evaluate(StatementAdapter.java:36)
	at com.carrotsearch.randomizedtesting.rules.StatementAdapter.evaluate(StatementAdapter.java:36)
	at org.apache.lucene.util.TestRuleAssertionsRequired$1.evaluate(TestRuleAssertionsRequired.java:53)
	at org.apache.lucene.util.TestRuleMarkFailure$1.evaluate(TestRuleMarkFailure.java:47)
	at org.apache.lucene.util.TestRuleIgnoreAfterMaxFailures$1.evaluate(TestRuleIgnoreAfterMaxFailures.java:64)
	at org.apache.lucene.util.TestRuleIgnoreTestSuites$1.evaluate(TestRuleIgnoreTestSuites.java:54)
	at com.carrotsearch.randomizedtesting.rules.StatementAdapter.evaluate(StatementAdapter.java:36)
	at com.carrotsearch.randomizedtesting.ThreadLeakControl$StatementRunner.run(ThreadLeakControl.java:370)
	at com.carrotsearch.randomizedtesting.ThreadLeakControl.lambda$forkTimeoutingTask$0(ThreadLeakControl.java:826)
	at java.base/java.lang.Thread.run(Thread.java:830)


FAILED:  org.apache.solr.handler.component.CustomHighlightComponentTest.test

Error Message:
Error from server at http://127.0.0.1:56025/solr/collection72: error processing commands

Stack Trace:
org.apache.solr.client.solrj.impl.BaseHttpSolrClient$RemoteExecutionException: Error from server at http://127.0.0.1:56025/solr/collection72: error processing commands
	at __randomizedtesting.SeedInfo.seed([42E782E498BF95C6:CAB3BD3E3643F83E]:0)
	at org.apache.solr.client.solrj.impl.BaseHttpSolrClient$RemoteExecutionException.create(BaseHttpSolrClient.java:66)
	at org.apache.solr.client.solrj.impl.HttpSolrClient.executeMethod(HttpSolrClient.java:640)
	at org.apache.solr.client.solrj.impl.HttpSolrClient.request(HttpSolrClient.java:265)
	at org.apache.solr.client.solrj.impl.HttpSolrClient.request(HttpSolrClient.java:248)
	at org.apache.solr.client.solrj.impl.LBSolrClient.doRequest(LBSolrClient.java:368)
	at org.apache.solr.client.solrj.impl.LBSolrClient.request(LBSolrClient.java:296)
	at org.apache.solr.client.solrj.impl.BaseCloudSolrClient.sendRequest(BaseCloudSolrClient.java:1147)
	at org.apache.solr.client.solrj.impl.BaseCloudSolrClient.requestWithRetryOnStaleState(BaseCloudSolrClient.java:910)
	at org.apache.solr.client.solrj.impl.BaseCloudSolrClient.request(BaseCloudSolrClient.java:842)
	at org.apache.solr.handler.component.CustomHighlightComponentTest.test(CustomHighlightComponentTest.java:157)
	at java.base/jdk.internal.reflect.NativeMethodAccessorImpl.invoke0(Native Method)
	at java.base/jdk.internal.reflect.NativeMethodAccessorImpl.invoke(NativeMethodAccessorImpl.java:62)
	at java.base/jdk.internal.reflect.DelegatingMethodAccessorImpl.invoke(DelegatingMethodAccessorImpl.java:43)
	at java.base/java.lang.reflect.Method.invoke(Method.java:567)
	at com.carrotsearch.randomizedtesting.RandomizedRunner.invoke(RandomizedRunner.java:1754)
	at com.carrotsearch.randomizedtesting.RandomizedRunner$8.evaluate(RandomizedRunner.java:942)
	at com.carrotsearch.randomizedtesting.RandomizedRunner$9.evaluate(RandomizedRunner.java:978)
	at com.carrotsearch.randomizedtesting.RandomizedRunner$10.evaluate(RandomizedRunner.java:992)
	at com.carrotsearch.randomizedtesting.rules.SystemPropertiesRestoreRule$1.evaluate(SystemPropertiesRestoreRule.java:57)
	at org.apache.lucene.util.TestRuleSetupTeardownChained$1.evaluate(TestRuleSetupTeardownChained.java:49)
	at org.apache.lucene.util.AbstractBeforeAfterRule$1.evaluate(AbstractBeforeAfterRule.java:45)
	at org.apache.lucene.util.TestRuleThreadAndTestName$1.evaluate(TestRuleThreadAndTestName.java:48)
	at org.apache.lucene.util.TestRuleIgnoreAfterMaxFailures$1.evaluate(TestRuleIgnoreAfterMaxFailures.java:64)
	at org.apache.lucene.util.TestRuleMarkFailure$1.evaluate(TestRuleMarkFailure.java:47)
	at com.carrotsearch.randomizedtesting.rules.StatementAdapter.evaluate(StatementAdapter.java:36)
	at com.carrotsearch.randomizedtesting.ThreadLeakControl$StatementRunner.run(ThreadLeakControl.java:370)
	at com.carrotsearch.randomizedtesting.ThreadLeakControl.forkTimeoutingTask(ThreadLeakControl.java:819)
	at com.carrotsearch.randomizedtesting.ThreadLeakControl$3.evaluate(ThreadLeakControl.java:470)
	at com.carrotsearch.randomizedtesting.RandomizedRunner.runSingleTest(RandomizedRunner.java:951)
	at com.carrotsearch.randomizedtesting.RandomizedRunner$5.evaluate(RandomizedRunner.java:836)
	at com.carrotsearch.randomizedtesting.RandomizedRunner$6.evaluate(RandomizedRunner.java:887)
	at com.carrotsearch.randomizedtesting.RandomizedRunner$7.evaluate(RandomizedRunner.java:898)
	at com.carrotsearch.randomizedtesting.rules.StatementAdapter.evaluate(StatementAdapter.java:36)
	at com.carrotsearch.randomizedtesting.rules.SystemPropertiesRestoreRule$1.evaluate(SystemPropertiesRestoreRule.java:57)
	at org.apache.lucene.util.AbstractBeforeAfterRule$1.evaluate(AbstractBeforeAfterRule.java:45)
	at com.carrotsearch.randomizedtesting.rules.StatementAdapter.evaluate(StatementAdapter.java:36)
	at org.apache.lucene.util.TestRuleStoreClassName$1.evaluate(TestRuleStoreClassName.java:41)
	at com.carrotsearch.randomizedtesting.rules.NoShadowingOrOverridesOnMethodsRule$1.evaluate(NoShadowingOrOverridesOnMethodsRule.java:40)
	at com.carrotsearch.randomizedtesting.rules.NoShadowingOrOverridesOnMethodsRule$1.evaluate(NoShadowingOrOverridesOnMethodsRule.java:40)
	at com.carrotsearch.randomizedtesting.rules.StatementAdapter.evaluate(StatementAdapter.java:36)
	at com.carrotsearch.randomizedtesting.rules.StatementAdapter.evaluate(StatementAdapter.java:36)
	at org.apache.lucene.util.TestRuleAssertionsRequired$1.evaluate(TestRuleAssertionsRequired.java:53)
	at org.apache.lucene.util.TestRuleMarkFailure$1.evaluate(TestRuleMarkFailure.java:47)
	at org.apache.lucene.util.TestRuleIgnoreAfterMaxFailures$1.evaluate(TestRuleIgnoreAfterMaxFailures.java:64)
	at org.apache.lucene.util.TestRuleIgnoreTestSuites$1.evaluate(TestRuleIgnoreTestSuites.java:54)
	at com.carrotsearch.randomizedtesting.rules.StatementAdapter.evaluate(StatementAdapter.java:36)
	at com.carrotsearch.randomizedtesting.ThreadLeakControl$StatementRunner.run(ThreadLeakControl.java:370)
	at com.carrotsearch.randomizedtesting.ThreadLeakControl.lambda$forkTimeoutingTask$0(ThreadLeakControl.java:826)
	at java.base/java.lang.Thread.run(Thread.java:830)




Build Log:
[...truncated 12800 lines...]
   [junit4] Suite: org.apache.solr.cloud.TestCloudSearcherWarming
   [junit4]   2> 50043 INFO  (SUITE-TestCloudSearcherWarming-seed#[42E782E498BF95C6]-worker) [     ] o.a.s.SolrTestCase Setting 'solr.default.confdir' system property to test-framework derived value of '/Users/jenkins/workspace/Lucene-Solr-master-MacOSX/solr/server/solr/configsets/_default/conf'
   [junit4]   2> 50048 INFO  (SUITE-TestCloudSearcherWarming-seed#[42E782E498BF95C6]-worker) [     ] o.a.s.SolrTestCaseJ4 Created dataDir: /Users/jenkins/workspace/Lucene-Solr-master-MacOSX/solr/build/solr-core/test/J3/temp/solr.cloud.TestCloudSearcherWarming_42E782E498BF95C6-001/data-dir-2-001
   [junit4]   2> 50049 WARN  (SUITE-TestCloudSearcherWarming-seed#[42E782E498BF95C6]-worker) [     ] o.a.s.SolrTestCaseJ4 startTrackingSearchers: numOpens=55 numCloses=55
   [junit4]   2> 50049 INFO  (SUITE-TestCloudSearcherWarming-seed#[42E782E498BF95C6]-worker) [     ] o.a.s.SolrTestCaseJ4 Using TrieFields (NUMERIC_POINTS_SYSPROP=false) w/NUMERIC_DOCVALUES_SYSPROP=false
   [junit4]   2> 50051 INFO  (SUITE-TestCloudSearcherWarming-seed#[42E782E498BF95C6]-worker) [     ] o.a.s.SolrTestCaseJ4 Randomized ssl (false) and clientAuth (false) via: @org.apache.solr.util.RandomizeSSL(reason="", value=0.0/0.0, ssl=0.0/0.0, clientAuth=0.0/0.0) w/ MAC_OS_X supressed clientAuth
   [junit4]   2> 50051 INFO  (SUITE-TestCloudSearcherWarming-seed#[42E782E498BF95C6]-worker) [     ] o.a.s.SolrTestCaseJ4 SecureRandom sanity checks: test.solr.allowed.securerandom=null & java.security.egd=file:/dev/./urandom
   [junit4]   2> 50072 INFO  (TEST-TestCloudSearcherWarming.testPeersyncFailureReplicationSuccess-seed#[42E782E498BF95C6]) [     ] o.a.s.SolrTestCaseJ4 ###Starting testPeersyncFailureReplicationSuccess
   [junit4]   2> 50079 INFO  (TEST-TestCloudSearcherWarming.testPeersyncFailureReplicationSuccess-seed#[42E782E498BF95C6]) [     ] o.a.s.c.MiniSolrCloudCluster Starting cluster of 1 servers in /Users/jenkins/workspace/Lucene-Solr-master-MacOSX/solr/build/solr-core/test/J3/temp/solr.cloud.TestCloudSearcherWarming_42E782E498BF95C6-001/tempDir-001
   [junit4]   2> 50090 INFO  (TEST-TestCloudSearcherWarming.testPeersyncFailureReplicationSuccess-seed#[42E782E498BF95C6]) [     ] o.a.s.c.ZkTestServer STARTING ZK TEST SERVER
   [junit4]   2> 50092 INFO  (ZkTestServer Run Thread) [     ] o.a.s.c.ZkTestServer client port: 0.0.0.0/0.0.0.0:0
   [junit4]   2> 50092 INFO  (ZkTestServer Run Thread) [     ] o.a.s.c.ZkTestServer Starting server
   [junit4]   2> 50207 INFO  (TEST-TestCloudSearcherWarming.testPeersyncFailureReplicationSuccess-seed#[42E782E498BF95C6]) [     ] o.a.s.c.ZkTestServer start zk server on port: 55373
   [junit4]   2> 50209 INFO  (TEST-TestCloudSearcherWarming.testPeersyncFailureReplicationSuccess-seed#[42E782E498BF95C6]) [     ] o.a.s.c.ZkTestServer waitForServerUp: 127.0.0.1:55373
   [junit4]   2> 50214 INFO  (TEST-TestCloudSearcherWarming.testPeersyncFailureReplicationSuccess-seed#[42E782E498BF95C6]) [     ] o.a.s.c.ZkTestServer parse host and port list: 127.0.0.1:55373
   [junit4]   2> 50214 INFO  (TEST-TestCloudSearcherWarming.testPeersyncFailureReplicationSuccess-seed#[42E782E498BF95C6]) [     ] o.a.s.c.ZkTestServer connecting to 127.0.0.1 55373
   [junit4]   2> 50350 INFO  (TEST-TestCloudSearcherWarming.testPeersyncFailureReplicationSuccess-seed#[42E782E498BF95C6]) [     ] o.a.s.c.c.ConnectionManager Waiting for client to connect to ZooKeeper
   [junit4]   2> 50405 INFO  (zkConnectionManagerCallback-26-thread-1) [     ] o.a.s.c.c.ConnectionManager zkClient has connected
   [junit4]   2> 50405 INFO  (TEST-TestCloudSearcherWarming.testPeersyncFailureReplicationSuccess-seed#[42E782E498BF95C6]) [     ] o.a.s.c.c.ConnectionManager Client is connected to ZooKeeper
   [junit4]   2> 50435 INFO  (TEST-TestCloudSearcherWarming.testPeersyncFailureReplicationSuccess-seed#[42E782E498BF95C6]) [     ] o.a.s.c.c.ConnectionManager Waiting for client to connect to ZooKeeper
   [junit4]   2> 50449 INFO  (zkConnectionManagerCallback-28-thread-1) [     ] o.a.s.c.c.ConnectionManager zkClient has connected
   [junit4]   2> 50449 INFO  (TEST-TestCloudSearcherWarming.testPeersyncFailureReplicationSuccess-seed#[42E782E498BF95C6]) [     ] o.a.s.c.c.ConnectionManager Client is connected to ZooKeeper
   [junit4]   2> 50452 INFO  (TEST-TestCloudSearcherWarming.testPeersyncFailureReplicationSuccess-seed#[42E782E498BF95C6]) [     ] o.a.s.c.c.ConnectionManager Waiting for client to connect to ZooKeeper
   [junit4]   2> 50460 INFO  (zkConnectionManagerCallback-30-thread-1) [     ] o.a.s.c.c.ConnectionManager zkClient has connected
   [junit4]   2> 50460 INFO  (TEST-TestCloudSearcherWarming.testPeersyncFailureReplicationSuccess-seed#[42E782E498BF95C6]) [     ] o.a.s.c.c.ConnectionManager Client is connected to ZooKeeper
   [junit4]   2> 50861 INFO  (jetty-launcher-31-thread-1) [     ] o.a.s.c.s.e.JettySolrRunner Start Jetty (configured port=0, binding port=0)
   [junit4]   2> 50861 INFO  (jetty-launcher-31-thread-1) [     ] o.a.s.c.s.e.JettySolrRunner Trying to start Jetty on port 0 try number 2 ...
   [junit4]   2> 50865 INFO  (jetty-launcher-31-thread-1) [     ] o.e.j.s.Server jetty-9.4.27.v20200227; built: 2020-02-27T18:37:21.340Z; git: a304fd9f351f337e7c0e2a7c28878dd536149c6c; jvm 13.0.2+8
   [junit4]   2> 50876 INFO  (jetty-launcher-31-thread-1) [     ] o.e.j.s.session DefaultSessionIdManager workerName=node0
   [junit4]   2> 50876 INFO  (jetty-launcher-31-thread-1) [     ] o.e.j.s.session No SessionScavenger set, using defaults
   [junit4]   2> 50878 INFO  (jetty-launcher-31-thread-1) [     ] o.e.j.s.session node0 Scavenging every 600000ms
   [junit4]   2> 50887 INFO  (jetty-launcher-31-thread-1) [     ] o.e.j.s.h.ContextHandler Started o.e.j.s.ServletContextHandler@79db4a91{/solr,null,AVAILABLE}
   [junit4]   2> 50892 INFO  (jetty-launcher-31-thread-1) [     ] o.e.j.s.AbstractConnector Started ServerConnector@3e7716b6{HTTP/1.1, (http/1.1, h2c)}{127.0.0.1:55379}
   [junit4]   2> 50892 INFO  (jetty-launcher-31-thread-1) [     ] o.e.j.s.Server Started @50962ms
   [junit4]   2> 50892 INFO  (jetty-launcher-31-thread-1) [     ] o.a.s.c.s.e.JettySolrRunner Jetty properties: {hostContext=/solr, hostPort=55379}
   [junit4]   2> 50910 ERROR (jetty-launcher-31-thread-1) [     ] o.a.s.u.StartupLoggingUtils Missing Java Option solr.log.dir. Logging may be missing or incomplete.
   [junit4]   2> 50910 INFO  (jetty-launcher-31-thread-1) [     ] o.a.s.s.SolrDispatchFilter Using logger factory org.apache.logging.slf4j.Log4jLoggerFactory
   [junit4]   2> 50910 INFO  (jetty-launcher-31-thread-1) [     ] o.a.s.s.SolrDispatchFilter  ___      _       Welcome to Apache Solr? version 9.0.0
   [junit4]   2> 50910 INFO  (jetty-launcher-31-thread-1) [     ] o.a.s.s.SolrDispatchFilter / __| ___| |_ _   Starting in cloud mode on port null
   [junit4]   2> 50910 INFO  (jetty-launcher-31-thread-1) [     ] o.a.s.s.SolrDispatchFilter \__ \/ _ \ | '_|  Install dir: /Users/jenkins/workspace/Lucene-Solr-master-MacOSX/solr
   [junit4]   2> 50911 INFO  (jetty-launcher-31-thread-1) [     ] o.a.s.s.SolrDispatchFilter |___/\___/_|_|    Start time: 2020-06-04T07:42:50.120916Z
   [junit4]   2> 50912 INFO  (jetty-launcher-31-thread-1) [     ] o.a.s.c.c.ConnectionManager Waiting for client to connect to ZooKeeper
   [junit4]   2> 50918 INFO  (zkConnectionManagerCallback-33-thread-1) [     ] o.a.s.c.c.ConnectionManager zkClient has connected
   [junit4]   2> 50918 INFO  (jetty-launcher-31-thread-1) [     ] o.a.s.c.c.ConnectionManager Client is connected to ZooKeeper
   [junit4]   2> 50922 INFO  (jetty-launcher-31-thread-1) [     ] o.a.s.s.SolrDispatchFilter solr.xml found in ZooKeeper. Loading...
   [junit4]   2> 51067 INFO  (jetty-launcher-31-thread-1) [     ] o.a.s.h.c.HttpShardHandlerFactory Host whitelist initialized: WhitelistHostChecker [whitelistHosts=null, whitelistHostCheckingEnabled=true]
   [junit4]   2> 51072 WARN  (jetty-launcher-31-thread-1) [     ] o.e.j.u.s.S.config Trusting all certificates configured for Client@d517243[provider=null,keyStore=null,trustStore=null]
   [junit4]   2> 51072 WARN  (jetty-launcher-31-thread-1) [     ] o.e.j.u.s.S.config No Client EndPointIdentificationAlgorithm configured for Client@d517243[provider=null,keyStore=null,trustStore=null]
   [junit4]   2> 51078 WARN  (jetty-launcher-31-thread-1) [     ] o.e.j.u.s.S.config Trusting all certificates configured for Client@46462ae[provider=null,keyStore=null,trustStore=null]
   [junit4]   2> 51078 WARN  (jetty-launcher-31-thread-1) [     ] o.e.j.u.s.S.config No Client EndPointIdentificationAlgorithm configured for Client@46462ae[provider=null,keyStore=null,trustStore=null]
   [junit4]   2> 51079 INFO  (jetty-launcher-31-thread-1) [     ] o.a.s.c.ZkContainer Zookeeper client=127.0.0.1:55373/solr
   [junit4]   2> 51100 INFO  (jetty-launcher-31-thread-1) [n:127.0.0.1:55379_solr     ] o.a.s.c.c.ConnectionManager Waiting for client to connect to ZooKeeper
   [junit4]   2> 51105 INFO  (zkConnectionManagerCallback-44-thread-1) [     ] o.a.s.c.c.ConnectionManager zkClient has connected
   [junit4]   2> 51106 INFO  (jetty-launcher-31-thread-1) [n:127.0.0.1:55379_solr     ] o.a.s.c.c.ConnectionManager Client is connected to ZooKeeper
   [junit4]   2> 52321 INFO  (jetty-launcher-31-thread-1) [n:127.0.0.1:55379_solr     ] o.a.s.c.OverseerElectionContext I am going to be the leader 127.0.0.1:55379_solr
   [junit4]   2> 52344 INFO  (jetty-launcher-31-thread-1) [n:127.0.0.1:55379_solr     ] o.a.s.c.Overseer Overseer (id=72100539289370628-127.0.0.1:55379_solr-n_0000000000) starting
   [junit4]   2> 52644 INFO  (OverseerStateUpdate-72100539289370628-127.0.0.1:55379_solr-n_0000000000) [n:127.0.0.1:55379_solr     ] o.a.s.c.Overseer Starting to work on the main queue : 127.0.0.1:55379_solr
   [junit4]   2> 52660 INFO  (jetty-launcher-31-thread-1) [n:127.0.0.1:55379_solr     ] o.a.s.c.ZkController Register node as live in ZooKeeper:/live_nodes/127.0.0.1:55379_solr
   [junit4]   2> 52698 INFO  (zkCallback-43-thread-1) [     ] o.a.s.c.c.ZkStateReader Updated live nodes from ZooKeeper... (0) -> (1)
   [junit4]   2> 52767 INFO  (jetty-launcher-31-thread-1) [n:127.0.0.1:55379_solr     ] o.a.s.p.PackageLoader /packages.json updated to version -1
   [junit4]   2> 52779 WARN  (jetty-launcher-31-thread-1) [n:127.0.0.1:55379_solr     ] o.a.s.c.CoreContainer Not all security plugins configured!  authentication=disabled authorization=disabled.  Solr is only as secure as you make it. Consider configuring authentication/authorization before exposing Solr to users internal or external.  See https://s.apache.org/solrsecurity for more info
   [junit4]   2> 52856 INFO  (jetty-launcher-31-thread-1) [n:127.0.0.1:55379_solr     ] o.a.s.h.a.MetricsHistoryHandler No .system collection, keeping metrics history in memory.
   [junit4]   2> 52939 INFO  (jetty-launcher-31-thread-1) [n:127.0.0.1:55379_solr     ] o.a.s.m.r.SolrJmxReporter JMX monitoring for 'solr_55379.solr.node' (registry 'solr.node') enabled at server: com.sun.jmx.mbeanserver.JmxMBeanServer@2df0389
   [junit4]   2> 52939 INFO  (jetty-launcher-31-thread-1) [n:127.0.0.1:55379_solr     ] o.a.s.m.r.SolrJmxReporter JMX monitoring for 'solr_55379.solr.jvm' (registry 'solr.jvm') enabled at server: com.sun.jmx.mbeanserver.JmxMBeanServer@2df0389
   [junit4]   2> 52940 INFO  (jetty-launcher-31-thread-1) [n:127.0.0.1:55379_solr     ] o.a.s.m.r.SolrJmxReporter JMX monitoring for 'solr_55379.solr.jetty' (registry 'solr.jetty') enabled at server: com.sun.jmx.mbeanserver.JmxMBeanServer@2df0389
   [junit4]   2> 52956 INFO  (jetty-launcher-31-thread-1) [n:127.0.0.1:55379_solr     ] o.a.s.c.CorePropertiesLocator Found 0 core definitions underneath /Users/jenkins/workspace/Lucene-Solr-master-MacOSX/solr/build/solr-core/test/J3/temp/solr.cloud.TestCloudSearcherWarming_42E782E498BF95C6-001/tempDir-001/node1
   [junit4]   2> 53131 INFO  (TEST-TestCloudSearcherWarming.testPeersyncFailureReplicationSuccess-seed#[42E782E498BF95C6]) [     ] o.a.s.c.MiniSolrCloudCluster waitForAllNodes: numServers=1
   [junit4]   2> 53136 INFO  (TEST-TestCloudSearcherWarming.testPeersyncFailureReplicationSuccess-seed#[42E782E498BF95C6]) [     ] o.a.s.c.c.ConnectionManager Waiting for client to connect to ZooKeeper
   [junit4]   2> 53159 INFO  (zkConnectionManagerCallback-61-thread-1) [     ] o.a.s.c.c.ConnectionManager zkClient has connected
   [junit4]   2> 53159 INFO  (TEST-TestCloudSearcherWarming.testPeersyncFailureReplicationSuccess-seed#[42E782E498BF95C6]) [     ] o.a.s.c.c.ConnectionManager Client is connected to ZooKeeper
   [junit4]   2> 53191 INFO  (TEST-TestCloudSearcherWarming.testPeersyncFailureReplicationSuccess-seed#[42E782E498BF95C6]) [     ] o.a.s.c.c.ZkStateReader Updated live nodes from ZooKeeper... (0) -> (1)
   [junit4]   2> 53222 INFO  (TEST-TestCloudSearcherWarming.testPeersyncFailureReplicationSuccess-seed#[42E782E498BF95C6]) [     ] o.a.s.c.s.i.ZkClientClusterStateProvider Cluster at 127.0.0.1:55373/solr ready
   [junit4]   2> 53909 INFO  (qtp962145276-80) [n:127.0.0.1:55379_solr     ] o.a.s.h.a.CollectionsHandler Invoked Collection Action :create with params pullReplicas=0&maxShardsPerNode=2&name=testPeersyncFailureReplicationSuccess&nrtReplicas=1&action=CREATE&numShards=1&tlogReplicas=0&createNodeSet=127.0.0.1:55379_solr&wt=javabin&version=2 and sendToOCPQueue=true
   [junit4]   2> 53953 INFO  (OverseerThreadFactory-51-thread-1-processing-n:127.0.0.1:55379_solr) [n:127.0.0.1:55379_solr     ] o.a.s.c.a.c.CreateCollectionCmd Create collection testPeersyncFailureReplicationSuccess
   [junit4]   2> 53967 INFO  (OverseerThreadFactory-51-thread-1-processing-n:127.0.0.1:55379_solr) [n:127.0.0.1:55379_solr     ] o.a.s.c.c.ZkConfigManager Copying zk node /configs/_default/managed-schema to /configs/testPeersyncFailureReplicationSuccess.AUTOCREATED/managed-schema
   [junit4]   2> 53998 INFO  (OverseerThreadFactory-51-thread-1-processing-n:127.0.0.1:55379_solr) [n:127.0.0.1:55379_solr     ] o.a.s.c.c.ZkConfigManager Copying zk node /configs/_default/protwords.txt to /configs/testPeersyncFailureReplicationSuccess.AUTOCREATED/protwords.txt
   [junit4]   2> 54014 INFO  (OverseerThreadFactory-51-thread-1-processing-n:127.0.0.1:55379_solr) [n:127.0.0.1:55379_solr     ] o.a.s.c.c.ZkConfigManager Copying zk node /configs/_default/lang/contractions_it.txt to /configs/testPeersyncFailureReplicationSuccess.AUTOCREATED/lang/contractions_it.txt
   [junit4]   2> 54023 INFO  (OverseerThreadFactory-51-thread-1-processing-n:127.0.0.1:55379_solr) [n:127.0.0.1:55379_solr     ] o.a.s.c.c.ZkConfigManager Copying zk node /configs/_default/lang/contractions_ca.txt to /configs/testPeersyncFailureReplicationSuccess.AUTOCREATED/lang/contractions_ca.txt
   [junit4]   2> 54044 INFO  (OverseerThreadFactory-51-thread-1-processing-n:127.0.0.1:55379_solr) [n:127.0.0.1:55379_solr     ] o.a.s.c.c.ZkConfigManager Copying zk node /configs/_default/lang/stemdict_nl.txt to /configs/testPeersyncFailureReplicationSuccess.AUTOCREATED/lang/stemdict_nl.txt
   [junit4]   2> 54095 INFO  (OverseerThreadFactory-51-thread-1-processing-n:127.0.0.1:55379_solr) [n:127.0.0.1:55379_solr     ] o.a.s.c.c.ZkConfigManager Copying zk node /configs/_default/lang/stopwords_no.txt to /configs/testPeersyncFailureReplicationSuccess.AUTOCREATED/lang/stopwords_no.txt
   [junit4]   2> 54167 INFO  (OverseerThreadFactory-51-thread-1-processing-n:127.0.0.1:55379_solr) [n:127.0.0.1:55379_solr     ] o.a.s.c.c.ZkConfigManager Copying zk node /configs/_default/lang/stopwords_hy.txt to /configs/testPeersyncFailureReplicationSuccess.AUTOCREATED/lang/stopwords_hy.txt
   [junit4]   2> 54224 INFO  (OverseerThreadFactory-51-thread-1-processing-n:127.0.0.1:55379_solr) [n:127.0.0.1:55379_solr     ] o.a.s.c.c.ZkConfigManager Copying zk node /configs/_default/lang/stopwords_id.txt to /configs/testPeersyncFailureReplicationSuccess.AUTOCREATED/lang/stopwords_id.txt
   [junit4]   2> 54265 INFO  (OverseerThreadFactory-51-thread-1-processing-n:127.0.0.1:55379_solr) [n:127.0.0.1:55379_solr     ] o.a.s.c.c.ZkConfigManager Copying zk node /configs/_default/lang/stopwords_et.txt to /configs/testPeersyncFailureReplicationSuccess.AUTOCREATED/lang/stopwords_et.txt
   [junit4]   2> 54296 INFO  (OverseerThreadFactory-51-thread-1-processing-n:127.0.0.1:55379_solr) [n:127.0.0.1:55379_solr     ] o.a.s.c.c.ZkConfigManager Copying zk node /configs/_default/lang/stopwords_da.txt to /configs/testPeersyncFailureReplicationSuccess.AUTOCREATED/lang/stopwords_da.txt
   [junit4]   2> 54327 INFO  (OverseerThreadFactory-51-thread-1-processing-n:127.0.0.1:55379_solr) [n:127.0.0.1:55379_solr     ] o.a.s.c.c.ZkConfigManager Copying zk node /configs/_default/lang/stopwords_hi.txt to /configs/testPeersyncFailureReplicationSuccess.AUTOCREATED/lang/stopwords_hi.txt
   [junit4]   2> 54357 INFO  (OverseerThreadFactory-51-thread-1-processing-n:127.0.0.1:55379_solr) [n:127.0.0.1:55379_solr     ] o.a.s.c.c.ZkConfigManager Copying zk node /configs/_default/lang/stopwords_ga.txt to /configs/testPeersyncFailureReplicationSuccess.AUTOCREATED/lang/stopwords_ga.txt
   [junit4]   2> 54378 INFO  (OverseerThreadFactory-51-thread-1-processing-n:127.0.0.1:55379_solr) [n:127.0.0.1:55379_solr     ] o.a.s.c.c.ZkConfigManager Copying zk node /configs/_default/lang/stopwords_pt.txt to /configs/testPeersyncFailureReplicationSuccess.AUTOCREATED/lang/stopwords_pt.txt
   [junit4]   2> 54409 INFO  (OverseerThreadFactory-51-thread-1-processing-n:127.0.0.1:55379_solr) [n:127.0.0.1:55379_solr     ] o.a.s.c.c.ZkConfigManager Copying zk node /configs/_default/lang/stopwords_ja.txt to /configs/testPeersyncFailureReplicationSuccess.AUTOCREATED/lang/stopwords_ja.txt
   [junit4]   2> 54464 INFO  (OverseerThreadFactory-51-thread-1-processing-n:127.0.0.1:55379_solr) [n:127.0.0.1:55379_solr     ] o.a.s.c.c.ZkConfigManager Copying zk node /configs/_default/lang/stopwords_hu.txt to /configs/testPeersyncFailureReplicationSuccess.AUTOCREATED/lang/stopwords_hu.txt
   [junit4]   2> 54528 INFO  (OverseerThreadFactory-51-thread-1-processing-n:127.0.0.1:55379_solr) [n:127.0.0.1:55379_solr     ] o.a.s.c.c.ZkConfigManager Copying zk node /configs/_default/lang/stopwords_el.txt to /configs/testPeersyncFailureReplicationSuccess.AUTOCREATED/lang/stopwords_el.txt
   [junit4]   2> 54580 INFO  (OverseerThreadFactory-51-thread-1-processing-n:127.0.0.1:55379_solr) [n:127.0.0.1:55379_solr     ] o.a.s.c.c.ZkConfigManager Copying zk node /configs/_default/lang/stopwords_ru.txt to /configs/testPeersyncFailureReplicationSuccess.AUTOCREATED/lang/stopwords_ru.txt
   [junit4]   2> 54621 INFO  (OverseerThreadFactory-51-thread-1-processing-n:127.0.0.1:55379_solr) [n:127.0.0.1:55379_solr     ] o.a.s.c.c.ZkConfigManager Copying zk node /configs/_default/lang/stopwords_tr.txt to /configs/testPeersyncFailureReplicationSuccess.AUTOCREATED/lang/stopwords_tr.txt
   [junit4]   2> 54738 INFO  (OverseerThreadFactory-51-thread-1-processing-n:127.0.0.1:55379_solr) [n:127.0.0.1:55379_solr     ] o.a.s.c.c.ZkConfigManager Copying zk node /configs/_default/lang/stopwords_ar.txt to /configs/testPeersyncFailureReplicationSuccess.AUTOCREATED/lang/stopwords_ar.txt
   [junit4]   2> 54831 INFO  (OverseerThreadFactory-51-thread-1-processing-n:127.0.0.1:55379_solr) [n:127.0.0.1:55379_solr     ] o.a.s.c.c.ZkConfigManager Copying zk node /configs/_default/lang/userdict_ja.txt to /configs/testPeersyncFailureReplicationSuccess.AUTOCREATED/lang/userdict_ja.txt
   [junit4]   2> 54919 INFO  (OverseerThreadFactory-51-thread-1-processing-n:127.0.0.1:55379_solr) [n:127.0.0.1:55379_solr     ] o.a.s.c.c.ZkConfigManager Copying zk node /configs/_default/lang/stopwords_eu.txt to /configs/testPeersyncFailureReplicationSuccess.AUTOCREATED/lang/stopwords_eu.txt
   [junit4]   2> 55046 INFO  (OverseerThreadFactory-51-thread-1-processing-n:127.0.0.1:55379_solr) [n:127.0.0.1:55379_solr     ] o.a.s.c.c.ZkConfigManager Copying zk node /configs/_default/lang/stopwords_it.txt to /configs/testPeersyncFailureReplicationSuccess.AUTOCREATED/lang/stopwords_it.txt
   [junit4]   2> 55229 INFO  (OverseerThreadFactory-51-thread-1-processing-n:127.0.0.1:55379_solr) [n:127.0.0.1:55379_solr     ] o.a.s.c.c.ZkConfigManager Copying zk node /configs/_default/lang/stopwords_cz.txt to /configs/testPeersyncFailureReplicationSuccess.AUTOCREATED/lang/stopwords_cz.txt
   [junit4]   2> 55430 INFO  (OverseerThreadFactory-51-thread-1-processing-n:127.0.0.1:55379_solr) [n:127.0.0.1:55379_solr     ] o.a.s.c.c.ZkConfigManager Copying zk node /configs/_default/lang/stoptags_ja.txt to /configs/testPeersyncFailureReplicationSuccess.AUTOCREATED/lang/stoptags_ja.txt
   [junit4]   2> 55556 INFO  (OverseerThreadFactory-51-thread-1-processing-n:127.0.0.1:55379_solr) [n:127.0.0.1:55379_solr     ] o.a.s.c.c.ZkConfigManager Copying zk node /configs/_default/lang/contractions_fr.txt to /configs/testPeersyncFailureReplicationSuccess.AUTOCREATED/lang/contractions_fr.txt
   [junit4]   2> 55676 INFO  (OverseerThreadFactory-51-thread-1-processing-n:127.0.0.1:55379_solr) [n:127.0.0.1:55379_solr     ] o.a.s.c.c.ZkConfigManager Copying zk node /configs/_default/lang/stopwords_de.txt to /configs/testPeersyncFailureReplicationSuccess.AUTOCREATED/lang/stopwords_de.txt
   [junit4]   2> 55813 INFO  (OverseerThreadFactory-51-thread-1-processing-n:127.0.0.1:55379_solr) [n:127.0.0.1:55379_solr     ] o.a.s.c.c.ZkConfigManager Copying zk node /configs/_default/lang/stopwords_fa.txt to /configs/testPeersyncFailureReplicationSuccess.AUTOCREATED/lang/stopwords_fa.txt
   [junit4]   2> 55896 INFO  (OverseerThreadFactory-51-thread-1-processing-n:127.0.0.1:55379_solr) [n:127.0.0.1:55379_solr     ] o.a.s.c.c.ZkConfigManager Copying zk node /configs/_default/lang/contractions_ga.txt to /configs/testPeersyncFailureReplicationSuccess.AUTOCREATED/lang/contractions_ga.txt
   [junit4]   2> 55925 INFO  (OverseerThreadFactory-51-thread-1-processing-n:127.0.0.1:55379_solr) [n:127.0.0.1:55379_solr     ] o.a.s.c.c.ZkConfigManager Copying zk node /configs/_default/lang/stopwords_ca.txt to /configs/testPeersyncFailureReplicationSuccess.AUTOCREATED/lang/stopwords_ca.txt
   [junit4]   2> 55969 INFO  (OverseerThreadFactory-51-thread-1-processing-n:127.0.0.1:55379_solr) [n:127.0.0.1:55379_solr     ] o.a.s.c.c.ZkConfigManager Copying zk node /configs/_default/lang/stopwords_nl.txt to /configs/testPeersyncFailureReplicationSuccess.AUTOCREATED/lang/stopwords_nl.txt
   [junit4]   2> 56068 INFO  (OverseerThreadFactory-51-thread-1-processing-n:127.0.0.1:55379_solr) [n:127.0.0.1:55379_solr     ] o.a.s.c.c.ZkConfigManager Copying zk node /configs/_default/lang/stopwords_bg.txt to /configs/testPeersyncFailureReplicationSuccess.AUTOCREATED/lang/stopwords_bg.txt
   [junit4]   2> 56139 INFO  (OverseerThreadFactory-51-thread-1-processing-n:127.0.0.1:55379_solr) [n:127.0.0.1:55379_solr     ] o.a.s.c.c.ZkConfigManager Copying zk node /configs/_default/lang/stopwords_es.txt to /configs/testPeersyncFailureReplicationSuccess.AUTOCREATED/lang/stopwords_es.txt
   [junit4]   2> 56251 INFO  (OverseerThreadFactory-51-thread-1-processing-n:127.0.0.1:55379_solr) [n:127.0.0.1:55379_solr     ] o.a.s.c.c.ZkConfigManager Copying zk node /configs/_default/lang/stopwords_lv.txt to /configs/testPeersyncFailureReplicationSuccess.AUTOCREATED/lang/stopwords_lv.txt
   [junit4]   2> 56349 INFO  (OverseerThreadFactory-51-thread-1-processing-n:127.0.0.1:55379_solr) [n:127.0.0.1:55379_solr     ] o.a.s.c.c.ZkConfigManager Copying zk node /configs/_default/lang/stopwords_en.txt to /configs/testPeersyncFailureReplicationSuccess.AUTOCREATED/lang/stopwords_en.txt
   [junit4]   2> 56452 INFO  (OverseerThreadFactory-51-thread-1-processing-n:127.0.0.1:55379_solr) [n:127.0.0.1:55379_solr     ] o.a.s.c.c.ZkConfigManager Copying zk node /configs/_default/lang/stopwords_ro.txt to /configs/testPeersyncFailureReplicationSuccess.AUTOCREATED/lang/stopwords_ro.txt
   [junit4]   2> 56515 INFO  (OverseerThreadFactory-51-thread-1-processing-n:127.0.0.1:55379_solr) [n:127.0.0.1:55379_solr     ] o.a.s.c.c.ZkConfigManager Copying zk node /configs/_default/lang/stopwords_th.txt to /configs/testPeersyncFailureReplicationSuccess.AUTOCREATED/lang/stopwords_th.txt
   [junit4]   2> 56574 INFO  (OverseerThreadFactory-51-thread-1-processing-n:127.0.0.1:55379_solr) [n:127.0.0.1:55379_solr     ] o.a.s.c.c.ZkConfigManager Copying zk node /configs/_default/lang/stopwords_fr.txt to /configs/testPeersyncFailureReplicationSuccess.AUTOCREATED/lang/stopwords_fr.txt
   [junit4]   2> 56636 INFO  (OverseerThreadFactory-51-thread-1-processing-n:127.0.0.1:55379_solr) [n:127.0.0.1:55379_solr     ] o.a.s.c.c.ZkConfigManager Copying zk node /configs/_default/lang/stopwords_sv.txt to /configs/testPeersyncFailureReplicationSuccess.AUTOCREATED/lang/stopwords_sv.txt
   [junit4]   2> 56703 INFO  (OverseerThreadFactory-51-thread-1-processing-n:127.0.0.1:55379_solr) [n:127.0.0.1:55379_solr     ] o.a.s.c.c.ZkConfigManager Copying zk node /configs/_default/lang/stopwords_fi.txt to /configs/testPeersyncFailureReplicationSuccess.AUTOCREATED/lang/stopwords_fi.txt
   [junit4]   2> 56781 INFO  (OverseerThreadFactory-51-thread-1-processing-n:127.0.0.1:55379_solr) [n:127.0.0.1:55379_solr     ] o.a.s.c.c.ZkConfigManager Copying zk node /configs/_default/lang/hyphenations_ga.txt to /configs/testPeersyncFailureReplicationSuccess.AUTOCREATED/lang/hyphenations_ga.txt
   [junit4]   2> 56844 INFO  (OverseerThreadFactory-51-thread-1-processing-n:127.0.0.1:55379_solr) [n:127.0.0.1:55379_solr     ] o.a.s.c.c.ZkConfigManager Copying zk node /configs/_default/lang/stopwords_gl.txt to /configs/testPeersyncFailureReplicationSuccess.AUTOCREATED/lang/stopwords_gl.txt
   [junit4]   2> 56952 INFO  (OverseerThreadFactory-51-thread-1-processing-n:127.0.0.1:55379_solr) [n:127.0.0.1:55379_solr     ] o.a.s.c.c.ZkConfigManager Copying zk node /configs/_default/solrconfig.xml to /configs/testPeersyncFailureReplicationSuccess.AUTOCREATED/solrconfig.xml
   [junit4]   2> 56982 INFO  (OverseerThreadFactory-51-thread-1-processing-n:127.0.0.1:55379_solr) [n:127.0.0.1:55379_solr     ] o.a.s.c.c.ZkConfigManager Copying zk node /configs/_default/synonyms.txt to /configs/testPeersyncFailureReplicationSuccess.AUTOCREATED/synonyms.txt
   [junit4]   2> 57054 INFO  (OverseerThreadFactory-51-thread-1-processing-n:127.0.0.1:55379_solr) [n:127.0.0.1:55379_solr     ] o.a.s.c.c.ZkConfigManager Copying zk node /configs/_default/stopwords.txt to /configs/testPeersyncFailureReplicationSuccess.AUTOCREATED/stopwords.txt
   [junit4]   2> 57906 INFO  (qtp962145276-82) [n:127.0.0.1:55379_solr     ] o.a.s.c.TransientSolrCoreCacheDefault Allocating transient cache for 1000 transient cores
   [junit4]   2> 57911 INFO  (qtp962145276-82) [n:127.0.0.1:55379_solr     ] o.a.s.s.HttpSolrCall [admin] webapp=null path=/admin/metrics params={prefix=CONTAINER.fs.usableSpace,CONTAINER.fs.totalSpace,CONTAINER.cores&wt=javabin&version=2&group=solr.node} status=0 QTime=33
   [junit4]   2> 58092 INFO  (qtp962145276-79) [n:127.0.0.1:55379_solr     ] o.a.s.s.HttpSolrCall [admin] webapp=null path=/admin/metrics params={prefix=CONTAINER.fs.usableSpace,CONTAINER.fs.totalSpace,CONTAINER.cores&wt=javabin&version=2&group=solr.node} status=0 QTime=2
   [junit4]   2> 58549 INFO  (OverseerStateUpdate-72100539289370628-127.0.0.1:55379_solr-n_0000000000) [n:127.0.0.1:55379_solr     ] o.a.s.c.o.SliceMutator createReplica() {
   [junit4]   2>   "operation":"ADDREPLICA",
   [junit4]   2>   "collection":"testPeersyncFailureReplicationSuccess",
   [junit4]   2>   "shard":"shard1",
   [junit4]   2>   "core":"testPeersyncFailureReplicationSuccess_shard1_replica_n1",
   [junit4]   2>   "state":"down",
   [junit4]   2>   "base_url":"http://127.0.0.1:55379/solr",
   [junit4]   2>   "node_name":"127.0.0.1:55379_solr",
   [junit4]   2>   "type":"NRT",
   [junit4]   2>   "waitForFinalState":"false"} 
   [junit4]   2> 59241 INFO  (qtp962145276-81) [n:127.0.0.1:55379_solr    x:testPeersyncFailureReplicationSuccess_shard1_replica_n1 ] o.a.s.h.a.CoreAdminOperation core create command qt=/admin/cores&coreNodeName=core_node2&collection.configName=testPeersyncFailureReplicationSuccess.AUTOCREATED&newCollection=true&name=testPeersyncFailureReplicationSuccess_shard1_replica_n1&action=CREATE&numShards=1&collection=testPeersyncFailureReplicationSuccess&shard=shard1&wt=javabin&version=2&replicaType=NRT
   [junit4]   2> 59884 INFO  (qtp962145276-81) [n:127.0.0.1:55379_solr c:testPeersyncFailureReplicationSuccess s:shard1 r:core_node2 x:testPeersyncFailureReplicationSuccess_shard1_replica_n1 ] o.a.s.c.SolrConfig Using Lucene MatchVersion: 9.0.0
   [junit4]   2> 60180 INFO  (qtp962145276-81) [n:127.0.0.1:55379_solr c:testPeersyncFailureReplicationSuccess s:shard1 r:core_node2 x:testPeersyncFailureReplicationSuccess_shard1_replica_n1 ] o.a.s.s.IndexSchema Schema name=default-config
   [junit4]   2> 64703 INFO  (qtp962145276-81) [n:127.0.0.1:55379_solr c:testPeersyncFailureReplicationSuccess s:shard1 r:core_node2 x:testPeersyncFailureReplicationSuccess_shard1_replica_n1 ] o.a.s.s.IndexSchema Loaded schema default-config/1.6 with uniqueid field id
   [junit4]   2> 64703 INFO  (qtp962145276-81) [n:127.0.0.1:55379_solr c:testPeersyncFailureReplicationSuccess s:shard1 r:core_node2 x:testPeersyncFailureReplicationSuccess_shard1_replica_n1 ] o.a.s.c.CoreContainer Creating SolrCore 'testPeersyncFailureReplicationSuccess_shard1_replica_n1' using configuration from configset testPeersyncFailureReplicationSuccess.AUTOCREATED, trusted=true
   [junit4]   2> 64817 INFO  (qtp962145276-81) [n:127.0.0.1:55379_solr c:testPeersyncFailureReplicationSuccess s:shard1 r:core_node2 x:testPeersyncFailureReplicationSuccess_shard1_replica_n1 ] o.a.s.m.r.SolrJmxReporter JMX monitoring for 'solr_55379.solr.core.testPeersyncFailureReplicationSuccess.shard1.replica_n1' (registry 'solr.core.testPeersyncFailureReplicationSuccess.shard1.replica_n1') enabled at server: com.sun.jmx.mbeanserver.JmxMBeanServer@2df0389
   [junit4]   2> 64836 INFO  (qtp962145276-81) [n:127.0.0.1:55379_solr c:testPeersyncFailureReplicationSuccess s:shard1 r:core_node2 x:testPeersyncFailureReplicationSuccess_shard1_replica_n1 ] o.a.s.c.SolrCore [[testPeersyncFailureReplicationSuccess_shard1_replica_n1] ] Opening new SolrCore at [/Users/jenkins/workspace/Lucene-Solr-master-MacOSX/solr/build/solr-core/test/J3/temp/solr.cloud.TestCloudSearcherWarming_42E782E498BF95C6-001/tempDir-001/node1/testPeersyncFailureReplicationSuccess_shard1_replica_n1], dataDir=[/Users/jenkins/workspace/Lucene-Solr-master-MacOSX/solr/build/solr-core/test/J3/temp/solr.cloud.TestCloudSearcherWarming_42E782E498BF95C6-001/tempDir-001/node1/testPeersyncFailureReplicationSuccess_shard1_replica_n1/data/]
   [junit4]   2> 67020 INFO  (qtp962145276-81) [n:127.0.0.1:55379_solr c:testPeersyncFailureReplicationSuccess s:shard1 r:core_node2 x:testPeersyncFailureReplicationSuccess_shard1_replica_n1 ] o.a.s.u.UpdateHandler Using UpdateLog implementation: org.apache.solr.update.UpdateLog
   [junit4]   2> 67020 INFO  (qtp962145276-81) [n:127.0.0.1:55379_solr c:testPeersyncFailureReplicationSuccess s:shard1 r:core_node2 x:testPeersyncFailureReplicationSuccess_shard1_replica_n1 ] o.a.s.u.UpdateLog Initializing UpdateLog: dataDir= defaultSyncLevel=FLUSH numRecordsToKeep=100 maxNumLogsToKeep=10 numVersionBuckets=65536
   [junit4]   2> 67051 INFO  (qtp962145276-81) [n:127.0.0.1:55379_solr c:testPeersyncFailureReplicationSuccess s:shard1 r:core_node2 x:testPeersyncFailureReplicationSuccess_shard1_replica_n1 ] o.a.s.u.CommitTracker Hard AutoCommit: if uncommitted for 15000ms; 
   [junit4]   2> 67051 INFO  (qtp962145276-81) [n:127.0.0.1:55379_solr c:testPeersyncFailureReplicationSuccess s:shard1 r:core_node2 x:testPeersyncFailureReplicationSuccess_shard1_replica_n1 ] o.a.s.u.CommitTracker Soft AutoCommit: disabled
   [junit4]   2> 67105 INFO  (qtp962145276-81) [n:127.0.0.1:55379_solr c:testPeersyncFailureReplicationSuccess s:shard1 r:core_node2 x:testPeersyncFailureReplicationSuccess_shard1_replica_n1 ] o.a.s.r.ManagedResourceStorage Configured ZooKeeperStorageIO with znodeBase: /configs/testPeersyncFailureReplicationSuccess.AUTOCREATED
   [junit4]   2> 67108 INFO  (qtp962145276-81) [n:127.0.0.1:55379_solr c:testPeersyncFailureReplicationSuccess s:shard1 r:core_node2 x:testPeersyncFailureReplicationSuccess_shard1_replica_n1 ] o.a.s.r.ManagedResourceStorage Loaded null at path _rest_managed.json using ZooKeeperStorageIO:path=/configs/testPeersyncFailureReplicationSuccess.AUTOCREATED
   [junit4]   2> 67112 INFO  (qtp962145276-81) [n:127.0.0.1:55379_solr c:testPeersyncFailureReplicationSuccess s:shard1 r:core_node2 x:testPeersyncFailureReplicationSuccess_shard1_replica_n1 ] o.a.s.s.ZkIndexSchemaReader Creating ZooKeeper watch for the managed schema at /configs/testPeersyncFailureReplicationSuccess.AUTOCREATED/managed-schema
   [junit4]   2> 67228 INFO  (qtp962145276-81) [n:127.0.0.1:55379_solr c:testPeersyncFailureReplicationSuccess s:shard1 r:core_node2 x:testPeersyncFailureReplicationSuccess_shard1_replica_n1 ] o.a.s.s.ZkIndexSchemaReader Current schema version 0 is already the latest
   [junit4]   2> 67229 INFO  (qtp962145276-81) [n:127.0.0.1:55379_solr c:testPeersyncFailureReplicationSuccess s:shard1 r:core_node2 x:testPeersyncFailureReplicationSuccess_shard1_replica_n1 ] o.a.s.h.c.SpellCheckComponent Initializing spell checkers
   [junit4]   2> 67263 INFO  (qtp962145276-81) [n:127.0.0.1:55379_solr c:testPeersyncFailureReplicationSuccess s:shard1 r:core_node2 x:testPeersyncFailureReplicationSuccess_shard1_replica_n1 ] o.a.s.s.DirectSolrSpellChecker init: {name=default, field=_text_, classname=solr.DirectSolrSpellChecker, distanceMeasure=internal, accuracy=0.5, maxEdits=2, minPrefix=1, maxInspections=5, minQueryLength=4, maxQueryFrequency=0.01}
   [junit4]   2> 67281 INFO  (qtp962145276-81) [n:127.0.0.1:55379_solr c:testPeersyncFailureReplicationSuccess s:shard1 r:core_node2 x:testPeersyncFailureReplicationSuccess_shard1_replica_n1 ] o.a.s.h.ReplicationHandler Commits will be reserved for 10000 ms
   [junit4]   2> 67298 INFO  (qtp962145276-81) [n:127.0.0.1:55379_solr c:testPeersyncFailureReplicationSuccess s:shard1 r:core_node2 x:testPeersyncFailureReplicationSuccess_shard1_replica_n1 ] o.a.s.u.UpdateLog Could not find max version in index or recent updates, using new clock 1668553466454212608
   [junit4]   2> 67420 INFO  (searcherExecutor-63-thread-1-processing-n:127.0.0.1:55379_solr x:testPeersyncFailureReplicationSuccess_shard1_replica_n1 c:testPeersyncFailureReplicationSuccess s:shard1 r:core_node2) [n:127.0.0.1:55379_solr c:testPeersyncFailureReplicationSuccess s:shard1 r:core_node2 x:testPeersyncFailureReplicationSuccess_shard1_replica_n1 ] o.a.s.c.QuerySenderListener QuerySenderListener done.
   [junit4]   2> 67421 INFO  (searcherExecutor-63-thread-1-processing-n:127.0.0.1:55379_solr x:testPeersyncFailureReplicationSuccess_shard1_replica_n1 c:testPeersyncFailureReplicationSuccess s:shard1 r:core_node2) [n:127.0.0.1:55379_solr c:testPeersyncFailureReplicationSuccess s:shard1 r:core_node2 x:testPeersyncFailureReplicationSuccess_shard1_replica_n1 ] o.a.s.h.c.SpellCheckComponent Loading spell index for spellchecker: default
   [junit4]   2> 67434 INFO  (searcherExecutor-63-thread-1-processing-n:127.0.0.1:55379_solr x:testPeersyncFailureReplicationSuccess_shard1_replica_n1 c:testPeersyncFailureReplicationSuccess s:shard1 r:core_node2) [n:127.0.0.1:55379_solr c:testPeersyncFailureReplicationSuccess s:shard1 r:core_node2 x:testPeersyncFailureReplicationSuccess_shard1_replica_n1 ] o.a.s.c.SolrCore [testPeersyncFailureReplicationSuccess_shard1_replica_n1]  Registered new searcher autowarm time: 0 ms
   [junit4]   2> 67570 INFO  (qtp962145276-81) [n:127.0.0.1:55379_solr c:testPeersyncFailureReplicationSuccess s:shard1 r:core_node2 x:testPeersyncFailureReplicationSuccess_shard1_replica_n1 ] o.a.s.c.ZkShardTerms Successful update of terms at /collections/testPeersyncFailureReplicationSuccess/terms/shard1 to Terms{values={core_node2=0}, version=0}
   [junit4]   2> 67583 INFO  (qtp962145276-81) [n:127.0.0.1:55379_solr c:testPeersyncFailureReplicationSuccess s:shard1 r:core_node2 x:testPeersyncFailureReplicationSuccess_shard1_replica_n1 ] o.a.s.c.ShardLeaderElectionContextBase make sure parent is created /collections/testPeersyncFailureReplicationSuccess/leaders/shard1
   [junit4]   2> 67755 INFO  (qtp962145276-81) [n:127.0.0.1:55379_solr c:testPeersyncFailureReplicationSuccess s:shard1 r:core_node2 x:testPeersyncFailureReplicationSuccess_shard1_replica_n1 ] o.a.s.c.ShardLeaderElectionContext Enough replicas found to continue.
   [junit4]   2> 67756 INFO  (qtp962145276-81) [n:127.0.0.1:55379_solr c:testPeersyncFailureReplicationSuccess s:shard1 r:core_node2 x:testPeersyncFailureReplicationSuccess_shard1_replica_n1 ] o.a.s.c.ShardLeaderElectionContext I may be the new leader - try and sync
   [junit4]   2> 67758 INFO  (qtp962145276-81) [n:127.0.0.1:55379_solr c:testPeersyncFailureReplicationSuccess s:shard1 r:core_node2 x:testPeersyncFailureReplicationSuccess_shard1_replica_n1 ] o.a.s.c.SyncStrategy Sync replicas to http://127.0.0.1:55379/solr/testPeersyncFailureReplicationSuccess_shard1_replica_n1/
   [junit4]   2> 67773 INFO  (qtp962145276-81) [n:127.0.0.1:55379_solr c:testPeersyncFailureReplicationSuccess s:shard1 r:core_node2 x:testPeersyncFailureReplicationSuccess_shard1_replica_n1 ] o.a.s.c.SyncStrategy Sync Success - now sync replicas to me
   [junit4]   2> 67778 INFO  (qtp962145276-81) [n:127.0.0.1:55379_solr c:testPeersyncFailureReplicationSuccess s:shard1 r:core_node2 x:testPeersyncFailureReplicationSuccess_shard1_replica_n1 ] o.a.s.c.SyncStrategy http://127.0.0.1:55379/solr/testPeersyncFailureReplicationSuccess_shard1_replica_n1/ has no replicas
   [junit4]   2> 67784 INFO  (qtp962145276-81) [n:127.0.0.1:55379_solr c:testPeersyncFailureReplicationSuccess s:shard1 r:core_node2 x:testPeersyncFailureReplicationSuccess_shard1_replica_n1 ] o.a.s.c.ShardLeaderElectionContextBase Creating leader registration node /collections/testPeersyncFailureReplicationSuccess/leaders/shard1/leader after winning as /collections/testPeersyncFailureReplicationSuccess/leader_elect/shard1/election/72100539289370628-core_node2-n_0000000000
   [junit4]   2> 67843 INFO  (qtp962145276-81) [n:127.0.0.1:55379_solr c:testPeersyncFailureReplicationSuccess s:shard1 r:core_node2 x:testPeersyncFailureReplicationSuccess_shard1_replica_n1 ] o.a.s.c.ShardLeaderElectionContext I am the new leader: http://127.0.0.1:55379/solr/testPeersyncFailureReplicationSuccess_shard1_replica_n1/ shard1
   [junit4]   2> 67861 INFO  (zkCallback-43-thread-1) [     ] o.a.s.c.c.ZkStateReader A cluster state change: [WatchedEvent state:SyncConnected type:NodeDataChanged path:/collections/testPeersyncFailureReplicationSuccess/state.json] for collection [testPeersyncFailureReplicationSuccess] has occurred - updating... (live nodes size: [1])
   [junit4]   2> 67862 INFO  (zkCallback-43-thread-2) [     ] o.a.s.c.c.ZkStateReader A cluster state change: [WatchedEvent state:SyncConnected type:NodeDataChanged path:/collections/testPeersyncFailureReplicationSuccess/state.json] for collection [testPeersyncFailureReplicationSuccess] has occurred - updating... (live nodes size: [1])
   [junit4]   2> 67887 INFO  (qtp962145276-81) [n:127.0.0.1:55379_solr c:testPeersyncFailureReplicationSuccess s:shard1 r:core_node2 x:testPeersyncFailureReplicationSuccess_shard1_replica_n1 ] o.a.s.c.ZkController I am the leader, no recovery necessary
   [junit4]   2> 67932 INFO  (qtp962145276-81) [n:127.0.0.1:55379_solr     ] o.a.s.s.HttpSolrCall [admin] webapp=null path=/admin/cores params={qt=/admin/cores&coreNodeName=core_node2&collection.configName=testPeersyncFailureReplicationSuccess.AUTOCREATED&newCollection=true&name=testPeersyncFailureReplicationSuccess_shard1_replica_n1&action=CREATE&numShards=1&collection=testPeersyncFailureReplicationSuccess&shard=shard1&wt=javabin&version=2&replicaType=NRT} status=0 QTime=8693
   [junit4]   2> 67979 INFO  (qtp962145276-80) [n:127.0.0.1:55379_solr     ] o.a.s.h.a.CollectionsHandler Wait for new collection to be active for at most 45 seconds. Check all shard replicas
   [junit4]   2> 68090 INFO  (zkCallback-43-thread-1) [     ] o.a.s.c.c.ZkStateReader A cluster state change: [WatchedEvent state:SyncConnected type:NodeDataChanged path:/collections/testPeersyncFailureReplicationSuccess/state.json] for collection [testPeersyncFailureReplicationSuccess] has occurred - updating... (live nodes size: [1])
   [junit4]   2> 68090 INFO  (zkCallback-43-thread-3) [     ] o.a.s.c.c.ZkStateReader A cluster state change: [WatchedEvent state:SyncConnected type:NodeDataChanged path:/collections/testPeersyncFailureReplicationSuccess/state.json] for collection [testPeersyncFailureReplicationSuccess] has occurred - updating... (live nodes size: [1])
   [junit4]   2> 68090 INFO  (zkCallback-43-thread-2) [     ] o.a.s.c.c.ZkStateReader A cluster state change: [WatchedEvent state:SyncConnected type:NodeDataChanged path:/collections/testPeersyncFailureReplicationSuccess/state.json] for collection [testPeersyncFailureReplicationSuccess] has occurred - updating... (live nodes size: [1])
   [junit4]   2> 68113 INFO  (qtp962145276-80) [n:127.0.0.1:55379_solr     ] o.a.s.s.HttpSolrCall [admin] webapp=null path=/admin/collections params={pullReplicas=0&maxShardsPerNode=2&name=testPeersyncFailureReplicationSuccess&nrtReplicas=1&action=CREATE&numShards=1&tlogReplicas=0&createNodeSet=127.0.0.1:55379_solr&wt=javabin&version=2} status=0 QTime=14209
   [junit4]   2> 68122 INFO  (TEST-TestCloudSearcherWarming.testPeersyncFailureReplicationSuccess-seed#[42E782E498BF95C6]) [     ] o.a.s.c.SolrCloudTestCase waitForState (testPeersyncFailureReplicationSuccess): The collection should have 1 shard and 1 replica
   [junit4]   2> 68155 INFO  (TEST-TestCloudSearcherWarming.testPeersyncFailureReplicationSuccess-seed#[42E782E498BF95C6]) [     ] o.a.s.c.SolrCloudTestCase active replica count: 1 expected replica count: 1
   [junit4]   2> 68155 INFO  (watches-58-thread-1) [     ] o.a.s.c.SolrCloudTestCase active replica count: 1 expected replica count: 1
   [junit4]   2> 68161 INFO  (TEST-TestCloudSearcherWarming.testPeersyncFailureReplicationSuccess-seed#[42E782E498BF95C6]) [     ] o.a.s.c.SolrCloudTestCase active replica count: 1 expected replica count: 1
   [junit4]   2> 68167 INFO  (TEST-TestCloudSearcherWarming.testPeersyncFailureReplicationSuccess-seed#[42E782E498BF95C6]) [     ] o.a.s.c.SolrCloudTestCase active replica count: 1 expected replica count: 1
   [junit4]   2> 68225 INFO  (qtp962145276-82) [n:127.0.0.1:55379_solr c:testPeersyncFailureReplicationSuccess s:shard1 r:core_node2 x:testPeersyncFailureReplicationSuccess_shard1_replica_n1 ] o.a.s.h.SolrConfigHandler Waiting up to 30 secs for 1 replicas to set the property overlay to be of version 0 for collection testPeersyncFailureReplicationSuccess
   [junit4]   2> 68225 INFO  (Thread-12) [     ] o.a.s.c.SolrCore config update listener called for core testPeersyncFailureReplicationSuccess_shard1_replica_n1
   [junit4]   2> 68231 INFO  (solrHandlerExecutor-68-thread-1-processing-n:127.0.0.1:55379_solr x:testPeersyncFailureReplicationSuccess_shard1_replica_n1 c:testPeersyncFailureReplicationSuccess s:shard1 r:core_node2) [n:127.0.0.1:55379_solr c:testPeersyncFailureReplicationSuccess s:shard1 r:core_node2 x:testPeersyncFailureReplicationSuccess_shard1_replica_n1 ] o.a.s.h.SolrConfigHandler Time elapsed : 0 secs, maxWait 30
   [junit4]   2> 68259 INFO  (Thread-12) [n:127.0.0.1:55379_solr     ] o.a.s.c.SolrCore core reload testPeersyncFailureReplicationSuccess_shard1_replica_n1
   [junit4]   2> 68395 INFO  (qtp962145276-81) [n:127.0.0.1:55379_solr c:testPeersyncFailureReplicationSuccess s:shard1 r:core_node2 x:testPeersyncFailureReplicationSuccess_shard1_replica_n1 ] o.a.s.h.SolrConfigHandler expecting overlay version 0 but my version is -1
   [junit4]   2> 68397 INFO  (SolrConfigHandler-refreshconf) [     ] o.a.s.h.SolrConfigHandler Another reload is in progress . Not doing anything
   [junit4]   2> 68399 INFO  (qtp962145276-81) [n:127.0.0.1:55379_solr c:testPeersyncFailureReplicationSuccess s:shard1 r:core_node2 x:testPeersyncFailureReplicationSuccess_shard1_replica_n1 ] o.a.s.c.S.Request [testPeersyncFailureReplicationSuccess_shard1_replica_n1]  webapp=/solr path=/config/znodeVersion params={overlay=0&wt=javabin&version=2} status=0 QTime=4
   [junit4]   2> 68402 INFO  (solrHandlerExecutor-68-thread-1-processing-n:127.0.0.1:55379_solr x:testPeersyncFailureReplicationSuccess_shard1_replica_n1 c:testPeersyncFailureReplicationSuccess s:shard1 r:core_node2) [n:127.0.0.1:55379_solr c:testPeersyncFailureReplicationSuccess s:shard1 r:core_node2 x:testPeersyncFailureReplicationSuccess_shard1_replica_n1 ] o.a.s.h.SolrConfigHandler Could not get expectedVersion 0 from http://127.0.0.1:55379/solr/testPeersyncFailureReplicationSuccess_shard1_replica_n1/ for prop overlay   after 1 attempts
   [junit4]   2> 68402 INFO  (solrHandlerExecutor-68-thread-1-processing-n:127.0.0.1:55379_solr x:testPeersyncFailureReplicationSuccess_shard1_replica_n1 c:testPeersyncFailureReplicationSuccess s:shard1 r:core_node2) [n:127.0.0.1:55379_solr c:testPeersyncFailureReplicationSuccess s:shard1 r:core_node2 x:testPeersyncFailureReplicationSuccess_shard1_replica_n1 ] o.a.s.h.SolrConfigHandler Time elapsed : 0 secs, maxWait 30
   [junit4]   2> 68427 INFO  (Thread-12) [n:127.0.0.1:55379_solr     ] o.a.s.c.SolrConfig Using Lucene MatchVersion: 9.0.0
   [junit4]   2> 68489 INFO  (Thread-12) [n:127.0.0.1:55379_solr     ] o.a.s.s.IndexSchema Schema name=default-config
   [junit4]   2> 68530 INFO  (qtp962145276-80) [n:127.0.0.1:55379_solr c:testPeersyncFailureReplicationSuccess s:shard1 r:core_node2 x:testPeersyncFailureReplicationSuccess_shard1_replica_n1 ] o.a.s.h.SolrConfigHandler expecting overlay version 0 but my version is -1
   [junit4]   2> 68530 INFO  (qtp962145276-80) [n:127.0.0.1:55379_solr c:testPeersyncFailureReplicationSuccess s:shard1 r:core_node2 x:testPeersyncFailureReplicationSuccess_shard1_replica_n1 ] o.a.s.c.S.Request [testPeersyncFailureReplicationSuccess_shard1_replica_n1]  webapp=/solr path=/config/znodeVersion params={overlay=0&wt=javabin&version=2} status=0 QTime=1
   [junit4]   2> 68531 INFO  (SolrConfigHandler-refreshconf) [     ] o.a.s.h.SolrConfigHandler Another reload is in progress . Not doing anything
   [junit4]   2> 68532 INFO  (solrHandlerExecutor-68-thread-1-processing-n:127.0.0.1:55379_solr x:testPeersyncFailureReplicationSuccess_shard1_replica_n1 c:testPeersyncFailureReplicationSuccess s:shard1 r:core_node2) [n:127.0.0.1:55379_solr c:testPeersyncFailureReplicationSuccess s:shard1 r:core_node2 x:testPeersyncFailureReplicationSuccess_shard1_replica_n1 ] o.a.s.h.SolrConfigHandler Could not get expectedVersion 0 from http://127.0.0.1:55379/solr/testPeersyncFailureReplicationSuccess_shard1_replica_n1/ for prop overlay   after 2 attempts
   [junit4]   2> 68532 INFO  (solrHandlerExecutor-68-thread-1-processing-n:127.0.0.1:55379_solr x:testPeersyncFailureReplicationSuccess_shard1_replica_n1 c:testPeersyncFailureReplicationSuccess s:shard1 r:core_node2) [n:127.0.0.1:55379_solr c:testPeersyncFailureReplicationSuccess s:shard1 r:core_node2 x:testPeersyncFailureReplicationSuccess_shard1_replica_n1 ] o.a.s.h.SolrConfigHandler Time elapsed : 0 secs, maxWait 30
   [junit4]   2> 68666 INFO  (qtp962145276-79) [n:127.0.0.1:55379_solr c:testPeersyncFailureReplicationSuccess s:shard1 r:core_node2 x:testPeersyncFailureReplicationSuccess_shard1_replica_n1 ] o.a.s.h.SolrConfigHandler expecting overlay version 0 but my version is -1
   [junit4]   2> 68668 INFO  (qtp962145276-79) [n:127.0.0.1:55379_solr c:testPeersyncFailureReplicationSuccess s:shard1 r:core_node2 x:testPeersyncFailureReplicationSuccess_shard1_replica_n1 ] o.a.s.c.S.Request [testPeersyncFailureReplicationSuccess_shard1_replica_n1]  webapp=/solr path=/config/znodeVersion params={overlay=0&wt=javabin&version=2} status=0 QTime=2
   [junit4]   2> 68668 INFO  (SolrConfigHandler-refreshconf) [     ] o.a.s.h.SolrConfigHandler Another reload is in progress . Not doing anything
   [junit4]   2> 68671 INFO  (solrHandlerExecutor-68-thread-1-processing-n:127.0.0.1:55379_solr x:testPeersyncFailureReplicationSuccess_shard1_replica_n1 c:testPeersyncFailureReplicationSuccess s:shard1 r:core_node2) [n:127.0.0.1:55379_solr c:testPeersyncFailureReplicationSuccess s:shard1 r:core_node2 x:testPeersyncFailureReplicationSuccess_shard1_replica_n1 ] o.a.s.h.SolrConfigHandler Could not get expectedVersion 0 from http://127.0.0.1:55379/solr/testPeersyncFailureReplicationSuccess_shard1_replica_n1/ for prop overlay   after 3 attempts
   [junit4]   2> 68671 INFO  (solrHandlerExecutor-68-thread-1-processing-n:127.0.0.1:55379_solr x:testPeersyncFailureReplicationSuccess_shard1_replica_n1 c:testPeersyncFailureReplicationSuccess s:shard1 r:core_node2) [n:127.0.0.1:55379_solr c:testPeersyncFailureReplicationSuccess s:shard1 r:core_node2 x:testPeersyncFailureReplicationSuccess_shard1_replica_n1 ] o.a.s.h.SolrConfigHandler Time elapsed : 0 secs, maxWait 30
   [junit4]   2> 68780 INFO  (qtp962145276-81) [n:127.0.0.1:55379_solr c:testPeersyncFailureReplicationSuccess s:shard1 r:core_node2 x:testPeersyncFailureReplicationSuccess_shard1_replica_n1 ] o.a.s.h.SolrConfigHandler expecting overlay version 0 but my version is -1
   [junit4]   2> 68780 INFO  (SolrConfigHandler-refreshconf) [     ] o.a.s.h.SolrConfigHandler Another reload is in progress . Not doing anything
   [junit4]   2> 68780 INFO  (qtp962145276-81) [n:127.0.0.1:55379_solr c:testPeersyncFailureReplicationSuccess s:shard1 r:core_node2 x:testPeersyncFailureReplicationSuccess_shard1_replica_n1 ] o.a.s.c.S.Request [testPeersyncFailureReplicationSuccess_shard1_replica_n1]  webapp=/solr path=/config/znodeVersion params={overlay=0&wt=javabin&version=2} status=0 QTime=1
   [junit4]   2> 68784 INFO  (solrHandlerExecutor-68-thread-1-processing-n:127.0.0.1:55379_solr x:testPeersyncFailureReplicationSuccess_shard1_replica_n1 c:testPeersyncFailureReplicationSuccess s:shard1 r:core_node2) [n:127.0.0.1:55379_solr c:testPeersyncFailureReplicationSuccess s:shard1 r:core_node2 x:testPeersyncFailureReplicationSuccess_shard1_replica_n1 ] o.a.s.h.SolrConfigHandler Could not get expectedVersion 0 from http://127.0.0.1:55379/solr/testPeersyncFailureReplicationSuccess_shard1_replica_n1/ for prop overlay   after 4 attempts
   [junit4]   2> 68784 INFO  (solrHandlerExecutor-68-thread-1-processing-n:127.0.0.1:55379_solr x:testPeersyncFailureReplicationSuccess_shard1_replica_n1 c:testPeersyncFailureReplicationSuccess s:shard1 r:core_node2) [n:127.0.0.1:55379_solr c:testPeersyncFailureReplicationSuccess s:shard1 r:core_node2 x:testPeersyncFailureReplicationSuccess_shard1_replica_n1 ] o.a.s.h.SolrConfigHandler Time elapsed : 0 secs, maxWait 30
   [junit4]   2> 68888 INFO  (qtp962145276-80) [n:127.0.0.1:55379_solr c:testPeersyncFailureReplicationSuccess s:shard1 r:core_node2 x:testPeersyncFailureReplicationSuccess_shard1_replica_n1 ] o.a.s.h.SolrConfigHandler expecting overlay version 0 but my version is -1
   [junit4]   2> 68889 INFO  (qtp962145276-80) [n:127.0.0.1:55379_solr c:testPeersyncFailureReplicationSuccess s:shard1 r:core_node2 x:testPeersyncFailureReplicationSuccess_shard1_replica_n1 ] o.a.s.c.S.Request [testPeersyncFailureReplicationSuccess_shard1_replica_n1]  webapp=/solr path=/config/znodeVersion params={overlay=0&wt=javabin&version=2} status=0 QTime=1
   [junit4]   2> 68889 INFO  (SolrConfigHandler-refreshconf) [     ] o.a.s.h.SolrConfigHandler Another reload is in progress . Not doing anything
   [junit4]   2> 68890 INFO  (solrHandlerExecutor-68-thread-1-processing-n:127.0.0.1:55379_solr x:testPeersyncFailureReplicationSuccess_shard1_replica_n1 c:testPeersyncFailureReplicationSuccess s:shard1 r:core_node2) [n:127.0.0.1:55379_solr c:testPeersyncFailureReplicationSuccess s:shard1 r:core_node2 x:testPeersyncFailureReplicationSuccess_shard1_replica_n1 ] o.a.s.h.SolrConfigHandler Could not get expectedVersion 0 from http://127.0.0.1:55379/solr/testPeersyncFailureReplicationSuccess_shard1_replica_n1/ for prop overlay   after 5 attempts
   [junit4]   2> 68890 INFO  (solrHandlerExecutor-68-thread-1-processing-n:127.0.0.1:55379_solr x:testPeersyncFailureReplicationSuccess_shard1_replica_n1 c:testPeersyncFailureReplicationSuccess s:shard1 r:core_node2) [n:127.0.0.1:55379_solr c:testPeersyncFailureReplicationSuccess s:shard1 r:core_node2 x:testPeersyncFailureReplicationSuccess_shard1_replica_n1 ] o.a.s.h.SolrConfigHandler Time elapsed : 0 secs, maxWait 30
   [junit4]   2> 68973 INFO  (OverseerCollectionConfigSetProcessor-72100539289370628-127.0.0.1:55379_solr-n_0000000000) [n:127.0.0.1:55379_solr     ] o.a.s.c.OverseerTaskQueue Response ZK path: /overseer/collection-queue-work/qnr-0000000000 doesn't exist. Requestor may have disconnected from ZooKeeper
   [junit4]   2> 68994 INFO  (qtp962145276-79) [n:127.0.0.1:55379_solr c:testPeersyncFailureReplicationSuccess s:shard1 r:core_node2 x:testPeersyncFailureReplicationSuccess_shard1_replica_n1 ] o.a.s.h.SolrConfigHandler expecting overlay version 0 but my version is -1
   [junit4]   2> 68995 INFO  (qtp962145276-79) [n:127.0.0.1:55379_solr c:testPeersyncFailureReplicationSuccess s:shard1 r:core_node2 x:testPeersyncFailureReplicationSuccess_shard1_replica_n1 ] o.a.s.c.S.Request [testPeersyncFailureReplicationSuccess_shard1_replica_n1]  webapp=/solr path=/config/znodeVersion params={overlay=0&wt=javabin&version=2} status=0 QTime=0
   [junit4]   2> 68995 INFO  (SolrConfigHandler-refreshconf) [     ] o.a.s.h.SolrConfigHandler Another reload is in progress . Not doing anything
   [junit4]   2> 68996 INFO  (solrHandlerExecutor-68-thread-1-processing-n:127.0.0.1:55379_solr x:testPeersyncFailureReplicationSuccess_shard1_replica_n1 c:testPeersyncFailureReplicationSuccess s:shard1 r:core_node2) [n:127.0.0.1:55379_solr c:testPeersyncFailureReplicationSuccess s:shard1 r:core_node2 x:testPeersyncFailureReplicationSuccess_shard1_replica_n1 ] o.a.s.h.SolrConfigHandler Could not get expectedVersion 0 from http://127.0.0.1:55379/solr/testPeersyncFailureReplicationSuccess_shard1_replica_n1/ for prop overlay   after 6 attempts
   [junit4]   2> 68996 INFO  (solrHandlerExecutor-68-thread-1-processing-n:127.0.0.1:55379_solr x:testPeersyncFailureReplicationSuccess_shard1_replica_n1 c:testPeersyncFailureReplicationSuccess s:shard1 r:core_node2) [n:127.0.0.1:55379_solr c:testPeersyncFailureReplicationSuccess s:shard1 r:core_node2 x:testPeersyncFailureReplicationSuccess_shard1_replica_n1 ] o.a.s.h.SolrConfigHandler Time elapsed : 0 secs, maxWait 30
   [junit4]   2> 69122 INFO  (qtp962145276-81) [n:127.0.0.1:55379_solr c:testPeersyncFailureReplicationSuccess s:shard1 r:core_node2 x:testPeersyncFailureReplicationSuccess_shard1_replica_n1 ] o.a.s.h.SolrConfigHandler expecting overlay version 0 but my version is -1
   [junit4]   2> 69122 INFO  (qtp962145276-81) [n:127.0.0.1:55379_solr c:testPeersyncFailureReplicationSuccess s:shard1 r:core_node2 x:testPeersyncFailureReplicationSuccess_shard1_replica_n1 ] o.a.s.c.S.Request [testPeersyncFailureReplicationSuccess_shard1_replica_n1]  webapp=/solr path=/config/znodeVersion params={overlay=0&wt=javabin&version=2} status=0 QTime=0
   [junit4]   2> 69122 INFO  (SolrConfigHandler-refreshconf) [     ] o.a.s.h.SolrConfigHandler Another reload is in progress . Not doing anything
   [junit4]   2> 69124 INFO  (solrHandlerExecutor-68-thread-1-processing-n:127.0.0.1:55379_solr x:testPeersyncFailureReplicationSuccess_shard1_replica_n1 c:testPeersyncFailureReplicationSuccess s:shard1 r:core_node2) [n:127.0.0.1:55379_solr c:testPeersyncFailureReplicationSuccess s:shard1 r:core_node2 x:testPeersyncFailureReplicationSuccess_shard1_replica_n1 ] o.a.s.h.SolrConfigHandler Could not get expectedVersion 0 from http://127.0.0.1:55379/solr/testPeersyncFailureReplicationSuccess_shard1_replica_n1/ for prop overlay   after 7 attempts
   [junit4]   2> 69124 INFO  (solrHandlerExecutor-68-thread-1-processing-n:127.0.0.1:55379_solr x:testPeersyncFailureReplicationSuccess_shard1_replica_n1 c:testPeersyncFailureReplicationSuccess s:shard1 r:core_node2) [n:127.0.0.1:55379_solr c:testPeersyncFailureReplicationSuccess s:shard1 r:core_node2 x:testPeersyncFailureReplicationSuccess_shard1_replica_n1 ] o.a.s.h.SolrConfigHandler Time elapsed : 0 secs, maxWait 30
   [junit4]   2> 69229 INFO  (qtp962145276-80) [n:127.0.0.1:55379_solr c:testPeersyncFailureReplicationSuccess s:shard1 r:core_node2 x:testPeersyncFailureReplicationSuccess_shard1_replica_n1 ] o.a.s.h.SolrConfigHandler expecting overlay version 0 but my version is -1
   [junit4]   2> 69230 INFO  (qtp962145276-80) [n:127.0.0.1:55379_solr c:testPeersyncFailureReplicationSuccess s:shard1 r:core_node2 x:testPeersyncFailureReplicationSuccess_shard1_replica_n1 ] o.a.s.c.S.Request [testPeersyncFailureReplicationSuccess_shard1_replica_n1]  webapp=/solr path=/config/znodeVersion params={overlay=0&wt=javabin&version=2} status=0 QTime=0
   [junit4]   2> 69230 INFO  (SolrConfigHandler-refreshconf) [     ] o.a.s.h.SolrConfigHandler Another reload is in progress . Not doing anything
   [junit4]   2> 69235 INFO  (solrHandlerExecutor-68-thread-1-processing-n:127.0.0.1:55379_solr x:testPeersyncFailureReplicationSuccess_shard1_replica_n1 c:testPeersyncFailureReplicationSuccess s:shard1 r:core_node2) [n:127.0.0.1:55379_solr c:testPeersyncFailureReplicationSuccess s:shard1 r:core_node2 x:testPeersyncFailureReplicationSuccess_shard1_replica_n1 ] o.a.s.h.SolrConfigHandler Could not get expectedVersion 0 from http://127.0.0.1:55379/solr/testPeersyncFailureReplicationSuccess_shard1_replica_n1/ for prop overlay   after 8 attempts
   [junit4]   2> 69235 INFO  (solrHandlerExecutor-68-thread-1-processing-n:127.0.0.1:55379_solr x:testPeersyncFailureReplicationSuccess_shard1_replica_n1 c:testPeersyncFailureReplicationSuccess s:shard1 r:core_node2) [n:127.0.0.1:55379_solr c:testPeersyncFailureReplicationSuccess s:shard1 r:core_node2 x:testPeersyncFailureReplicationSuccess_shard1_replica_n1 ] o.a.s.h.SolrConfigHandler Time elapsed : 1 secs, maxWait 30
   [junit4]   2> 69353 INFO  (qtp962145276-79) [n:127.0.0.1:55379_solr c:testPeersyncFailureReplicationSuccess s:shard1 r:core_node2 x:testPeersyncFailureReplicationSuccess_shard1_replica_n1 ] o.a.s.h.SolrConfigHandler expecting overlay version 0 but my version is -1
   [junit4]   2> 69353 INFO  (qtp962145276-79) [n:127.0.0.1:55379_solr c:testPeersyncFailureReplicationSuccess s:shard1 r:core_node2 x:testPeersyncFailureReplicationSuccess_shard1_replica_n1 ] o.a.s.c.S.Request [testPeersyncFailureReplicationSuccess_shard1_replica_n1]  webapp=/solr path=/config/znodeVersion params={overlay=0&wt=javabin&version=2} status=0 QTime=4
   [junit4]   2> 69354 INFO  (SolrConfigHandler-refreshconf) [     ] o.a.s.h.SolrConfigHandler Another reload is in progress . Not doing anything
   [junit4]   2> 69363 INFO  (solrHandlerExecutor-68-thread-1-processing-n:127.0.0.1:55379_solr x:testPeersyncFailureReplicationSuccess_shard1_replica_n1 c:testPeersyncFailureReplicationSuccess s:shard1 r:core_node2) [n:127.0.0.1:55379_solr c:testPeersyncFailureReplicationSuccess s:shard1 r:core_node2 x:testPeersyncFailureReplicationSuccess_shard1_replica_n1 ] o.a.s.h.SolrConfigHandler Could not get expectedVersion 0 from http://127.0.0.1:55379/solr/testPeersyncFailureReplicationSuccess_shard1_replica_n1/ for prop overlay   after 9 attempts
   [junit4]   2> 69363 INFO  (solrHandlerExecutor-68-thread-1-processing-n:127.0.0.1:55379_solr x:testPeersyncFailureReplicationSuccess_shard1_replica_n1 c:testPeersyncFailureReplicationSuccess s:shard1 r:core_node2) [n:127.0.0.1:55379_solr c:testPeersyncFailureReplicationSuccess s:shard1 r:core_node2 x:testPeersyncFailureReplicationSuccess_shard1_replica_n1 ] o.a.s.h.SolrConfigHandler Time elapsed : 1 secs, maxWait 30
   [junit4]   2> 69475 INFO  (qtp962145276-81) [n:127.0.0.1:55379_solr c:testPeersyncFailureReplicationSuccess s:shard1 r:core_node2 x:testPeersyncFailureReplicationSuccess_shard1_replica_n1 ] o.a.s.h.SolrConfigHandler expecting overlay version 0 but my version is -1
   [junit4]   2> 69475 INFO  (qtp962145276-81) [n:127.0.0.1:55379_solr c:testPeersyncFailureReplicationSuccess s:shard1 r:core_node2 x:testPeersyncFailureReplicationSuccess_shard1_replica_n1 ] o.a.s.c.S.Request [testPeersyncFailureReplicationSuccess_shard1_replica_n1]  webapp=/solr path=/config/znodeVersion params={overlay=0&wt=javabin&version=2} status=0 QTime=0
   [junit4]   2> 69475 INFO  (SolrConfigHandler-refreshconf) [     ] o.a.s.h.SolrConfigHandler Another reload is in progress . Not doing anything
   [junit4]   2> 69476 INFO  (solrHandlerExecutor-68-thread-1-processing-n:127.0.0.1:55379_solr x:testPeersyncFailureReplicationSuccess_shard1_replica_n1 c:testPeersyncFailureReplicationSuccess s:shard1 r:core_node2) [n:127.0.0.1:55379_solr c:testPeersyncFailureReplicationSuccess s:shard1 r:core_node2 x:testPeersyncFailureReplicationSuccess_shard1_replica_n1 ] o.a.s.h.SolrConfigHandler Could not get expectedVersion 0 from http://127.0.0.1:55379/solr/testPeersyncFailureReplicationSuccess_shard1_replica_n1/ for prop overlay   after 10 attempts
   [junit4]   2> 69476 INFO  (solrHandlerExecutor-68-thread-1-processing-n:127.0.0.1:55379_solr x:testPeersyncFailureReplicationSuccess_shard1_replica_n1 c:testPeersyncFailureReplicationSuccess s:shard1 r:core_node2) [n:127.0.0.1:55379_solr c:testPeersyncFailureReplicationSuccess s:shard1 r:core_node2 x:testPeersyncFailureReplicationSuccess_shard1_replica_n1 ] o.a.s.h.SolrConfigHandler Time elapsed : 1 secs, maxWait 30
   [junit4]   2> 69580 INFO  (qtp962145276-80) [n:127.0.0.1:55379_solr c:testPeersyncFailureReplicationSuccess s:shard1 r:core_node2 x:testPeersyncFailureReplicationSuccess_shard1_replica_n1 ] o.a.s.h.SolrConfigHandler expecting overlay version 0 but my version is -1
   [junit4]   2> 69580 INFO  (qtp962145276-80) [n:127.0.0.1:55379_solr c:testPeersyncFailureReplicationSuccess s:shard1 r:core_node2 x:testPeersyncFailureReplicationSuccess_shard1_replica_n1 ] o.a.s.c.S.Request [testPeersyncFailureReplicationSuccess_shard1_replica_n1]  webapp=/solr path=/config/znodeVersion params={overlay=0&wt=javabin&version=2} status=0 QTime=0
   [junit4]   2> 69581 INFO  (SolrConfigHandler-refreshconf) [     ] o.a.s.h.SolrConfigHandler Another reload is in progress . Not doing anything
   [junit4]   2> 69582 INFO  (solrHandlerExecutor-68-thread-1-processing-n:127.0.0.1:55379_solr x:testPeersyncFailureReplicationSuccess_shard1_replica_n1 c:testPeersyncFailureReplicationSuccess s:shard1 r:core_node2) [n:127.0.0.1:55379_solr c:testPeersyncFailureReplicationSuccess s:shard1 r:core_node2 x:testPeersyncFailureReplicationSuccess_shard1_replica_n1 ] o.a.s.h.SolrConfigHandler Could not get expectedVersion 0 from http://127.0.0.1:55379/solr/testPeersyncFailureReplicationSuccess_shard1_replica_n1/ for prop overlay   after 11 attempts
   [junit4]   2> 69582 INFO  (solrHandlerExecutor-68-thread-1-processing-n:127.0.0.1:55379_solr x:testPeersyncFailureReplicationSuccess_shard1_replica_n1 c:testPeersyncFailureReplicationSuccess s:shard1 r:core_node2) [n:127.0.0.1:55379_solr c:testPeersyncFailureReplicationSuccess s:shard1 r:core_node2 x:testPeersyncFailureReplicationSuccess_shard1_replica_n1 ] o.a.s.h.SolrConfigHandler Time elapsed : 1 secs, maxWait 30
   [junit4]   2> 69686 INFO  (qtp962145276-79) [n:127.0.0.1:55379_solr c:testPeersyncFailureReplicationSuccess s:shard1 r:core_node2 x:testPeersyncFailureReplicationSuccess_shard1_replica_n1 ] o.a.s.h.SolrConfigHandler expecting overlay version 0 but my version is -1
   [junit4]   2> 69687 INFO  (qtp962145276-79) [n:127.0.0.1:55379_solr c:testPeersyncFailureReplicationSuccess s:shard1 r:core_node2 x:testPeersyncFailureReplicationSuccess_shard1_replica_n1 ] o.a.s.c.S.Request [testPeersyncFailureReplicationSuccess_shard1_replica_n1]  webapp=/solr path=/config/znodeVersion params={overlay=0&wt=javabin&version=2} status=0 QTime=0
   [junit4]   2> 69687 INFO  (SolrConfigHandler-refreshconf) [     ] o.a.s.h.SolrConfigHandler Another reload is in progress . Not doing anything
   [junit4]   2> 69690 INFO  (solrHandlerExecutor-68-thread-1-processing-n:127.0.0.1:55379_solr x:testPeersyncFailureReplicationSuccess_shard1_replica_n1 c:testPeersyncFailureReplicationSuccess s:shard1 r:core_node2) [n:127.0.0.1:55379_solr c:testPeersyncFailureReplicationSuccess s:shard1 r:core_node2 x:testPeersyncFailureReplicationSuccess_shard1_replica_n1 ] o.a.s.h.SolrConfigHandler Could not get expectedVersion 0 from http://127.0.0.1:55379/solr/testPeersyncFailureReplicationSuccess_shard1_replica_n1/ for prop overlay   after 12 attempts
   [junit4]   2> 69690 INFO  (solrHandlerExecutor-68-thread-1-processing-n:127.0.0.1:55379_solr x:testPeersyncFailureReplicationSuccess_shard1_replica_n1 c:testPeersyncFailureReplicationSuccess s:shard1 r:core_node2) [n:127.0.0.1:55379_solr c:testPeersyncFailureReplicationSuccess s:shard1 r:core_node2 x:testPeersyncFailureReplicationSuccess_shard1_replica_n1 ] o.a.s.h.SolrConfigHandler Time elapsed : 1 secs, maxWait 30
   [junit4]   2> 69790 INFO  (Thread-12) [n:127.0.0.1:55379_solr     ] o.a.s.s.IndexSchema Loaded schema default-config/1.6 with uniqueid field id
   [junit4]   2> 69790 INFO  (Thread-12) [n:127.0.0.1:55379_solr     ] o.a.s.c.CoreContainer Reloading SolrCore 'testPeersyncFailureReplicationSuccess_shard1_replica_n1' using configuration from configset testPeersyncFailureReplicationSuccess.AUTOCREATED
   [junit4]   2> 69803 INFO  (qtp962145276-81) [n:127.0.0.1:55379_solr c:testPeersyncFailureReplicationSuccess s:shard1 r:core_node2 x:testPeersyncFailureReplicationSuccess_shard1_replica_n1 ] o.a.s.h.SolrConfigHandler expecting overlay version 0 but my version is -1
   [junit4]   2> 69804 INFO  (qtp962145276-81) [n:127.0.0.1:55379_solr c:testPeersyncFailureReplicationSuccess s:shard1 r:core_node2 x:testPeersyncFailureReplicationSuccess_shard1_replica_n1 ] o.a.s.c.S.Request [testPeersyncFailureReplicationSuccess_shard1_replica_n1]  webapp=/solr path=/config/znodeVersion params={overlay=0&wt=javabin&version=2} status=0 QTime=1
   [junit4]   2> 69804 INFO  (SolrConfigHandler-refreshconf) [     ] o.a.s.h.SolrConfigHandler Another reload is in progress . Not doing anything
   [junit4]   2> 69806 INFO  (solrHandlerExecutor-68-thread-1-processing-n:127.0.0.1:55379_solr x:testPeersyncFailureReplicationSuccess_shard1_replica_n1 c:testPeersyncFailureReplicationSuccess s:shard1 r:core_node2) [n:127.0.0.1:55379_solr c:testPeersyncFailureReplicationSuccess s:shard1 r:core_node2 x:testPeersyncFailureReplicationSuccess_shard1_replica_n1 ] o.a.s.h.SolrConfigHandler Could not get expectedVersion 0 from http://127.0.0.1:55379/solr/testPeersyncFailureReplicationSuccess_shard1_replica_n1/ for prop overlay   after 13 attempts
   [junit4]   2> 69806 INFO  (solrHandlerExecutor-68-thread-1-processing-n:127.0.0.1:55379_solr x:testPeersyncFailureReplicationSuccess_shard1_replica_n1 c:testPeersyncFailureReplicationSuccess s:shard1 r:core_node2) [n:127.0.0.1:55379_solr c:testPeersyncFailureReplicationSuccess s:shard1 r:core_node2 x:testPeersyncFailureReplicationSuccess_shard1_replica_n1 ] o.a.s.h.SolrConfigHandler Time elapsed : 1 secs, maxWait 30
   [junit4]   2> 69914 INFO  (qtp962145276-80) [n:127.0.0.1:55379_solr c:testPeersyncFailureReplicationSuccess s:shard1 r:core_node2 x:testPeersyncFailureReplicationSuccess_shard1_replica_n1 ] o.a.s.h.SolrConfigHandler expecting overlay version 0 but my version is -1
   [junit4]   2> 69915 INFO  (qtp962145276-80) [n:127.0.0.1:55379_solr c:testPeersyncFailureReplicationSuccess s:shard1 r:core_node2 x:testPeersyncFailureReplicationSuccess_shard1_replica_n1 ] o.a.s.c.S.Request [testPeersyncFailureReplicationSuccess_shard1_replica_n1]  webapp=/solr path=/config/znodeVersion params={overlay=0&wt=javabin&version=2} status=0 QTime=0
   [junit4]   2> 69915 INFO  (SolrConfigHandler-refreshconf) [     ] o.a.s.h.SolrConfigHandler Another reload is in progress . Not doing anything
   [junit4]   2> 69917 INFO  (solrHandlerExecutor-68-thread-1-processing-n:127.0.0.1:55379_solr x:testPeersyncFailureReplicationSuccess_shard1_replica_n1 c:testPeersyncFailureReplicationSuccess s:shard1 r:core_node2) [n:127.0.0.1:55379_solr c:testPeersyncFailureReplicationSuccess s:shard1 r:core_node2 x:testPeersyncFailureReplicationSuccess_shard1_replica_n1 ] o.a.s.h.SolrConfigHandler Could not get expectedVersion 0 from http://127.0.0.1:55379/solr/testPeersyncFailureReplicationSuccess_shard1_replica_n1/ for prop overlay   after 14 attempts
   [junit4]   2> 69917 INFO  (solrHandlerExecutor-68-thread-1-processing-n:127.0.0.1:55379_solr x:testPeersyncFailureReplicationSuccess_shard1_replica_n1 c:testPeersyncFailureReplicationSuccess s:shard1 r:core_node2) [n:127.0.0.1:55379_solr c:testPeersyncFailureReplicationSuccess s:shard1 r:core_node2 x:testPeersyncFailureReplicationSuccess_shard1_replica_n1 ] o.a.s.h.SolrConfigHandler Time elapsed : 1 secs, maxWait 30
   [junit4]   2> 70032 INFO  (Thread-12) [n:127.0.0.1:55379_solr c:testPeersyncFailureReplicationSuccess s:shard1 r:core_node2 x:testPeersyncFailureReplicationSuccess_shard1_replica_n1 ] o.a.s.m.r.SolrJmxReporter JMX monitoring for 'solr_55379.solr.core.testPeersyncFailureReplicationSuccess.shard1.replica_n1' (registry 'solr.core.testPeersyncFailureReplicationSuccess.shard1.replica_n1') enabled at server: com.sun.jmx.mbeanserver.JmxMBeanServer@2df0389
   [junit4]   2> 70032 INFO  (Thread-12) [n:127.0.0.1:55379_solr     ] o.a.s.c.SolrCore [[testPeersyncFailureReplicationSuccess_shard1_replica_n1] ] Opening new SolrCore at [/Users/jenkins/workspace/Lucene-Solr-master-MacOSX/solr/build/solr-core/test/J3/temp/solr.cloud.TestCloudSearcherWarming_42E782E498BF95C6-001/tempDir-001/node1/testPeersyncFailureReplicationSuccess_shard1_replica_n1], dataDir=[/Users/jenkins/workspace/Lucene-Solr-master-MacOSX/solr/build/solr-core/test/J3/temp/solr.cloud.TestCloudSearcherWarming_42E782E498BF95C6-001/tempDir-001/node1/testPeersyncFailureReplicationSuccess_shard1_replica_n1/data/]
   [junit4]   2> 70037 INFO  (qtp962145276-79) [n:127.0.0.1:55379_solr c:testPeersyncFailureReplicationSuccess s:shard1 r:core_node2 x:testPeersyncFailureReplicationSuccess_shard1_replica_n1 ] o.a.s.h.SolrConfigHandler expecting overlay version 0 but my version is -1
   [junit4]   2> 70037 INFO  (qtp962145276-79) [n:127.0.0.1:55379_solr c:testPeersyncFailureReplicationSuccess s:shard1 r:core_node2 x:testPeersyncFailureReplicationSuccess_shard1_replica_n1 ] o.a.s.c.S.Request [testPeersyncFailureReplicationSuccess_shard1_replica_n1]  webapp=/solr path=/config/znodeVersion params={overlay=0&wt=javabin&version=2} status=0 QTime=0
   [junit4]   2> 70037 INFO  (SolrConfigHandler-refreshconf) [     ] o.a.s.h.SolrConfigHandler Another reload is in progress . Not doing anything
   [junit4]   2> 70039 INFO  (solrHandlerExecutor-68-thread-1-processing-n:127.0.0.1:55379_solr x:testPeersyncFailureReplicationSuccess_shard1_replica_n1 c:testPeersyncFailureReplicationSuccess s:shard1 r:core_node2) [n:127.0.0.1:55379_solr c:testPeersyncFailureReplicationSuccess s:shard1 r:core_node2 x:testPeersyncFailureReplicationSuccess_shard1_replica_n1 ] o.a.s.h.SolrConfigHandler Could not get expectedVersion 0 from http://127.0.0.1:55379/solr/testPeersyncFailureReplicationSuccess_shard1_replica_n1/ for prop overlay   after 15 attempts
   [junit4]   2> 70039 INFO  (solrHandlerExecutor-68-thread-1-processing-n:127.0.0.1:55379_solr x:testPeersyncFailureReplicationSuccess_shard1_replica_n1 c:testPeersyncFailureReplicationSuccess s:shard1 r:core_node2) [n:127.0.0.1:55379_solr c:testPeersyncFailureReplicationSuccess s:shard1 r:core_node2 x:testPeersyncFailureReplicationSuccess_shard1_replica_n1 ] o.a.s.h.SolrConfigHandler Time elapsed : 1 secs, maxWait 30
   [junit4]   2> 70148 INFO  (qtp962145276-81) [n:127.0.0.1:55379_solr c:testPeersyncFailureReplicationSuccess s:shard1 r:core_node2 x:testPeersyncFailureReplicationSuccess_shard1_replica_n1 ] o.a.s.h.SolrConfigHandler expecting overlay version 0 but my version is -1
   [junit4]   2> 70149 INFO  (qtp962145276-81) [n:127.0.0.1:55379_solr c:testPeersyncFailureReplicationSuccess s:shard1 r:core_node2 x:testPeersyncFailureReplicationSuccess_shard1_replica_n1 ] o.a.s.c.S.Request [testPeersyncFailureReplicationSuccess_shard1_replica_n1]  webapp=/solr path=/config/znodeVersion params={overlay=0&wt=javabin&version=2} status=0 QTime=1
   [junit4]   2> 70149 INFO  (SolrConfigHandler-refreshconf) [     ] o.a.s.h.SolrConfigHandler Another reload is in progress . Not doing anything
   [junit4]   2> 70152 INFO  (solrHandlerExecutor-68-thread-1-processing-n:127.0.0.1:55379_solr x:testPeersyncFailureReplicationSuccess_shard1_replica_n1 c:testPeersyncFailureReplicationSuccess s:shard1 r:core_node2) [n:127.0.0.1:55379_solr c:testPeersyncFailureReplicationSuccess s:shard1 r:core_node2 x:testPeersyncFailureReplicationSuccess_shard1_replica_n1 ] o.a.s.h.SolrConfigH

[...truncated too long message...]

s.m.SolrMetricManager Closing metric reporters for registry=solr.cluster tag=null
   [junit4]   2> 1980624 INFO  (zkCallback-13939-thread-2) [     ] o.a.s.c.c.ZkStateReader Updated live nodes from ZooKeeper... (3) -> (2)
   [junit4]   2> 1980631 INFO  (zkCallback-13941-thread-3) [     ] o.a.s.c.c.ZkStateReader Updated live nodes from ZooKeeper... (3) -> (2)
   [junit4]   2> 1980679 INFO  (jetty-closer-14793-thread-2) [     ] o.e.j.s.AbstractConnector Stopped ServerConnector@3c69250b{HTTP/1.1, (http/1.1, h2c)}{127.0.0.1:0}
   [junit4]   2> 1980679 INFO  (jetty-closer-14793-thread-2) [     ] o.e.j.s.h.ContextHandler Stopped o.e.j.s.ServletContextHandler@6da27fc3{/solr,null,UNAVAILABLE}
   [junit4]   2> 1980679 INFO  (jetty-closer-14793-thread-2) [     ] o.e.j.s.session node0 Stopped scavenging
   [junit4]   2> 1980790 INFO  (jetty-closer-14793-thread-1) [     ] o.a.s.c.Overseer Overseer (id=72100662761226247-127.0.0.1:56024_solr-n_0000000000) closing
   [junit4]   2> 1980847 INFO  (zkCallback-13941-thread-2) [     ] o.a.s.c.c.ZkStateReader Updated live nodes from ZooKeeper... (2) -> (1)
   [junit4]   2> 1980872 INFO  (jetty-closer-14793-thread-1) [     ] o.e.j.s.AbstractConnector Stopped ServerConnector@27aeca5d{HTTP/1.1, (http/1.1, h2c)}{127.0.0.1:0}
   [junit4]   2> 1980892 INFO  (jetty-closer-14793-thread-1) [     ] o.e.j.s.h.ContextHandler Stopped o.e.j.s.ServletContextHandler@2909981d{/solr,null,UNAVAILABLE}
   [junit4]   2> 1980901 INFO  (jetty-closer-14793-thread-1) [     ] o.e.j.s.session node0 Stopped scavenging
   [junit4]   2> 1980968 INFO  (jetty-closer-14793-thread-3) [     ] o.e.j.s.AbstractConnector Stopped ServerConnector@3c92224c{HTTP/1.1, (http/1.1, h2c)}{127.0.0.1:0}
   [junit4]   2> 1980970 INFO  (jetty-closer-14793-thread-3) [     ] o.e.j.s.h.ContextHandler Stopped o.e.j.s.ServletContextHandler@5b77354f{/solr,null,UNAVAILABLE}
   [junit4]   2> 1980972 INFO  (jetty-closer-14793-thread-3) [     ] o.e.j.s.session node0 Stopped scavenging
   [junit4]   2> 1980977 INFO  (SUITE-CustomHighlightComponentTest-seed#[42E782E498BF95C6]-worker) [     ] o.a.s.c.ZkTestServer Shutting down ZkTestServer.
   [junit4]   2> 1981308 WARN  (ZkTestServer Run Thread) [     ] o.a.s.c.ZkTestServer Watch limit violations: 
   [junit4]   2> Maximum concurrent create/delete watches above limit:
   [junit4]   2> 
   [junit4]   2> 	6	/solr/configs/conf
   [junit4]   2> 	5	/solr/collections/collection72/terms/shard1
   [junit4]   2> 	5	/solr/collections/collection72/terms/shard2
   [junit4]   2> 	5	/solr/collections/collection72/terms/shard3
   [junit4]   2> 	4	/solr/aliases.json
   [junit4]   2> 	4	/solr/clusterprops.json
   [junit4]   2> 	3	/solr/packages.json
   [junit4]   2> 	3	/solr/security.json
   [junit4]   2> 
   [junit4]   2> Maximum concurrent data watches above limit:
   [junit4]   2> 
   [junit4]   2> 	45	/solr/collections/collection72/state.json
   [junit4]   2> 	4	/solr/clusterstate.json
   [junit4]   2> 
   [junit4]   2> Maximum concurrent children watches above limit:
   [junit4]   2> 
   [junit4]   2> 	32	/solr/overseer/queue
   [junit4]   2> 	13	/solr/live_nodes
   [junit4]   2> 	8	/solr/collections
   [junit4]   2> 	3	/solr/overseer/collection-queue-work
   [junit4]   2> 
   [junit4]   2> 1981351 INFO  (SUITE-CustomHighlightComponentTest-seed#[42E782E498BF95C6]-worker) [     ] o.a.s.c.ZkTestServer waitForServerDown: 127.0.0.1:56014
   [junit4]   2> 1981351 INFO  (SUITE-CustomHighlightComponentTest-seed#[42E782E498BF95C6]-worker) [     ] o.a.s.c.ZkTestServer parse host and port list: 127.0.0.1:56014
   [junit4]   2> 1981351 INFO  (SUITE-CustomHighlightComponentTest-seed#[42E782E498BF95C6]-worker) [     ] o.a.s.c.ZkTestServer connecting to 127.0.0.1 56014
   [junit4]   2> NOTE: leaving temporary files on disk at: /Users/jenkins/workspace/Lucene-Solr-master-MacOSX/solr/build/solr-core/test/J1/temp/solr.handler.component.CustomHighlightComponentTest_42E782E498BF95C6-001
   [junit4]   2> Jun 04, 2020 8:15:00 AM com.carrotsearch.randomizedtesting.ThreadLeakControl checkThreadLeaks
   [junit4]   2> WARNING: Will linger awaiting termination of 1 leaked thread(s).
   [junit4]   2> NOTE: test params are: codec=Asserting(Lucene86): {}, docValues:{}, maxPointsInLeafNode=712, maxMBSortInHeap=6.3326389066264195, sim=Asserting(org.apache.lucene.search.similarities.AssertingSimilarity@1c46a67c), locale=tt-RU, timezone=Europe/Kiev
   [junit4]   2> NOTE: Mac OS X 10.14.6 x86_64/AdoptOpenJDK 13.0.2 (64-bit)/cpus=6,threads=1,free=150968808,total=449314816
   [junit4]   2> NOTE: All tests run in this JVM: [ReplaceNodeTest, MetricsHandlerTest, TestPolicyCloud, DistributedTermsComponentTest, TestPartialUpdateDeduplication, ChaosMonkeySafeLeaderTest, ZkStateReaderTest, TestStressThreadBackup, HLLSerializationTest, TestDistributedTracing, TestManagedStopFilterFactory, TestStressLucene, TestLocalStatsCacheCloud, TestPivotHelperCode, RandomizedTaggerTest, TestXmlQParserPlugin, TestSurroundQueryParser, HdfsUnloadDistributedZkTest, TestObjectReleaseTracker, LeaderVoteWaitTimeoutTest, TestBM25SimilarityFactory, TestManagedSchema, TestAnalyzedSuggestions, ExecutePlanActionTest, SolrLogAuditLoggerPluginTest, TestWithCollection, TestLMDirichletSimilarityFactory, CategoryRoutedAliasUpdateProcessorTest, TestPostingsSolrHighlighter, TestDeprecatedFilters, DistributedQueueTest, TestFieldCollectionResource, ConjunctionSolrSpellCheckerTest, HdfsDirectoryFactoryTest, MultiThreadedOCPTest, TestTolerantSearch, TestMergePolicyConfig, TestInitQParser, DebugComponentTest, TestRequestStatusCollectionAPI, OverseerStatusTest, HdfsDirectoryTest, NumericFieldsTest, PrimitiveFieldTypeTest, TestTlogReplica, DateRangeFieldTest, XsltUpdateRequestHandlerTest, TestDistributedSearch, CreateRoutedAliasTest, TestLegacyNumericUtils, TestExclusionRuleCollectionAccess, SolrLogPostToolTest, TestRandomRequestDistribution, TestRestoreCore, TestUseDocValuesAsStored, MissingSegmentRecoveryTest, GraphQueryTest, TestPerFieldSimilarityWithDefaultOverride, OverseerCollectionConfigSetProcessorTest, MaxSizeAutoCommitTest, DeleteShardTest, ZkDynamicConfigTest, ClusterStateMockUtilTest, SSLMigrationTest, SpellCheckCollatorWithCollapseTest, ScheduledTriggerIntegrationTest, TestConfigSetProperties, BasicAuthIntegrationTest, TestApiFramework, TestShardHandlerFactory, FullSolrCloudDistribCmdsTest, TestCollapseQParserPlugin, TestFieldCacheReopen, SuggesterFSTTest, TestRestManager, CustomCollectionTest, FastVectorHighlighterTest, TestCustomStream, ConnectionReuseTest, PreAnalyzedUpdateProcessorTest, CurrencyRangeFacetCloudTest, TestSimExtremeIndexing, HdfsBasicDistributedZkTest, TestPackages, PeerSyncWithLeaderTest, DOMUtilTest, EchoParamsTest, SliceStateTest, SolrMetricManagerTest, UniqFieldsUpdateProcessorFactoryTest, RecoveryZkTest, SplitShardTest, TestCloudInspectUtil, TestCloudPseudoReturnFields, TestCloudRecovery2, TestConfigSetsAPIZkFailure, TestCryptoKeys, TestSkipOverseerOperations, VMParamsZkACLAndCredentialsProvidersTest, ZkCLITest, CollectionsAPIAsyncDistributedZkTest, TestHdfsCloudBackupRestore, IndexSizeTriggerMixedBoundsTest, RestoreTriggerStateTest, TestSimNodeAddedTrigger, TestSimNodeLostTrigger, TestSimPolicyCloud, TestSimScenario, BaseCdcrDistributedZkTest, CdcrBidirectionalTest, CdcrReplicationHandlerTest, CdcrRequestHandlerTest, CdcrVersionReplicationTest, HdfsChaosMonkeySafeLeaderTest, HdfsNNFailoverTest, HdfsRecoveryZkTest, HdfsRestartWhileUpdatingTest, HdfsSyncSliceTest, HdfsThreadLeakTest, StressHdfsTest, TestClusterStateMutator, ByteBuffersDirectoryFactoryTest, CachingDirectoryFactoryTest, TestImplicitCoreProperties, TestInitParams, TestSolrConfigHandler, TestCSVLoader, TestHdfsBackupRestoreCore, CoreAdminHandlerTest, InfoHandlerTest, LoggingHandlerTest, LukeRequestHandlerTest, BadComponentTest, CustomHighlightComponentTest]
   [junit4] Completed [670/913 (3!)] on J1 in 47.60s, 1 test, 1 error <<< FAILURES!

[...truncated 53112 lines...]
[repro] Jenkins log URL: https://jenkins.thetaphi.de/job/Lucene-Solr-master-MacOSX/6113/consoleText

[repro] Revision: 08a13ce589428d721ef21de083a2c57710bf49ea

[repro] Ant options: "-Dargs=-XX:+UseCompressedOops -XX:+UseParallelGC"
[repro] Repro line:  ant test  -Dtestcase=TestCloudSearcherWarming -Dtests.method=testPeersyncFailureReplicationSuccess -Dtests.seed=42E782E498BF95C6 -Dtests.slow=true -Dtests.locale=teo-KE -Dtests.timezone=Etc/UTC -Dtests.asserts=true -Dtests.file.encoding=ISO-8859-1

[repro] Repro line:  ant test  -Dtestcase=MultiThreadedOCPTest -Dtests.method=test -Dtests.seed=42E782E498BF95C6 -Dtests.slow=true -Dtests.locale=es-US -Dtests.timezone=Antarctica/Macquarie -Dtests.asserts=true -Dtests.file.encoding=ISO-8859-1

[repro] Repro line:  ant test  -Dtestcase=CustomHighlightComponentTest -Dtests.method=test -Dtests.seed=42E782E498BF95C6 -Dtests.slow=true -Dtests.locale=tt-RU -Dtests.timezone=Europe/Kiev -Dtests.asserts=true -Dtests.file.encoding=ISO-8859-1

[repro] JUnit rest result XML files will be moved to: ./repro-reports
[repro] ant clean

[...truncated 6 lines...]
[repro] Test suites by module:
[repro]    solr/core
[repro]       TestCloudSearcherWarming
[repro]       CustomHighlightComponentTest
[repro]       MultiThreadedOCPTest
[repro] ant compile-test

[...truncated 3147 lines...]
[repro] ant test-nocompile -Dtests.dups=5 -Dtests.maxfailures=15 -Dtests.class="*.TestCloudSearcherWarming|*.CustomHighlightComponentTest|*.MultiThreadedOCPTest" -Dtests.showOutput=onerror "-Dargs=-XX:+UseCompressedOops -XX:+UseParallelGC" -Dtests.seed=42E782E498BF95C6 -Dtests.slow=true -Dtests.locale=teo-KE -Dtests.timezone=Etc/UTC -Dtests.asserts=true -Dtests.file.encoding=ISO-8859-1

[...truncated 126 lines...]
[repro] Failures w/original seeds:
[repro]   0/5 failed: org.apache.solr.cloud.MultiThreadedOCPTest
[repro]   0/5 failed: org.apache.solr.cloud.TestCloudSearcherWarming
[repro]   0/5 failed: org.apache.solr.handler.component.CustomHighlightComponentTest
[repro] Exiting with code 0

[...truncated 73 lines...]