You are viewing a plain text version of this content. The canonical link for it is here.
Posted to builds@lucene.apache.org by Apache Jenkins Server <je...@builds.apache.org> on 2025/02/17 09:37:59 UTC

[JENKINS] Lucene » Lucene-NightlyTests-main - Build # 1575 - Unstable!

Build: https://ci-builds.apache.org/job/Lucene/job/Lucene-NightlyTests-main/1575/

2 tests failed.
FAILED:  org.apache.lucene.misc.store.TestDirectIODirectory.testRandomByte

Error Message:
java.lang.Exception: Test abandoned because suite timeout was reached.

Stack Trace:
java.lang.Exception: Test abandoned because suite timeout was reached.
	at __randomizedtesting.SeedInfo.seed([7F200580C506390E]:0)


FAILED:  org.apache.lucene.misc.store.TestDirectIODirectory.classMethod

Error Message:
java.lang.Exception: Suite timeout exceeded (>= 7200000 msec).

Stack Trace:
java.lang.Exception: Suite timeout exceeded (>= 7200000 msec).
	at __randomizedtesting.SeedInfo.seed([7F200580C506390E]:0)




Build Log:
[...truncated 1128 lines...]
ERROR: The following test(s) have failed:
  - org.apache.lucene.misc.store.TestDirectIODirectory.testRandomByte (:lucene:misc)
    Test output: /home/jenkins/jenkins-slave/workspace/Lucene/Lucene-NightlyTests-main/checkout/lucene/misc/build/test-results/test/outputs/OUTPUT-org.apache.lucene.misc.store.TestDirectIODirectory.txt
    Reproduce with: gradlew :lucene:misc:test --tests "org.apache.lucene.misc.store.TestDirectIODirectory.testRandomByte" -Ptests.jvms=4 -Ptests.jvmargs= -Ptests.seed=7F200580C506390E -Ptests.multiplier=2 -Ptests.useSecurityManager=true -Ptests.nightly=true -Ptests.gui=true -Ptests.file.encoding=US-ASCII -Ptests.linedocsfile=/home/jenkins/jenkins-slave/workspace/Lucene/Lucene-NightlyTests-main/test-data/enwiki.random.lines.txt -Ptests.vectorsize=256 -Ptests.forceintegervectors=true

  - org.apache.lucene.misc.store.TestDirectIODirectory.classMethod (:lucene:misc)
    Test output: /home/jenkins/jenkins-slave/workspace/Lucene/Lucene-NightlyTests-main/checkout/lucene/misc/build/test-results/test/outputs/OUTPUT-org.apache.lucene.misc.store.TestDirectIODirectory.txt
    Reproduce with: gradlew :lucene:misc:test --tests "org.apache.lucene.misc.store.TestDirectIODirectory.classMethod" -Ptests.jvms=4 -Ptests.jvmargs= -Ptests.seed=7F200580C506390E -Ptests.multiplier=2 -Ptests.useSecurityManager=true -Ptests.nightly=true -Ptests.gui=true -Ptests.file.encoding=US-ASCII -Ptests.linedocsfile=/home/jenkins/jenkins-slave/workspace/Lucene/Lucene-NightlyTests-main/test-data/enwiki.random.lines.txt -Ptests.vectorsize=256 -Ptests.forceintegervectors=true


Deprecated Gradle features were used in this build, making it incompatible with Gradle 9.0.

You can use '--warning-mode all' to show the individual deprecation warnings and determine if they come from your own scripts or plugins.

For more on this, please refer to https://docs.gradle.org/8.10/userguide/command_line_interface.html#sec:command_line_warnings in the Gradle documentation.

BUILD SUCCESSFUL in 4h 36m 24s
246 actionable tasks: 186 executed, 60 up-to-date

Publishing build scan...

The Develocity server (develocity.apache.org) rejected the access key with prefix 'eyJraWQiOiJhdXRoLWtleS1pZC00YjdiYzI5Zi0xMmIxLTRkMTMtOWZhMS1lMmI3NDY1ZWQwZmEiLCJhbGciOiJSUzI1NiIsInR5cCI6IkpXVCJ9.eyJpc19hbm9ueW1vdXMiOmZhbHNlLCJwZXJtaXNzaW9ucyI6WyJWSUVXX1NDQU4iLCJFWFBPUlRfREFUQSIsIlBVQkxJU0hfU0NBTiIsIlBSRURJQ1RJVkVfVEVTVF9TRUxFQ1RJT04iLCJSRUFEX0NBQ0hFIiwiQUNDRVNTX0FMTF9EQVRBIiwiQUNDRVNTX0RBVEFfV0lUSE9VVF9BU1NPQ0lBVEVEX1BST0pFQ1QiLCJNWV9TRVRUSU5HUyIsIlJFQURfVkVSU0lPTiJdLCJhbGxEYXRhUGVybWlzc2lvbnMiOlsiVklFV19TQ0FOIiwiUFJFRElDVElWRV9URVNUX1NFTEVDVElPTiIsIlJFQURfQ0FDSEUiLCJBQ0NFU1NfQUxMX0RBVEEiLCJBQ0NFU1NfREFUQV9XSVRIT1VUX0FTU09DSUFURURfUFJPSkVDVCIsIkVYUE9SVF9EQVRBIiwiUFVCTElTSF9TQ0FOIiwiTVlfU0VUVElOR1MiLCJSRUFEX1ZFUlNJT04iXSwicHJvamVjdHMiOnt9LCJ'.
Your access key has expired - please visit https://develocity.apache.org/settings/access-keys to refresh it.

Build step 'Invoke Gradle script' changed build result to SUCCESS
Archiving artifacts
‘**/*.events’ doesn’t match anything: ‘**’ exists but not ‘**/*.events’
No artifacts found that match the file pattern "**/*.events,heapdumps/**,**/hs_err_pid*". Configuration error?
Recording test results
[Checks API] No suitable checks publisher found.
Build step 'Publish JUnit test result report' changed build result to UNSTABLE
Email was triggered for: Unstable (Test Failures)
Sending email for trigger: Unstable (Test Failures)