You are viewing a plain text version of this content. The canonical link for it is here.
Posted to builds@mesos.apache.org by Apache Jenkins Server <je...@builds.apache.org> on 2019/10/09 23:10:27 UTC

Branch: origin/master Mesos-Buildbot - Build # 6799 - Still Failing

Branch: origin/master

The Apache Jenkins build system has built Mesos-Buildbot (build #6799)

Status: Still Failing

Check console output at https://builds.apache.org/job/Mesos-Buildbot/6799/ to view the results.

8 tests failed.
FAILED:  DefaultExecutorCheckTest.MultipleTasksWithChecks

Error Message:
../../../src/tests/check_tests.cpp:2492
Failed to wait 1mins for updates[i]

Stack Trace:
../../../src/tests/check_tests.cpp:2492
Failed to wait 1mins for updates[i]

FAILED:  MasterSlaveReconciliationTest.SlaveReregisterFrameworks

Error Message:
../../../src/tests/master_slave_reconciliation_tests.cpp:929
Failed to wait 1mins for offers

Stack Trace:
../../../src/tests/master_slave_reconciliation_tests.cpp:929
Failed to wait 1mins for offers

FAILED:  ParentChildContainerTypeAndContentType/AgentContainerAPITest.GetContainers/2

Error Message:
../../../src/tests/agent_container_api_tests.cpp:870
parentContainerId: Failed to launch parent container

Stack Trace:
../../../src/tests/agent_container_api_tests.cpp:870
parentContainerId: Failed to launch parent container

FAILED:  CSIVersion/StorageLocalResourceProviderTest.RetryRpcWithExponentialBackoff/v1

Error Message:
../../../src/tests/utils.cpp:64
Failed to wait 1mins for response

Stack Trace:
../../../src/tests/utils.cpp:64
Failed to wait 1mins for response

FAILED:  GarbageCollectorIntegrationTest.DiskUsage

Error Message:
/tmp/SRC/src/tests/gc_tests.cpp:1137
Failed to wait 1mins for slaveRegisteredMessage

Stack Trace:
/tmp/SRC/src/tests/gc_tests.cpp:1137
Failed to wait 1mins for slaveRegisteredMessage

FAILED:  SlaveTest.UnregisterThenUnreachableRace

Error Message:
/tmp/SRC/src/tests/slave_tests.cpp:4077
Failed to wait 1mins for resourceOffers

Stack Trace:
/tmp/SRC/src/tests/slave_tests.cpp:4077
Failed to wait 1mins for resourceOffers

FAILED:  FetcherCacheTest.LocalCachedMissing

Error Message:
/tmp/SRC/src/tests/fetcher_cache_tests.cpp:344
Failed to wait 1mins for slaveRegisteredMessage

Stack Trace:
/tmp/SRC/src/tests/fetcher_cache_tests.cpp:344
Failed to wait 1mins for slaveRegisteredMessage

FAILED:  ContentType/AgentAPITest.DefaultAccept/0

Error Message:
/tmp/SRC/src/tests/api_tests.cpp:8671
Failed to wait 1mins for __recover

Stack Trace:
/tmp/SRC/src/tests/api_tests.cpp:8671
Failed to wait 1mins for __recover

Branch: origin/1.9.x Mesos-Buildbot - Build # 6800 - Still Failing

Posted by Apache Jenkins Server <je...@builds.apache.org>.
Branch: origin/1.9.x

The Apache Jenkins build system has built Mesos-Buildbot (build #6800)

Status: Still Failing

Check console output at https://builds.apache.org/job/Mesos-Buildbot/6800/ to view the results.

6 tests failed.
FAILED:  FaultToleranceTest.UpdateFrameworkInfoOnMasterFailover

Error Message:
/tmp/SRC/src/tests/fault_tolerance_tests.cpp:2278
      Expected: TASK_RUNNING
To be equal to: runningStatus->state()
      Which is: TASK_STARTING

Stack Trace:
/tmp/SRC/src/tests/fault_tolerance_tests.cpp:2278
      Expected: TASK_RUNNING
To be equal to: runningStatus->state()
      Which is: TASK_STARTING

FAILED:  GarbageCollectorIntegrationTest.Restart

Error Message:
/tmp/SRC/src/tests/gc_tests.cpp:353
Failed to wait 1mins for status

Stack Trace:
/tmp/SRC/src/tests/gc_tests.cpp:353
Failed to wait 1mins for status

FAILED:  CoordinatorTest.MultipleAppendsNotLearnedFill

Error Message:
/tmp/SRC/src/tests/log_tests.cpp:1268
Failed to wait 1mins for electing

Stack Trace:
/tmp/SRC/src/tests/log_tests.cpp:1268
Failed to wait 1mins for electing

FAILED:  MasterQuotaTest.InsufficientResourcesMultipleAgents

Error Message:
/tmp/SRC/src/tests/master_quota_tests.cpp:1242
Failed to wait 1mins for agent1TotalResources

Stack Trace:
/tmp/SRC/src/tests/master_quota_tests.cpp:1242
Failed to wait 1mins for agent1TotalResources

FAILED:  EnvironmentSecretIsolatorTest.ResolveSecret

Error Message:
/tmp/SRC/src/tests/containerizer/environment_secret_isolator_tests.cpp:84
Failed to wait 1mins for offers

Stack Trace:
/tmp/SRC/src/tests/containerizer/environment_secret_isolator_tests.cpp:84
Failed to wait 1mins for offers

FAILED:  ContentType/AgentAPITest.GetLoggingLevel/1

Error Message:
/tmp/SRC/src/tests/api_tests.cpp:5704
Failed to wait 1mins for __recover

Stack Trace:
/tmp/SRC/src/tests/api_tests.cpp:5704
Failed to wait 1mins for __recover