You are viewing a plain text version of this content. The canonical link for it is here.
Posted to builds@beam.apache.org by Apache Jenkins Server <je...@builds.apache.org> on 2020/05/27 18:16:28 UTC

Build failed in Jenkins: beam_PreCommit_Python2_PVR_Flink_Cron #942

See <https://builds.apache.org/job/beam_PreCommit_Python2_PVR_Flink_Cron/942/display/redirect?page=changes>

Changes:

[heejong] [BEAM-10077] using filename + hash instead of UUID for staging name

[lcwik] [BEAM-10016, BEAM-10094] Disable single test to get portable validates

[kamil.wasilewski] [BEAM-9936] Reduce the code duplication across python/container/py*

[kamil.wasilewski] [BEAM-9936] Create SDK harness containers with Python3.8

[iemejia] [BEAM-7770] Make ReplicaInfo part of Read on SolrIO

[iemejia] [BEAM-7770] Add ReadAll transform for SolrIO

[piotr.szuberski] [BEAM-10102] Fix query in pubsub read grafana dashoard

[github] Add a flag to tune the size of the grouping tables used by the dataflow


------------------------------------------
[...truncated 94.27 KB...]
    'http', request, response, code, msg, hdrs)
  File "/usr/lib/python3.5/urllib/request.py", line 504, in error
    result = self._call_chain(*args)
  File "/usr/lib/python3.5/urllib/request.py", line 444, in _call_chain
    result = func(*args)
  File "/usr/lib/python3.5/urllib/request.py", line 696, in http_error_302
    return self.parent.open(new, timeout=req.timeout)
  File "/usr/lib/python3.5/urllib/request.py", line 472, in open
    response = meth(req, response)
  File "/usr/lib/python3.5/urllib/request.py", line 582, in http_response
    'http', request, response, code, msg, hdrs)
  File "/usr/lib/python3.5/urllib/request.py", line 510, in error
    return self._call_chain(*args)
  File "/usr/lib/python3.5/urllib/request.py", line 444, in _call_chain
    result = func(*args)
  File "/usr/lib/python3.5/urllib/request.py", line 590, in http_error_default
    raise HTTPError(req.full_url, code, msg, hdrs, fp)
urllib.error.HTTPError: HTTP Error 502: Bad Gateway
ERROR:root:Invalid url for high-scale-lib-1.0.6: http://www.opensource.org/licenses/mit-license.php. Retrying...
Traceback (most recent call last):
  File "<https://builds.apache.org/job/beam_PreCommit_Python2_PVR_Flink_Cron/ws/src/sdks/java/container/license_scripts/pull_licenses_java.py",> line 53, in pull_from_url
    url_read = urlopen(url)
  File "/usr/lib/python3.5/urllib/request.py", line 163, in urlopen
    return opener.open(url, data, timeout)
  File "/usr/lib/python3.5/urllib/request.py", line 472, in open
    response = meth(req, response)
  File "/usr/lib/python3.5/urllib/request.py", line 582, in http_response
    'http', request, response, code, msg, hdrs)
  File "/usr/lib/python3.5/urllib/request.py", line 504, in error
    result = self._call_chain(*args)
  File "/usr/lib/python3.5/urllib/request.py", line 444, in _call_chain
    result = func(*args)
  File "/usr/lib/python3.5/urllib/request.py", line 696, in http_error_302
    return self.parent.open(new, timeout=req.timeout)
  File "/usr/lib/python3.5/urllib/request.py", line 472, in open
    response = meth(req, response)
  File "/usr/lib/python3.5/urllib/request.py", line 582, in http_response
    'http', request, response, code, msg, hdrs)
  File "/usr/lib/python3.5/urllib/request.py", line 504, in error
    result = self._call_chain(*args)
  File "/usr/lib/python3.5/urllib/request.py", line 444, in _call_chain
    result = func(*args)
  File "/usr/lib/python3.5/urllib/request.py", line 696, in http_error_302
    return self.parent.open(new, timeout=req.timeout)
  File "/usr/lib/python3.5/urllib/request.py", line 472, in open
    response = meth(req, response)
  File "/usr/lib/python3.5/urllib/request.py", line 582, in http_response
    'http', request, response, code, msg, hdrs)
  File "/usr/lib/python3.5/urllib/request.py", line 510, in error
    return self._call_chain(*args)
  File "/usr/lib/python3.5/urllib/request.py", line 444, in _call_chain
    result = func(*args)
  File "/usr/lib/python3.5/urllib/request.py", line 590, in http_error_default
    raise HTTPError(req.full_url, code, msg, hdrs, fp)
urllib.error.HTTPError: HTTP Error 502: Bad Gateway
ERROR:root:Invalid url for jline-2.11: http://www.opensource.org/licenses/bsd-license.php. Retrying...
Traceback (most recent call last):
  File "<https://builds.apache.org/job/beam_PreCommit_Python2_PVR_Flink_Cron/ws/src/sdks/java/container/license_scripts/pull_licenses_java.py",> line 53, in pull_from_url
    url_read = urlopen(url)
  File "/usr/lib/python3.5/urllib/request.py", line 163, in urlopen
    return opener.open(url, data, timeout)
  File "/usr/lib/python3.5/urllib/request.py", line 472, in open
    response = meth(req, response)
  File "/usr/lib/python3.5/urllib/request.py", line 582, in http_response
    'http', request, response, code, msg, hdrs)
  File "/usr/lib/python3.5/urllib/request.py", line 504, in error
    result = self._call_chain(*args)
  File "/usr/lib/python3.5/urllib/request.py", line 444, in _call_chain
    result = func(*args)
  File "/usr/lib/python3.5/urllib/request.py", line 696, in http_error_302
    return self.parent.open(new, timeout=req.timeout)
  File "/usr/lib/python3.5/urllib/request.py", line 472, in open
    response = meth(req, response)
  File "/usr/lib/python3.5/urllib/request.py", line 582, in http_response
    'http', request, response, code, msg, hdrs)
  File "/usr/lib/python3.5/urllib/request.py", line 504, in error
    result = self._call_chain(*args)
  File "/usr/lib/python3.5/urllib/request.py", line 444, in _call_chain
    result = func(*args)
  File "/usr/lib/python3.5/urllib/request.py", line 696, in http_error_302
    return self.parent.open(new, timeout=req.timeout)
  File "/usr/lib/python3.5/urllib/request.py", line 472, in open
    response = meth(req, response)
  File "/usr/lib/python3.5/urllib/request.py", line 582, in http_response
    'http', request, response, code, msg, hdrs)
  File "/usr/lib/python3.5/urllib/request.py", line 510, in error
    return self._call_chain(*args)
  File "/usr/lib/python3.5/urllib/request.py", line 444, in _call_chain
    result = func(*args)
  File "/usr/lib/python3.5/urllib/request.py", line 590, in http_error_default
    raise HTTPError(req.full_url, code, msg, hdrs, fp)
urllib.error.HTTPError: HTTP Error 502: Bad Gateway
ERROR:root:Invalid url for jopt-simple-5.0.2: http://www.opensource.org/licenses/mit-license.php. Retrying...
Traceback (most recent call last):
  File "<https://builds.apache.org/job/beam_PreCommit_Python2_PVR_Flink_Cron/ws/src/sdks/java/container/license_scripts/pull_licenses_java.py",> line 53, in pull_from_url
    url_read = urlopen(url)
  File "/usr/lib/python3.5/urllib/request.py", line 163, in urlopen
    return opener.open(url, data, timeout)
  File "/usr/lib/python3.5/urllib/request.py", line 472, in open
    response = meth(req, response)
  File "/usr/lib/python3.5/urllib/request.py", line 582, in http_response
    'http', request, response, code, msg, hdrs)
  File "/usr/lib/python3.5/urllib/request.py", line 504, in error
    result = self._call_chain(*args)
  File "/usr/lib/python3.5/urllib/request.py", line 444, in _call_chain
    result = func(*args)
  File "/usr/lib/python3.5/urllib/request.py", line 696, in http_error_302
    return self.parent.open(new, timeout=req.timeout)
  File "/usr/lib/python3.5/urllib/request.py", line 472, in open
    response = meth(req, response)
  File "/usr/lib/python3.5/urllib/request.py", line 582, in http_response
    'http', request, response, code, msg, hdrs)
  File "/usr/lib/python3.5/urllib/request.py", line 504, in error
    result = self._call_chain(*args)
  File "/usr/lib/python3.5/urllib/request.py", line 444, in _call_chain
    result = func(*args)
  File "/usr/lib/python3.5/urllib/request.py", line 696, in http_error_302
    return self.parent.open(new, timeout=req.timeout)
  File "/usr/lib/python3.5/urllib/request.py", line 472, in open
    response = meth(req, response)
  File "/usr/lib/python3.5/urllib/request.py", line 582, in http_response
    'http', request, response, code, msg, hdrs)
  File "/usr/lib/python3.5/urllib/request.py", line 510, in error
    return self._call_chain(*args)
  File "/usr/lib/python3.5/urllib/request.py", line 444, in _call_chain
    result = func(*args)
  File "/usr/lib/python3.5/urllib/request.py", line 590, in http_error_default
    raise HTTPError(req.full_url, code, msg, hdrs, fp)
urllib.error.HTTPError: HTTP Error 502: Bad Gateway
ERROR:root:Invalid url for javacc-4.0: http://www.opensource.org/licenses/bsd-license.html. Retrying...
Traceback (most recent call last):
  File "<https://builds.apache.org/job/beam_PreCommit_Python2_PVR_Flink_Cron/ws/src/sdks/java/container/license_scripts/pull_licenses_java.py",> line 53, in pull_from_url
    url_read = urlopen(url)
  File "/usr/lib/python3.5/urllib/request.py", line 163, in urlopen
    return opener.open(url, data, timeout)
  File "/usr/lib/python3.5/urllib/request.py", line 472, in open
    response = meth(req, response)
  File "/usr/lib/python3.5/urllib/request.py", line 582, in http_response
    'http', request, response, code, msg, hdrs)
  File "/usr/lib/python3.5/urllib/request.py", line 504, in error
    result = self._call_chain(*args)
  File "/usr/lib/python3.5/urllib/request.py", line 444, in _call_chain
    result = func(*args)
  File "/usr/lib/python3.5/urllib/request.py", line 696, in http_error_302
    return self.parent.open(new, timeout=req.timeout)
  File "/usr/lib/python3.5/urllib/request.py", line 472, in open
    response = meth(req, response)
  File "/usr/lib/python3.5/urllib/request.py", line 582, in http_response
    'http', request, response, code, msg, hdrs)
  File "/usr/lib/python3.5/urllib/request.py", line 504, in error
    result = self._call_chain(*args)
  File "/usr/lib/python3.5/urllib/request.py", line 444, in _call_chain
    result = func(*args)
  File "/usr/lib/python3.5/urllib/request.py", line 696, in http_error_302
    return self.parent.open(new, timeout=req.timeout)
  File "/usr/lib/python3.5/urllib/request.py", line 472, in open
    response = meth(req, response)
  File "/usr/lib/python3.5/urllib/request.py", line 582, in http_response
    'http', request, response, code, msg, hdrs)
  File "/usr/lib/python3.5/urllib/request.py", line 510, in error
    return self._call_chain(*args)
  File "/usr/lib/python3.5/urllib/request.py", line 444, in _call_chain
    result = func(*args)
  File "/usr/lib/python3.5/urllib/request.py", line 590, in http_error_default
    raise HTTPError(req.full_url, code, msg, hdrs, fp)
urllib.error.HTTPError: HTTP Error 502: Bad Gateway
ERROR:root:Invalid url for high-scale-lib-1.0.6: http://www.opensource.org/licenses/mit-license.php. Retrying...
Traceback (most recent call last):
  File "<https://builds.apache.org/job/beam_PreCommit_Python2_PVR_Flink_Cron/ws/src/sdks/java/container/license_scripts/pull_licenses_java.py",> line 53, in pull_from_url
    url_read = urlopen(url)
  File "/usr/lib/python3.5/urllib/request.py", line 163, in urlopen
    return opener.open(url, data, timeout)
  File "/usr/lib/python3.5/urllib/request.py", line 472, in open
    response = meth(req, response)
  File "/usr/lib/python3.5/urllib/request.py", line 582, in http_response
    'http', request, response, code, msg, hdrs)
  File "/usr/lib/python3.5/urllib/request.py", line 504, in error
    result = self._call_chain(*args)
  File "/usr/lib/python3.5/urllib/request.py", line 444, in _call_chain
    result = func(*args)
  File "/usr/lib/python3.5/urllib/request.py", line 696, in http_error_302
    return self.parent.open(new, timeout=req.timeout)
  File "/usr/lib/python3.5/urllib/request.py", line 472, in open
    response = meth(req, response)
  File "/usr/lib/python3.5/urllib/request.py", line 582, in http_response
    'http', request, response, code, msg, hdrs)
  File "/usr/lib/python3.5/urllib/request.py", line 504, in error
    result = self._call_chain(*args)
  File "/usr/lib/python3.5/urllib/request.py", line 444, in _call_chain
    result = func(*args)
  File "/usr/lib/python3.5/urllib/request.py", line 696, in http_error_302
    return self.parent.open(new, timeout=req.timeout)
  File "/usr/lib/python3.5/urllib/request.py", line 472, in open
    response = meth(req, response)
  File "/usr/lib/python3.5/urllib/request.py", line 582, in http_response
    'http', request, response, code, msg, hdrs)
  File "/usr/lib/python3.5/urllib/request.py", line 510, in error
    return self._call_chain(*args)
  File "/usr/lib/python3.5/urllib/request.py", line 444, in _call_chain
    result = func(*args)
  File "/usr/lib/python3.5/urllib/request.py", line 590, in http_error_default
    raise HTTPError(req.full_url, code, msg, hdrs, fp)
urllib.error.HTTPError: HTTP Error 502: Bad Gateway
ERROR:root:Invalid url for jline-2.11: http://www.opensource.org/licenses/bsd-license.php. Retrying...

> Task :sdks:go:buildLinuxAmd64
> Task :sdks:go:goBuild

> Task :sdks:java:container:pullLicenses
ERROR:root:['s3mock_2.12-0.2.4', 'perfmark-api-0.19.0', 'google-auth-library-credentials-0.18.0', 'mbassador-1.1.9', 'jline-0.9.94']
INFO:root:pull_licenses_java.py failed. It took 42.634646 seconds with 16 threads.
Traceback (most recent call last):
  File "<https://builds.apache.org/job/beam_PreCommit_Python2_PVR_Flink_Cron/ws/src/sdks/java/container/license_scripts/pull_licenses_java.py",> line 298, in <module>
    error_msg)
RuntimeError: ('1 error(s) occurred.', ['**************************************** Licenses were not able to be pulled automatically for some dependencies. Please search source code of the dependencies on the internet and add "license" and "notice" (if available) field to <https://builds.apache.org/job/beam_PreCommit_Python2_PVR_Flink_Cron/ws/src/sdks/java/container/license_scripts/dep_urls_java.yaml> for each missing license. Dependency List: [google-auth-library-credentials-0.18.0,jline-0.9.94,mbassador-1.1.9,perfmark-api-0.19.0,s3mock_2.12-0.2.4]'])

> Task :sdks:java:container:pullLicenses FAILED
> Task :sdks:java:container:copyDockerfileDependencies

> Task :sdks:java:container:resolveBuildDependencies
Resolving ./github.com/apache/beam/sdks/go@<https://builds.apache.org/job/beam_PreCommit_Python2_PVR_Flink_Cron/ws/src/sdks/go>

> Task :sdks:java:container:installDependencies
> Task :sdks:java:container:buildLinuxAmd64
> Task :sdks:java:container:goBuild

FAILURE: Build failed with an exception.

* What went wrong:
Execution failed for task ':sdks:java:container:pullLicenses'.
> Process 'command './sdks/java/container/license_scripts/license_script.sh'' finished with non-zero exit value 1

* Try:
Run with --stacktrace option to get the stack trace. Run with --info or --debug option to get more log output. Run with --scan to get full insights.

* Get more help at https://help.gradle.org

Deprecated Gradle features were used in this build, making it incompatible with Gradle 6.0.
Use '--warning-mode all' to show the individual deprecation warnings.
See https://docs.gradle.org/5.2.1/userguide/command_line_interface.html#sec:command_line_warnings

BUILD FAILED in 2m 29s
73 actionable tasks: 53 executed, 19 from cache, 1 up-to-date

Publishing build scan...
https://gradle.com/s/7qeokp7svnjvq

Build step 'Invoke Gradle script' changed build result to FAILURE
Build step 'Invoke Gradle script' marked build as failure

---------------------------------------------------------------------
To unsubscribe, e-mail: builds-unsubscribe@beam.apache.org
For additional commands, e-mail: builds-help@beam.apache.org


Jenkins build is back to normal : beam_PreCommit_Python2_PVR_Flink_Cron #944

Posted by Apache Jenkins Server <je...@builds.apache.org>.
See <https://builds.apache.org/job/beam_PreCommit_Python2_PVR_Flink_Cron/944/display/redirect?page=changes>


---------------------------------------------------------------------
To unsubscribe, e-mail: builds-unsubscribe@beam.apache.org
For additional commands, e-mail: builds-help@beam.apache.org


Build failed in Jenkins: beam_PreCommit_Python2_PVR_Flink_Cron #943

Posted by Apache Jenkins Server <je...@builds.apache.org>.
See <https://builds.apache.org/job/beam_PreCommit_Python2_PVR_Flink_Cron/943/display/redirect?page=changes>

Changes:

[kcweaver] Update Beam website to release 2.21.0.

[kcweaver] Add blog post announcing the Beam 2.21.0 release.

[rohde.samuel] Add to/from_runner_api_parameters to WriteToBigQuery

[heejong] [BEAM-10064] Fix google3 import error for BEAM-9383

[darshanjani100] [BEAM-10074] | implement hashing functions

[kamil.wasilewski] [BEAM-9810] Tox suites for Python 3.8

[kamil.wasilewski] [BEAM-9810] Fix 'dictionary keys changed during iteration' error

[kamil.wasilewski] [BEAM-9810] Disable all failing tests until Dataflow runner supports

[kcweaver] [BEAM-10108] Update Flink versions in publish_docker_images.sh.

[github] Add release date.

[github] Add release date.

[github] Add release date.

[github] Remove HTML comment (causes formatting issues)

[github] Add Pub/Sub Lite to in progress IOs

[kcweaver] Move 2.20 download addresses to archive.

[github] Merge pull request #11796 from [BEAM-10003] Use local code for building

[github] [BEAM-9971] Do not use context classloader. (#11784)


------------------------------------------
[...truncated 3.97 MB...]
    lambda: self.create_worker().do_instruction(request), request)
  File "apache_beam/runners/worker/sdk_worker.py", line 471, in do_instruction
    getattr(request, request_type), request.instruction_id)
  File "apache_beam/runners/worker/sdk_worker.py", line 506, in process_bundle
    bundle_processor.process_bundle(instruction_id))
  File "apache_beam/runners/worker/bundle_processor.py", line 972, in process_bundle
    element.data)
  File "apache_beam/runners/worker/bundle_processor.py", line 218, in process_encoded
    self.output(decoded_value)
  File "apache_beam/runners/worker/operations.py", line 332, in output
    cython.cast(Receiver, self.receivers[output_index]).receive(windowed_value)
  File "apache_beam/runners/worker/operations.py", line 195, in receive
    self.consumer.process(windowed_value)
  File "apache_beam/runners/worker/operations.py", line 764, in process
    delayed_application = self.dofn_runner.process_with_sized_restriction(o)
  File "apache_beam/runners/common.py", line 975, in process_with_sized_restriction
    watermark_estimator=watermark_estimator)
  File "apache_beam/runners/common.py", line 712, in invoke_process
    windowed_value, additional_args, additional_kwargs)
  File "apache_beam/runners/common.py", line 819, in _invoke_process_per_window
    self.threadsafe_restriction_tracker.check_done()
  File "apache_beam/runners/sdf_utils.py", line 115, in check_done
    return self._restriction_tracker.check_done()
  File "apache_beam/io/restriction_trackers.py", line 101, in check_done
    self._range.stop))
ValueError: OffsetRestrictionTracker is not done since work in range [0, 6) has not been claimed.

INFO:apache_beam.runners.portability.portable_runner:Job state changed to FAILED
.sssINFO:apache_beam.runners.worker.worker_pool_main:Listening for workers at localhost:42307
WARNING:root:Make sure that locally built Python SDK docker image has Python 2.7 interpreter.
INFO:root:Using Python SDK docker image: apache/beam_python2.7_sdk:2.23.0.dev. If the image is not available at local, we will try to pull from hub.docker.com
INFO:apache_beam.runners.portability.portable_runner:Environment "LOOPBACK" has started a component necessary for the execution. Be sure to run the pipeline using
  with Pipeline() as p:
    p.apply(..)
This ensures that the pipeline finishes before this program exits.
INFO:apache_beam.runners.portability.portable_runner:Job state changed to STOPPED
INFO:apache_beam.runners.portability.portable_runner:Job state changed to STARTING
INFO:apache_beam.runners.portability.portable_runner:Job state changed to RUNNING
[flink-runner-job-invoker] WARN org.apache.flink.runtime.webmonitor.WebMonitorUtils - Log file environment variable 'log.file' is not set.
[flink-runner-job-invoker] WARN org.apache.flink.runtime.webmonitor.WebMonitorUtils - JobManager log files are unavailable in the web dashboard. Log file location not found in environment variable 'log.file' or configuration key 'Key: 'web.log.path' , default: null (fallback keys: [{key=jobmanager.web.log.path, isDeprecated=true}])'.
[[5]{Create, Map(<lambda at fn_runner_test.py:485>), WindowInto(WindowIntoFn), Map(<lambda at fn_runner_test.py:488>)} (1/2)] WARN org.apache.flink.metrics.MetricGroup - The operator name [5]{Create, Map(<lambda at fn_runner_test.py:485>), WindowInto(WindowIntoFn), Map(<lambda at fn_runner_test.py:488>)} exceeded the 80 characters length limit and was truncated.
[[5]{Create, Map(<lambda at fn_runner_test.py:485>), WindowInto(WindowIntoFn), Map(<lambda at fn_runner_test.py:488>)} (2/2)] WARN org.apache.flink.metrics.MetricGroup - The operator name [5]{Create, Map(<lambda at fn_runner_test.py:485>), WindowInto(WindowIntoFn), Map(<lambda at fn_runner_test.py:488>)} exceeded the 80 characters length limit and was truncated.
INFO:apache_beam.runners.worker.statecache:Creating state cache with size 0
INFO:apache_beam.runners.worker.sdk_worker:Creating insecure control channel for localhost:43163.
INFO:apache_beam.runners.worker.sdk_worker:Control channel established.
INFO:apache_beam.runners.worker.sdk_worker:Initializing SDKHarness with unbounded number of workers.
INFO:apache_beam.runners.worker.sdk_worker:Creating insecure state channel for localhost:38363.
INFO:apache_beam.runners.worker.sdk_worker:State channel established.
INFO:apache_beam.runners.worker.data_plane:Creating client data channel for 
ERROR:apache_beam.runners.worker.data_plane:Failed to read inputs in the data plane.
Traceback (most recent call last):
  File "apache_beam/runners/worker/data_plane.py", line 528, in _read_inputs
    for elements in elements_iterator:
  File "<https://builds.apache.org/job/beam_PreCommit_Python2_PVR_Flink_Cron/ws/src/build/gradleenv/1866363813/local/lib/python2.7/site-packages/grpc/_channel.py",> line 413, in next
    return self._next()
  File "<https://builds.apache.org/job/beam_PreCommit_Python2_PVR_Flink_Cron/ws/src/build/gradleenv/1866363813/local/lib/python2.7/site-packages/grpc/_channel.py",> line 689, in _next
    raise self
_MultiThreadedRendezvous: <_MultiThreadedRendezvous of RPC that terminated with:
	status = StatusCode.UNAVAILABLE
	details = "DNS resolution failed"
	debug_error_string = "{"created":"@1590637070.890199835","description":"Failed to pick subchannel","file":"src/core/ext/filters/client_channel/client_channel.cc","file_line":3962,"referenced_errors":[{"created":"@1590637070.890194257","description":"Resolver transient failure","file":"src/core/ext/filters/client_channel/resolving_lb_policy.cc","file_line":214,"referenced_errors":[{"created":"@1590637070.890192705","description":"DNS resolution failed","file":"src/core/ext/filters/client_channel/resolver/dns/c_ares/dns_resolver_ares.cc","file_line":369,"grpc_status":14,"referenced_errors":[{"created":"@1590637070.890182806","description":"C-ares status is not ARES_SUCCESS: Misformatted domain name","file":"src/core/ext/filters/client_channel/resolver/dns/c_ares/grpc_ares_wrapper.cc","file_line":254,"referenced_errors":[{"created":"@1590637070.890158886","description":"C-ares status is not ARES_SUCCESS: Misformatted domain name","file":"src/core/ext/filters/client_channel/resolver/dns/c_ares/grpc_ares_wrapper.cc","file_line":254}]}]}]}]}"
>
INFO:apache_beam.runners.worker.data_plane:Creating client data channel for localhost:38877
Exception in thread read_grpc_client_inputs:
Traceback (most recent call last):
  File "/usr/lib/python2.7/threading.py", line 801, in __bootstrap_inner
    self.run()
  File "/usr/lib/python2.7/threading.py", line 754, in run
    self.__target(*self.__args, **self.__kwargs)
  File "apache_beam/runners/worker/data_plane.py", line 545, in <lambda>
    target=lambda: self._read_inputs(elements_iterator),
  File "apache_beam/runners/worker/data_plane.py", line 528, in _read_inputs
    for elements in elements_iterator:
  File "<https://builds.apache.org/job/beam_PreCommit_Python2_PVR_Flink_Cron/ws/src/build/gradleenv/1866363813/local/lib/python2.7/site-packages/grpc/_channel.py",> line 413, in next
    return self._next()
  File "<https://builds.apache.org/job/beam_PreCommit_Python2_PVR_Flink_Cron/ws/src/build/gradleenv/1866363813/local/lib/python2.7/site-packages/grpc/_channel.py",> line 689, in _next
    raise self
_MultiThreadedRendezvous: <_MultiThreadedRendezvous of RPC that terminated with:
	status = StatusCode.UNAVAILABLE
	details = "DNS resolution failed"
	debug_error_string = "{"created":"@1590637070.890199835","description":"Failed to pick subchannel","file":"src/core/ext/filters/client_channel/client_channel.cc","file_line":3962,"referenced_errors":[{"created":"@1590637070.890194257","description":"Resolver transient failure","file":"src/core/ext/filters/client_channel/resolving_lb_policy.cc","file_line":214,"referenced_errors":[{"created":"@1590637070.890192705","description":"DNS resolution failed","file":"src/core/ext/filters/client_channel/resolver/dns/c_ares/dns_resolver_ares.cc","file_line":369,"grpc_status":14,"referenced_errors":[{"created":"@1590637070.890182806","description":"C-ares status is not ARES_SUCCESS: Misformatted domain name","file":"src/core/ext/filters/client_channel/resolver/dns/c_ares/grpc_ares_wrapper.cc","file_line":254,"referenced_errors":[{"created":"@1590637070.890158886","description":"C-ares status is not ARES_SUCCESS: Misformatted domain name","file":"src/core/ext/filters/client_channel/resolver/dns/c_ares/grpc_ares_wrapper.cc","file_line":254}]}]}]}]}"
>

[assert_that/Group/GroupByKey -> [3]assert_that/{Group, Unkey, Match} (1/2)] WARN org.apache.beam.sdk.fn.data.BeamFnDataGrpcMultiplexer - Hanged up for unknown endpoint.
ERROR:apache_beam.runners.worker.data_plane:Failed to read inputs in the data plane.
Traceback (most recent call last):
  File "apache_beam/runners/worker/data_plane.py", line 528, in _read_inputs
    for elements in elements_iterator:
  File "<https://builds.apache.org/job/beam_PreCommit_Python2_PVR_Flink_Cron/ws/src/build/gradleenv/1866363813/local/lib/python2.7/site-packages/grpc/_channel.py",> line 413, in next
    return self._next()
  File "<https://builds.apache.org/job/beam_PreCommit_Python2_PVR_Flink_Cron/ws/src/build/gradleenv/1866363813/local/lib/python2.7/site-packages/grpc/_channel.py",> line 706, in _next
    raise self
_MultiThreadedRendezvous: <_MultiThreadedRendezvous of RPC that terminated with:
	status = StatusCode.CANCELLED
	details = "Multiplexer hanging up"
	debug_error_string = "{"created":"@1590637071.374113671","description":"Error received from peer ipv4:127.0.0.1:38877","file":"src/core/lib/surface/call.cc","file_line":1056,"grpc_message":"Multiplexer hanging up","grpc_status":1}"
>
Exception in thread read_grpc_client_inputs:
Traceback (most recent call last):
  File "/usr/lib/python2.7/threading.py", line 801, in __bootstrap_inner
    self.run()
  File "/usr/lib/python2.7/threading.py", line 754, in run
    self.__target(*self.__args, **self.__kwargs)
  File "apache_beam/runners/worker/data_plane.py", line 545, in <lambda>
    target=lambda: self._read_inputs(elements_iterator),
  File "apache_beam/runners/worker/data_plane.py", line 528, in _read_inputs
    for elements in elements_iterator:
  File "<https://builds.apache.org/job/beam_PreCommit_Python2_PVR_Flink_Cron/ws/src/build/gradleenv/1866363813/local/lib/python2.7/site-packages/grpc/_channel.py",> line 413, in next
    return self._next()
  File "<https://builds.apache.org/job/beam_PreCommit_Python2_PVR_Flink_Cron/ws/src/build/gradleenv/1866363813/local/lib/python2.7/site-packages/grpc/_channel.py",> line 706, in _next
    raise self
_MultiThreadedRendezvous: <_MultiThreadedRendezvous of RPC that terminated with:
	status = StatusCode.CANCELLED
	details = "Multiplexer hanging up"
	debug_error_string = "{"created":"@1590637071.374113671","description":"Error received from peer ipv4:127.0.0.1:38877","file":"src/core/lib/surface/call.cc","file_line":1056,"grpc_message":"Multiplexer hanging up","grpc_status":1}"
>

INFO:apache_beam.runners.worker.sdk_worker:No more requests from control plane
INFO:apache_beam.runners.worker.sdk_worker:SDK Harness waiting for in-flight requests to complete
INFO:apache_beam.runners.worker.data_plane:Closing all cached grpc data channels.
INFO:apache_beam.runners.worker.sdk_worker:Closing all cached gRPC state handlers.
INFO:apache_beam.runners.portability.portable_runner:Job state changed to DONE
.INFO:apache_beam.runners.worker.sdk_worker:Done consuming work.
INFO:apache_beam.runners.worker.worker_pool_main:Listening for workers at localhost:36627
WARNING:root:Make sure that locally built Python SDK docker image has Python 2.7 interpreter.
INFO:root:Using Python SDK docker image: apache/beam_python2.7_sdk:2.23.0.dev. If the image is not available at local, we will try to pull from hub.docker.com
INFO:apache_beam.runners.portability.portable_runner:Environment "LOOPBACK" has started a component necessary for the execution. Be sure to run the pipeline using
  with Pipeline() as p:
    p.apply(..)
This ensures that the pipeline finishes before this program exits.
INFO:apache_beam.runners.portability.portable_runner:Job state changed to STOPPED
INFO:apache_beam.runners.portability.portable_runner:Job state changed to STARTING
INFO:apache_beam.runners.portability.portable_runner:Job state changed to RUNNING
[flink-runner-job-invoker] WARN org.apache.flink.runtime.webmonitor.WebMonitorUtils - Log file environment variable 'log.file' is not set.
[flink-runner-job-invoker] WARN org.apache.flink.runtime.webmonitor.WebMonitorUtils - JobManager log files are unavailable in the web dashboard. Log file location not found in environment variable 'log.file' or configuration key 'Key: 'web.log.path' , default: null (fallback keys: [{key=jobmanager.web.log.path, isDeprecated=true}])'.
INFO:apache_beam.runners.worker.statecache:Creating state cache with size 0
INFO:apache_beam.runners.worker.sdk_worker:Creating insecure control channel for localhost:35325.
INFO:apache_beam.runners.worker.sdk_worker:Control channel established.
INFO:apache_beam.runners.worker.sdk_worker:Initializing SDKHarness with unbounded number of workers.
INFO:apache_beam.runners.worker.sdk_worker:Creating insecure state channel for localhost:34795.
INFO:apache_beam.runners.worker.sdk_worker:State channel established.
INFO:apache_beam.runners.worker.data_plane:Creating client data channel for 
ERROR:apache_beam.runners.worker.data_plane:Failed to read inputs in the data plane.
Traceback (most recent call last):
  File "apache_beam/runners/worker/data_plane.py", line 528, in _read_inputs
    for elements in elements_iterator:
  File "<https://builds.apache.org/job/beam_PreCommit_Python2_PVR_Flink_Cron/ws/src/build/gradleenv/1866363813/local/lib/python2.7/site-packages/grpc/_channel.py",> line 413, in next
    return self._next()
  File "<https://builds.apache.org/job/beam_PreCommit_Python2_PVR_Flink_Cron/ws/src/build/gradleenv/1866363813/local/lib/python2.7/site-packages/grpc/_channel.py",> line 689, in _next
    raise self
_MultiThreadedRendezvous: <_MultiThreadedRendezvous of RPC that terminated with:
	status = StatusCode.UNAVAILABLE
	details = "DNS resolution failed"
	debug_error_string = "{"created":"@1590637072.394462334","description":"Failed to pick subchannel","file":"src/core/ext/filters/client_channel/client_channel.cc","file_line":3962,"referenced_errors":[{"created":"@1590637072.394458955","description":"Resolver transient failure","file":"src/core/ext/filters/client_channel/resolving_lb_policy.cc","file_line":214,"referenced_errors":[{"created":"@1590637072.394457797","description":"DNS resolution failed","file":"src/core/ext/filters/client_channel/resolver/dns/c_ares/dns_resolver_ares.cc","file_line":369,"grpc_status":14,"referenced_errors":[{"created":"@1590637072.394450654","description":"C-ares status is not ARES_SUCCESS: Misformatted domain name","file":"src/core/ext/filters/client_channel/resolver/dns/c_ares/grpc_ares_wrapper.cc","file_line":254,"referenced_errors":[{"created":"@1590637072.394435378","description":"C-ares status is not ARES_SUCCESS: Misformatted domain name","file":"src/core/ext/filters/client_channel/resolver/dns/c_ares/grpc_ares_wrapper.cc","file_line":254}]}]}]}]}"
>
INFO:apache_beam.runners.worker.data_plane:Creating client data channel for localhost:37829
Exception in thread read_grpc_client_inputs:
Traceback (most recent call last):
  File "/usr/lib/python2.7/threading.py", line 801, in __bootstrap_inner
    self.run()
  File "/usr/lib/python2.7/threading.py", line 754, in run
    self.__target(*self.__args, **self.__kwargs)
  File "apache_beam/runners/worker/data_plane.py", line 545, in <lambda>
    target=lambda: self._read_inputs(elements_iterator),
  File "apache_beam/runners/worker/data_plane.py", line 528, in _read_inputs
    for elements in elements_iterator:
  File "<https://builds.apache.org/job/beam_PreCommit_Python2_PVR_Flink_Cron/ws/src/build/gradleenv/1866363813/local/lib/python2.7/site-packages/grpc/_channel.py",> line 413, in next
    return self._next()
  File "<https://builds.apache.org/job/beam_PreCommit_Python2_PVR_Flink_Cron/ws/src/build/gradleenv/1866363813/local/lib/python2.7/site-packages/grpc/_channel.py",> line 689, in _next
    raise self
_MultiThreadedRendezvous: <_MultiThreadedRendezvous of RPC that terminated with:
	status = StatusCode.UNAVAILABLE
	details = "DNS resolution failed"
	debug_error_string = "{"created":"@1590637072.394462334","description":"Failed to pick subchannel","file":"src/core/ext/filters/client_channel/client_channel.cc","file_line":3962,"referenced_errors":[{"created":"@1590637072.394458955","description":"Resolver transient failure","file":"src/core/ext/filters/client_channel/resolving_lb_policy.cc","file_line":214,"referenced_errors":[{"created":"@1590637072.394457797","description":"DNS resolution failed","file":"src/core/ext/filters/client_channel/resolver/dns/c_ares/dns_resolver_ares.cc","file_line":369,"grpc_status":14,"referenced_errors":[{"created":"@1590637072.394450654","description":"C-ares status is not ARES_SUCCESS: Misformatted domain name","file":"src/core/ext/filters/client_channel/resolver/dns/c_ares/grpc_ares_wrapper.cc","file_line":254,"referenced_errors":[{"created":"@1590637072.394435378","description":"C-ares status is not ARES_SUCCESS: Misformatted domain name","file":"src/core/ext/filters/client_channel/resolver/dns/c_ares/grpc_ares_wrapper.cc","file_line":254}]}]}]}]}"
>

[assert_that/Group/GroupByKey -> [3]assert_that/{Group, Unkey, Match} (1/2)] WARN org.apache.beam.sdk.fn.data.BeamFnDataGrpcMultiplexer - Hanged up for unknown endpoint.
INFO:apache_beam.runners.portability.portable_runner:Job state changed to DONE
.INFO:__main__:removing conf dir: /tmp/flinktest-confjhZJJg
INFO:apache_beam.runners.worker.sdk_worker:No more requests from control plane
INFO:apache_beam.runners.worker.sdk_worker:SDK Harness waiting for in-flight requests to complete
ERROR:apache_beam.runners.worker.data_plane:Failed to read inputs in the data plane.
Traceback (most recent call last):
  File "apache_beam/runners/worker/data_plane.py", line 528, in _read_inputs
    for elements in elements_iterator:
  File "<https://builds.apache.org/job/beam_PreCommit_Python2_PVR_Flink_Cron/ws/src/build/gradleenv/1866363813/local/lib/python2.7/site-packages/grpc/_channel.py",> line 413, in next
    return self._next()
  File "<https://builds.apache.org/job/beam_PreCommit_Python2_PVR_Flink_Cron/ws/src/build/gradleenv/1866363813/local/lib/python2.7/site-packages/grpc/_channel.py",> line 706, in _next
    raise self
_MultiThreadedRendezvous: <_MultiThreadedRendezvous of RPC that terminated with:
	status = StatusCode.CANCELLED
	details = "Multiplexer hanging up"
	debug_error_string = "{"created":"@1590637072.793717327","description":"Error received from peer ipv4:127.0.0.1:37829","file":"src/core/lib/surface/call.cc","file_line":1056,"grpc_message":"Multiplexer hanging up","grpc_status":1}"
>
INFO:apache_beam.runners.worker.data_plane:Closing all cached grpc data channels.
INFO:apache_beam.runners.worker.sdk_worker:Closing all cached gRPC state handlers.
Exception in thread read_grpc_client_inputs:
Traceback (most recent call last):
  File "/usr/lib/python2.7/threading.py", line 801, in __bootstrap_inner
    self.run()
  File "/usr/lib/python2.7/threading.py", line 754, in run
    self.__target(*self.__args, **self.__kwargs)
  File "apache_beam/runners/worker/data_plane.py", line 545, in <lambda>
    target=lambda: self._read_inputs(elements_iterator),
  File "apache_beam/runners/worker/data_plane.py", line 528, in _read_inputs
    for elements in elements_iterator:
  File "<https://builds.apache.org/job/beam_PreCommit_Python2_PVR_Flink_Cron/ws/src/build/gradleenv/1866363813/local/lib/python2.7/site-packages/grpc/_channel.py",> line 413, in next
    return self._next()
  File "<https://builds.apache.org/job/beam_PreCommit_Python2_PVR_Flink_Cron/ws/src/build/gradleenv/1866363813/local/lib/python2.7/site-packages/grpc/_channel.py",> line 706, in _next
    raise self
_MultiThreadedRendezvous: <_MultiThreadedRendezvous of RPC that terminated with:
	status = StatusCode.CANCELLED
	details = "Multiplexer hanging up"
	debug_error_string = "{"created":"@1590637072.793717327","description":"Error received from peer ipv4:127.0.0.1:37829","file":"src/core/lib/surface/call.cc","file_line":1056,"grpc_message":"Multiplexer hanging up","grpc_status":1}"
>

INFO:apache_beam.runners.worker.sdk_worker:Done consuming work.

----------------------------------------------------------------------
Ran 82 tests in 151.367s

OK (skipped=16)

FAILURE: Build failed with an exception.

* Where:
Script '<https://builds.apache.org/job/beam_PreCommit_Python2_PVR_Flink_Cron/ws/src/sdks/python/test-suites/portable/common.gradle'> line: 55

* What went wrong:
Execution failed for task ':sdks:python:test-suites:portable:py2:flinkCompatibilityMatrixBatchLOOPBACK'.
> Process 'command 'sh'' finished with non-zero exit value 1

* Try:
Run with --stacktrace option to get the stack trace. Run with --info or --debug option to get more log output. Run with --scan to get full insights.

* Get more help at https://help.gradle.org

Deprecated Gradle features were used in this build, making it incompatible with Gradle 6.0.
Use '--warning-mode all' to show the individual deprecation warnings.
See https://docs.gradle.org/5.2.1/userguide/command_line_interface.html#sec:command_line_warnings

BUILD FAILED in 16m 9s
78 actionable tasks: 58 executed, 19 from cache, 1 up-to-date

Publishing build scan...
https://gradle.com/s/wznkl5marlna2

Build step 'Invoke Gradle script' changed build result to FAILURE
Build step 'Invoke Gradle script' marked build as failure

---------------------------------------------------------------------
To unsubscribe, e-mail: builds-unsubscribe@beam.apache.org
For additional commands, e-mail: builds-help@beam.apache.org