You are viewing a plain text version of this content. The canonical link for it is here.
Posted to issues@tez.apache.org by Apache Jenkins Server <je...@builds.apache.org> on 2015/02/17 21:32:57 UTC
Failed: TEZ-2114 PreCommit Build #199
Jira: https://issues.apache.org/jira/browse/TEZ-2114
Build: https://builds.apache.org/job/PreCommit-TEZ-Build/199/
###################################################################################
########################## LAST 60 LINES OF THE CONSOLE ###########################
[...truncated 2445 lines...]
{color:red}-1 overall{color}. Here are the results of testing the latest attachment
http://issues.apache.org/jira/secure/attachment/12699307/TEZ-2114.2.patch
against master revision 1653d18.
{color:green}+1 @author{color}. The patch does not contain any @author tags.
{color:green}+1 tests included{color}. The patch appears to include 1 new or modified test files.
{color:green}+1 javac{color}. The applied patch does not increase the total number of javac compiler warnings.
{color:green}+1 javadoc{color}. There were no new javadoc warning messages.
{color:green}+1 findbugs{color}. The patch does not introduce any new Findbugs (version 2.0.3) warnings.
{color:green}+1 release audit{color}. The applied patch does not increase the total number of release audit warnings.
{color:red}-1 core tests{color}. The patch failed these unit tests in :
org.apache.tez.test.TestTezJobs
Test results: https://builds.apache.org/job/PreCommit-TEZ-Build/199//testReport/
Console output: https://builds.apache.org/job/PreCommit-TEZ-Build/199//console
This message is automatically generated.
======================================================================
======================================================================
Adding comment to Jira.
======================================================================
======================================================================
Comment added.
8723cd544ff46b00af847e18f61be18089aa4f5f logged out
======================================================================
======================================================================
Finished build.
======================================================================
======================================================================
Build step 'Execute shell' marked build as failure
Archiving artifacts
Sending artifact delta relative to PreCommit-TEZ-Build #197
Archived 41 artifacts
Archive block size is 32768
Received 4 blocks and 2532297 bytes
Compression is 4.9%
Took 1.9 sec
[description-setter] Could not determine description.
Recording test results
Email was triggered for: Failure
Sending email for trigger: Failure
###################################################################################
############################## FAILED TESTS (if any) ##############################
1 tests failed.
REGRESSION: org.apache.tez.test.TestTezJobs.testInvalidQueueSubmission
Error Message:
Job submission should have thrown an exception
Stack Trace:
java.lang.AssertionError: Job submission should have thrown an exception
at org.junit.Assert.fail(Assert.java:88)
at org.apache.tez.test.TestTezJobs.testInvalidQueueSubmission(TestTezJobs.java:699)
Success: TEZ-2058 PreCommit Build #202
Posted by Apache Jenkins Server <je...@builds.apache.org>.
Jira: https://issues.apache.org/jira/browse/TEZ-2058
Build: https://builds.apache.org/job/PreCommit-TEZ-Build/202/
###################################################################################
########################## LAST 60 LINES OF THE CONSOLE ###########################
[...truncated 2612 lines...]
[INFO] Final Memory: 66M/871M
[INFO] ------------------------------------------------------------------------
{color:green}+1 overall{color}. Here are the results of testing the latest attachment
http://issues.apache.org/jira/secure/attachment/12699351/TEZ-2058.1.patch
against master revision ec7ad20.
{color:green}+1 @author{color}. The patch does not contain any @author tags.
{color:green}+1 tests included{color}. The patch appears to include 1 new or modified test files.
{color:green}+1 javac{color}. The applied patch does not increase the total number of javac compiler warnings.
{color:green}+1 javadoc{color}. There were no new javadoc warning messages.
{color:green}+1 findbugs{color}. The patch does not introduce any new Findbugs (version 2.0.3) warnings.
{color:green}+1 release audit{color}. The applied patch does not increase the total number of release audit warnings.
{color:green}+1 core tests{color}. The patch passed unit tests in .
Test results: https://builds.apache.org/job/PreCommit-TEZ-Build/202//testReport/
Console output: https://builds.apache.org/job/PreCommit-TEZ-Build/202//console
This message is automatically generated.
======================================================================
======================================================================
Adding comment to Jira.
======================================================================
======================================================================
Comment added.
05e9dede42db76dd7976145e83a29ffddf134bdd logged out
======================================================================
======================================================================
Finished build.
======================================================================
======================================================================
Archiving artifacts
Sending artifact delta relative to PreCommit-TEZ-Build #197
Archived 41 artifacts
Archive block size is 32768
Received 23 blocks and 1898908 bytes
Compression is 28.4%
Took 0.54 sec
Description set: TEZ-2058
Recording test results
Email was triggered for: Success
Sending email for trigger: Success
###################################################################################
############################## FAILED TESTS (if any) ##############################
All tests passed
Failed: TEZ-2080 PreCommit Build #201
Posted by Apache Jenkins Server <je...@builds.apache.org>.
Jira: https://issues.apache.org/jira/browse/TEZ-2080
Build: https://builds.apache.org/job/PreCommit-TEZ-Build/201/
###################################################################################
########################## LAST 60 LINES OF THE CONSOLE ###########################
[...truncated 2617 lines...]
{color:red}-1 overall{color}. Here are the results of testing the latest attachment
http://issues.apache.org/jira/secure/attachment/12699350/TEZ-2080.1.txt
against master revision ec7ad20.
{color:green}+1 @author{color}. The patch does not contain any @author tags.
{color:red}-1 tests included{color}. The patch doesn't appear to include any new or modified tests.
Please justify why no new tests are needed for this patch.
Also please list what manual steps were performed to verify this patch.
{color:green}+1 javac{color}. The applied patch does not increase the total number of javac compiler warnings.
{color:green}+1 javadoc{color}. There were no new javadoc warning messages.
{color:green}+1 findbugs{color}. The patch does not introduce any new Findbugs (version 2.0.3) warnings.
{color:green}+1 release audit{color}. The applied patch does not increase the total number of release audit warnings.
{color:green}+1 core tests{color}. The patch passed unit tests in .
Test results: https://builds.apache.org/job/PreCommit-TEZ-Build/201//testReport/
Console output: https://builds.apache.org/job/PreCommit-TEZ-Build/201//console
This message is automatically generated.
======================================================================
======================================================================
Adding comment to Jira.
======================================================================
======================================================================
Comment added.
cba1a88b8e8c957c166819963533ed0c947d1454 logged out
======================================================================
======================================================================
Finished build.
======================================================================
======================================================================
Build step 'Execute shell' marked build as failure
Archiving artifacts
Sending artifact delta relative to PreCommit-TEZ-Build #197
Archived 41 artifacts
Archive block size is 32768
Received 4 blocks and 2543396 bytes
Compression is 4.9%
Took 0.89 sec
[description-setter] Could not determine description.
Recording test results
Email was triggered for: Failure
Sending email for trigger: Failure
###################################################################################
############################## FAILED TESTS (if any) ##############################
All tests passed
Failed: TEZ-2106 PreCommit Build #200
Posted by Apache Jenkins Server <je...@builds.apache.org>.
Jira: https://issues.apache.org/jira/browse/TEZ-2106
Build: https://builds.apache.org/job/PreCommit-TEZ-Build/200/
###################################################################################
########################## LAST 60 LINES OF THE CONSOLE ###########################
[...truncated 19 lines...]
No emails were triggered.
[PreCommit-TEZ-Build] $ /bin/bash /tmp/hudson1049648714887604227.sh
Running in Jenkins mode
======================================================================
======================================================================
Testing patch for TEZ-2106.
======================================================================
======================================================================
HEAD is now at 1653d18 TEZ-2112. Tez UI: fix offset calculation, add home button to breadcrumbs. (Sreenath Somarajapuram via hitesh)
Switched to branch 'master'
Your branch is up-to-date with 'origin/master'.
Current branch master is up to date.
TEZ-2106 patch is being downloaded at Tue Feb 17 20:33:03 UTC 2015 from
http://issues.apache.org/jira/secure/attachment/12699328/TEZ-2106.2.patch
The patch does not appear to apply with p0 to p2
PATCH APPLICATION FAILED
{color:red}-1 overall{color}. Here are the results of testing the latest attachment
http://issues.apache.org/jira/secure/attachment/12699328/TEZ-2106.2.patch
against master revision 1653d18.
{color:red}-1 patch{color}. The patch command could not apply the patch.
Console output: https://builds.apache.org/job/PreCommit-TEZ-Build/200//console
This message is automatically generated.
======================================================================
======================================================================
Adding comment to Jira.
======================================================================
======================================================================
Comment added.
7cb03a117bce10c41f32c16c8a50c569a0e37081 logged out
======================================================================
======================================================================
Finished build.
======================================================================
======================================================================
Build step 'Execute shell' marked build as failure
Archiving artifacts
[description-setter] Could not determine description.
Recording test results
Email was triggered for: Failure
Sending email for trigger: Failure
###################################################################################
############################## FAILED TESTS (if any) ##############################
No tests ran.