You are viewing a plain text version of this content. The canonical link for it is here.
Posted to builds@beam.apache.org by Apache Jenkins Server <je...@builds.apache.org> on 2023/11/14 05:19:37 UTC
Build failed in Jenkins: beam_PostCommit_Java_ValidatesRunner_Flink_Java11 #5189
See <https://ci-beam.apache.org/job/beam_PostCommit_Java_ValidatesRunner_Flink_Java11/5189/display/redirect>
Changes:
------------------------------------------
[...truncated 2.71 KB...]
To honour the JVM settings for this build a single-use Daemon process will be forked. For more on this, please refer to https://docs.gradle.org/8.4/userguide/gradle_daemon.html#sec:disabling_the_daemon in the Gradle documentation.
Daemon will be stopped at the end of the build
Configuration on demand is an incubating feature.
Gradle Enterprise plugins resolution: https://plugins.gradle.org/m2
Enforcing Gradle Enterprise: https://ge.apache.org, allowUntrustedServer: false
> Task :buildSrc:compileJava NO-SOURCE
> Task :buildSrc:compileGroovy FROM-CACHE
> Task :buildSrc:pluginDescriptors
> Task :buildSrc:processResources
> Task :buildSrc:classes
> Task :buildSrc:jar
> Task :model:pipeline:createCheckerFrameworkManifest
> Task :runners:java-job-service:createCheckerFrameworkManifest
> Task :runners:core-construction-java:createCheckerFrameworkManifest
> Task :model:fn-execution:createCheckerFrameworkManifest
> Task :runners:java-fn-execution:createCheckerFrameworkManifest
> Task :sdks:java:extensions:avro:createCheckerFrameworkManifest
> Task :model:job-management:createCheckerFrameworkManifest
> Task :sdks:java:harness:createCheckerFrameworkManifest
> Task :sdks:java:core:createCheckerFrameworkManifest
> Task :runners:core-java:createCheckerFrameworkManifest
> Task :sdks:java:fn-execution:createCheckerFrameworkManifest
> Task :runners:java-fn-execution:processResources NO-SOURCE
> Task :sdks:java:extensions:avro:generateAvroProtocol NO-SOURCE
> Task :sdks:java:build-tools:createCheckerFrameworkManifest
> Task :sdks:java:transform-service:launcher:createCheckerFrameworkManifest
> Task :sdks:java:extensions:google-cloud-platform-core:createCheckerFrameworkManifest
> Task :runners:java-job-service:processResources NO-SOURCE
> Task :runners:core-construction-java:processResources NO-SOURCE
> Task :sdks:java:harness:processResources NO-SOURCE
> Task :sdks:java:fn-execution:processResources NO-SOURCE
> Task :runners:core-java:processResources NO-SOURCE
> Task :sdks:java:extensions:google-cloud-platform-core:processResources NO-SOURCE
> Task :sdks:java:extensions:avro:generateAvroJava NO-SOURCE
> Task :runners:core-java:processTestResources NO-SOURCE
> Task :sdks:java:expansion-service:createCheckerFrameworkManifest
> Task :model:job-management:extractProto
> Task :model:fn-execution:extractProto
> Task :runners:flink:1.15:copySourceOverrides
> Task :sdks:java:extensions:avro:processResources NO-SOURCE
> Task :sdks:java:expansion-service:processResources NO-SOURCE
> Task :sdks:java:extensions:protobuf:createCheckerFrameworkManifest
> Task :sdks:java:core:generateGrammarSource FROM-CACHE
> Task :sdks:java:extensions:arrow:createCheckerFrameworkManifest
> Task :runners:flink:1.15:createCheckerFrameworkManifest
> Task :sdks:java:extensions:arrow:processResources NO-SOURCE
> Task :runners:flink:1.15:copyResourcesOverrides NO-SOURCE
> Task :sdks:java:extensions:protobuf:extractProto
> Task :model:job-management:processResources
> Task :sdks:java:io:google-cloud-platform:createCheckerFrameworkManifest
> Task :model:fn-execution:processResources
> Task :sdks:java:extensions:protobuf:processResources NO-SOURCE
> Task :sdks:java:io:google-cloud-platform:processResources NO-SOURCE
> Task :runners:flink:1.15:processResources
> Task :sdks:java:core:processResources
> Task :runners:flink:1.15:copyTestSourceOverrides
> Task :sdks:java:core:generateTestGrammarSource NO-SOURCE
> Task :runners:flink:1.15:copyTestResourcesOverrides NO-SOURCE
> Task :runners:flink:1.15:processTestResources
> Task :sdks:java:core:processTestResources
> Task :sdks:java:build-tools:compileJava FROM-CACHE
> Task :sdks:java:transform-service:launcher:compileJava FROM-CACHE
> Task :sdks:java:transform-service:launcher:processResources
> Task :sdks:java:transform-service:launcher:classes
> Task :sdks:java:build-tools:processResources
> Task :sdks:java:build-tools:classes
> Task :sdks:java:build-tools:jar
> Task :sdks:java:transform-service:launcher:jar
> Task :sdks:java:transform-service:launcher:shadowJar FROM-CACHE
> Task :model:pipeline:extractIncludeProto
> Task :model:pipeline:extractProto
> Task :model:pipeline:generateProto FROM-CACHE
> Task :model:pipeline:compileJava FROM-CACHE
> Task :model:pipeline:processResources
> Task :model:pipeline:classes
> Task :model:pipeline:jar
> Task :model:pipeline:shadowJar FROM-CACHE
> Task :model:fn-execution:extractIncludeProto
> Task :model:job-management:extractIncludeProto
> Task :model:job-management:generateProto FROM-CACHE
> Task :model:fn-execution:generateProto FROM-CACHE
> Task :model:fn-execution:compileJava FROM-CACHE
> Task :model:fn-execution:classes
> Task :model:job-management:compileJava FROM-CACHE
> Task :model:job-management:classes
> Task :model:fn-execution:shadowJar FROM-CACHE
> Task :model:job-management:shadowJar FROM-CACHE
> Task :sdks:java:core:compileJava FROM-CACHE
> Task :sdks:java:core:classes
> Task :sdks:java:core:shadowJar FROM-CACHE
> Task :sdks:java:extensions:protobuf:extractIncludeProto
> Task :sdks:java:extensions:protobuf:generateProto NO-SOURCE
> Task :sdks:java:extensions:avro:compileJava FROM-CACHE
> Task :sdks:java:extensions:avro:classes UP-TO-DATE
> Task :sdks:java:extensions:arrow:compileJava FROM-CACHE
> Task :sdks:java:extensions:arrow:classes UP-TO-DATE
> Task :sdks:java:extensions:arrow:jar
> Task :sdks:java:extensions:avro:jar
> Task :sdks:java:fn-execution:compileJava FROM-CACHE
> Task :sdks:java:fn-execution:classes UP-TO-DATE
> Task :sdks:java:fn-execution:jar
> Task :runners:core-construction-java:compileJava FROM-CACHE
> Task :runners:core-construction-java:classes UP-TO-DATE
> Task :sdks:java:extensions:protobuf:compileJava FROM-CACHE
> Task :sdks:java:extensions:protobuf:classes UP-TO-DATE
> Task :runners:core-construction-java:jar
> Task :sdks:java:extensions:protobuf:jar
> Task :runners:core-java:compileJava FROM-CACHE
> Task :runners:core-java:classes UP-TO-DATE
> Task :sdks:java:core:compileTestJava FROM-CACHE
> Task :sdks:java:core:testClasses
> Task :runners:core-java:jar
> Task :sdks:java:core:shadowTestJar FROM-CACHE
> Task :sdks:java:extensions:google-cloud-platform-core:compileJava FROM-CACHE
> Task :sdks:java:extensions:google-cloud-platform-core:classes UP-TO-DATE
> Task :sdks:java:extensions:google-cloud-platform-core:jar
> Task :sdks:java:harness:compileJava FROM-CACHE
> Task :sdks:java:harness:classes UP-TO-DATE
> Task :sdks:java:harness:jar
> Task :runners:core-java:compileTestJava FROM-CACHE
> Task :runners:core-java:testClasses UP-TO-DATE
> Task :runners:core-java:testJar
> Task :runners:java-fn-execution:compileJava FROM-CACHE
> Task :runners:java-fn-execution:classes UP-TO-DATE
> Task :runners:java-fn-execution:jar
> Task :sdks:java:expansion-service:compileJava FROM-CACHE
> Task :sdks:java:expansion-service:classes UP-TO-DATE
> Task :sdks:java:expansion-service:jar
> Task :runners:java-job-service:compileJava FROM-CACHE
> Task :runners:java-job-service:classes UP-TO-DATE
> Task :runners:java-job-service:jar
> Task :runners:flink:1.15:compileJava FROM-CACHE
> Task :runners:flink:1.15:classes
> Task :runners:flink:1.15:jar
> Task :sdks:java:io:google-cloud-platform:compileJava FROM-CACHE
> Task :sdks:java:io:google-cloud-platform:classes UP-TO-DATE
> Task :sdks:java:io:google-cloud-platform:jar
> Task :runners:flink:1.15:compileTestJava FROM-CACHE
> Task :runners:flink:1.15:testClasses
> Task :runners:flink:1.15:testJar
Deprecated Gradle features were used in this build, making it incompatible with Gradle 9.0.
You can use '--warning-mode all' to show the individual deprecation warnings and determine if they come from your own scripts or plugins.
For more on this, please refer to https://docs.gradle.org/8.4/userguide/command_line_interface.html#sec:command_line_warnings in the Gradle documentation.
BUILD SUCCESSFUL in 23s
92 actionable tasks: 59 executed, 33 from cache
Publishing build scan...
https://ge.apache.org/s/pgqpud4dgob3q
Build step 'Invoke Gradle script' changed build result to SUCCESS
[Gradle] - Launching build.
[src] $ <https://ci-beam.apache.org/job/beam_PostCommit_Java_ValidatesRunner_Flink_Java11/ws/src/gradlew> -x shadowJar -x shadowTestJar -x compileJava -x compileTestJava -x jar -x testJar -x classes -x testClasses -Dorg.gradle.java.home=/usr/lib/jvm/java-11-openjdk-amd64 --continue --max-workers=12 -Dorg.gradle.jvmargs=-Xms2g -Dorg.gradle.jvmargs=-Xmx6g -Dorg.gradle.vfs.watch=false -Pdocker-pull-licenses :runners:flink:1.15:validatesRunner
To honour the JVM settings for this build a single-use Daemon process will be forked. For more on this, please refer to https://docs.gradle.org/8.4/userguide/gradle_daemon.html#sec:disabling_the_daemon in the Gradle documentation.
Daemon will be stopped at the end of the build
Configuration on demand is an incubating feature.
Gradle Enterprise plugins resolution: https://plugins.gradle.org/m2
Enforcing Gradle Enterprise: https://ge.apache.org, allowUntrustedServer: false
> Task :buildSrc:compileJava NO-SOURCE
> Task :buildSrc:compileGroovy FROM-CACHE
> Task :buildSrc:pluginDescriptors UP-TO-DATE
> Task :buildSrc:processResources UP-TO-DATE
> Task :buildSrc:classes UP-TO-DATE
> Task :buildSrc:jar
> Task :runners:flink:1.15:validatesRunnerBatch
WARNING: An illegal reflective access operation has occurred
WARNING: Illegal reflective access by org.apache.flink.api.java.ClosureCleaner (file:/home/jenkins/.gradle/caches/modules-2/files-2.1/org.apache.flink/flink-core/1.15.0/41836e7311354a678c72284a81fde0d0c48ed905/flink-core-1.15.0.jar) to field java.lang.String.value
WARNING: Please consider reporting this to the maintainers of org.apache.flink.api.java.ClosureCleaner
WARNING: Use --illegal-access=warn to enable warnings of further illegal reflective access operations
WARNING: All illegal access operations will be denied in a future release
WARNING: An illegal reflective access operation has occurred
WARNING: Illegal reflective access by org.apache.flink.api.java.ClosureCleaner (file:/home/jenkins/.gradle/caches/modules-2/files-2.1/org.apache.flink/flink-core/1.15.0/41836e7311354a678c72284a81fde0d0c48ed905/flink-core-1.15.0.jar) to field java.lang.String.value
WARNING: Please consider reporting this to the maintainers of org.apache.flink.api.java.ClosureCleaner
WARNING: Use --illegal-access=warn to enable warnings of further illegal reflective access operations
WARNING: All illegal access operations will be denied in a future release
WARNING: An illegal reflective access operation has occurred
WARNING: Illegal reflective access by org.apache.flink.api.java.ClosureCleaner (file:/home/jenkins/.gradle/caches/modules-2/files-2.1/org.apache.flink/flink-core/1.15.0/41836e7311354a678c72284a81fde0d0c48ed905/flink-core-1.15.0.jar) to field java.lang.String.value
WARNING: Please consider reporting this to the maintainers of org.apache.flink.api.java.ClosureCleaner
WARNING: Use --illegal-access=warn to enable warnings of further illegal reflective access operations
WARNING: All illegal access operations will be denied in a future release
> Task :runners:flink:1.15:validatesRunnerBatchWithDataStream
org.apache.beam.sdk.transforms.ViewTest > testTriggeredLatestSingleton FAILED
org.apache.beam.sdk.Pipeline$PipelineExecutionException at ViewTest.java:330
Caused by: java.lang.IllegalArgumentException at PCollectionViews.java:412
294 tests completed, 1 failed, 1 skipped
> Task :runners:flink:1.15:validatesRunnerBatchWithDataStream FAILED
WARNING: An illegal reflective access operation has occurred
WARNING: Illegal reflective access by org.apache.flink.api.java.ClosureCleaner (file:/home/jenkins/.gradle/caches/modules-2/files-2.1/org.apache.flink/flink-core/1.15.0/41836e7311354a678c72284a81fde0d0c48ed905/flink-core-1.15.0.jar) to field java.lang.String.value
WARNING: Please consider reporting this to the maintainers of org.apache.flink.api.java.ClosureCleaner
WARNING: Use --illegal-access=warn to enable warnings of further illegal reflective access operations
WARNING: All illegal access operations will be denied in a future release
WARNING: An illegal reflective access operation has occurred
WARNING: Illegal reflective access by org.apache.flink.api.java.ClosureCleaner (file:/home/jenkins/.gradle/caches/modules-2/files-2.1/org.apache.flink/flink-core/1.15.0/41836e7311354a678c72284a81fde0d0c48ed905/flink-core-1.15.0.jar) to field java.lang.String.value
WARNING: Please consider reporting this to the maintainers of org.apache.flink.api.java.ClosureCleaner
WARNING: Use --illegal-access=warn to enable warnings of further illegal reflective access operations
WARNING: All illegal access operations will be denied in a future release
> Task :runners:flink:1.15:validatesRunnerStreaming
org.apache.beam.sdk.transforms.ParDoLifecycleTest > testTeardownCalledAfterExceptionInProcessElementStateful FAILED
java.lang.AssertionError at Assert.java:89
324 tests completed, 1 failed, 2 skipped
> Task :runners:flink:1.15:validatesRunnerStreaming FAILED
WARNING: An illegal reflective access operation has occurred
WARNING: Illegal reflective access by org.apache.flink.api.java.ClosureCleaner (file:/home/jenkins/.gradle/caches/modules-2/files-2.1/org.apache.flink/flink-core/1.15.0/41836e7311354a678c72284a81fde0d0c48ed905/flink-core-1.15.0.jar) to field java.lang.String.value
WARNING: Please consider reporting this to the maintainers of org.apache.flink.api.java.ClosureCleaner
WARNING: Use --illegal-access=warn to enable warnings of further illegal reflective access operations
WARNING: All illegal access operations will be denied in a future release
> Task :runners:flink:1.15:validatesRunnerStreamingCheckpointing
FAILURE: Build completed with 2 failures.
1: Task failed with an exception.
-----------
* What went wrong:
Execution failed for task ':runners:flink:1.15:validatesRunnerBatchWithDataStream'.
> There were failing tests. See the report at: file://<https://ci-beam.apache.org/job/beam_PostCommit_Java_ValidatesRunner_Flink_Java11/ws/src/runners/flink/1.15/build/reports/tests/validatesRunnerBatchWithDataStream/index.html>
==============================================================================
2: Task failed with an exception.
-----------
* What went wrong:
Execution failed for task ':runners:flink:1.15:validatesRunnerStreaming'.
> There were failing tests. See the report at: file://<https://ci-beam.apache.org/job/beam_PostCommit_Java_ValidatesRunner_Flink_Java11/ws/src/runners/flink/1.15/build/reports/tests/validatesRunnerStreaming/index.html>
==============================================================================
Deprecated Gradle features were used in this build, making it incompatible with Gradle 9.0.
You can use '--warning-mode all' to show the individual deprecation warnings and determine if they come from your own scripts or plugins.
For more on this, please refer to https://docs.gradle.org/8.4/userguide/command_line_interface.html#sec:command_line_warnings in the Gradle documentation.
BUILD FAILED in 37m 48s
8 actionable tasks: 5 executed, 1 from cache, 2 up-to-date
Publishing build scan...
https://ge.apache.org/s/mmlptnjywenra
Build step 'Invoke Gradle script' changed build result to FAILURE
Build step 'Invoke Gradle script' marked build as failure
---------------------------------------------------------------------
To unsubscribe, e-mail: builds-unsubscribe@beam.apache.org
For additional commands, e-mail: builds-help@beam.apache.org
Jenkins build is back to normal : beam_PostCommit_Java_ValidatesRunner_Flink_Java11 #5203
Posted by Apache Jenkins Server <je...@builds.apache.org>.
See <https://ci-beam.apache.org/job/beam_PostCommit_Java_ValidatesRunner_Flink_Java11/5203/display/redirect?page=changes>
---------------------------------------------------------------------
To unsubscribe, e-mail: builds-unsubscribe@beam.apache.org
For additional commands, e-mail: builds-help@beam.apache.org
Build failed in Jenkins: beam_PostCommit_Java_ValidatesRunner_Flink_Java11 #5202
Posted by Apache Jenkins Server <je...@builds.apache.org>.
See <https://ci-beam.apache.org/job/beam_PostCommit_Java_ValidatesRunner_Flink_Java11/5202/display/redirect>
Changes:
------------------------------------------
[...truncated 3.18 KB...]
Enforcing Gradle Enterprise: https://ge.apache.org, allowUntrustedServer: false
> Task :buildSrc:compileJava NO-SOURCE
> Task :buildSrc:compileGroovy FROM-CACHE
> Task :buildSrc:pluginDescriptors
> Task :buildSrc:processResources
> Task :buildSrc:classes
> Task :buildSrc:jar
> Task :sdks:java:build-tools:createCheckerFrameworkManifest
> Task :model:pipeline:createCheckerFrameworkManifest
> Task :runners:core-java:createCheckerFrameworkManifest
> Task :sdks:java:fn-execution:createCheckerFrameworkManifest
> Task :sdks:java:extensions:avro:createCheckerFrameworkManifest
> Task :runners:core-construction-java:createCheckerFrameworkManifest
> Task :sdks:java:core:createCheckerFrameworkManifest
> Task :model:fn-execution:createCheckerFrameworkManifest
> Task :sdks:java:extensions:google-cloud-platform-core:createCheckerFrameworkManifest
> Task :sdks:java:harness:createCheckerFrameworkManifest
> Task :runners:core-java:processResources NO-SOURCE
> Task :sdks:java:extensions:avro:generateAvroProtocol NO-SOURCE
> Task :sdks:java:fn-execution:processResources NO-SOURCE
> Task :runners:java-fn-execution:createCheckerFrameworkManifest
> Task :sdks:java:expansion-service:createCheckerFrameworkManifest
> Task :runners:core-construction-java:processResources NO-SOURCE
> Task :sdks:java:extensions:avro:generateAvroJava NO-SOURCE
> Task :sdks:java:expansion-service:processResources NO-SOURCE
> Task :sdks:java:harness:processResources NO-SOURCE
> Task :runners:java-fn-execution:processResources NO-SOURCE
> Task :sdks:java:extensions:google-cloud-platform-core:processResources NO-SOURCE
> Task :runners:core-java:processTestResources NO-SOURCE
> Task :model:job-management:createCheckerFrameworkManifest
> Task :sdks:java:extensions:avro:processResources NO-SOURCE
> Task :sdks:java:transform-service:launcher:createCheckerFrameworkManifest
> Task :runners:java-job-service:createCheckerFrameworkManifest
> Task :model:fn-execution:extractProto
> Task :runners:java-job-service:processResources NO-SOURCE
> Task :runners:flink:1.15:copySourceOverrides
> Task :model:job-management:extractProto
> Task :sdks:java:extensions:arrow:createCheckerFrameworkManifest
> Task :sdks:java:extensions:protobuf:createCheckerFrameworkManifest
> Task :sdks:java:extensions:arrow:processResources NO-SOURCE
> Task :sdks:java:io:google-cloud-platform:createCheckerFrameworkManifest
> Task :sdks:java:core:generateGrammarSource FROM-CACHE
> Task :sdks:java:extensions:protobuf:extractProto
> Task :sdks:java:io:google-cloud-platform:processResources NO-SOURCE
> Task :sdks:java:extensions:protobuf:processResources NO-SOURCE
> Task :model:job-management:processResources
> Task :runners:flink:1.15:createCheckerFrameworkManifest
> Task :runners:flink:1.15:copyResourcesOverrides NO-SOURCE
> Task :model:fn-execution:processResources
> Task :runners:flink:1.15:processResources
> Task :runners:flink:1.15:copyTestSourceOverrides
> Task :sdks:java:core:processResources
> Task :runners:flink:1.15:copyTestResourcesOverrides NO-SOURCE
> Task :sdks:java:core:generateTestGrammarSource NO-SOURCE
> Task :runners:flink:1.15:processTestResources
> Task :sdks:java:core:processTestResources
> Task :sdks:java:build-tools:compileJava FROM-CACHE
> Task :sdks:java:transform-service:launcher:compileJava FROM-CACHE
> Task :sdks:java:transform-service:launcher:processResources
> Task :sdks:java:transform-service:launcher:classes
> Task :sdks:java:build-tools:processResources
> Task :sdks:java:build-tools:classes
> Task :sdks:java:build-tools:jar
> Task :sdks:java:transform-service:launcher:jar
> Task :sdks:java:transform-service:launcher:shadowJar FROM-CACHE
> Task :model:pipeline:extractIncludeProto
> Task :model:pipeline:extractProto
> Task :model:pipeline:generateProto FROM-CACHE
> Task :model:pipeline:compileJava FROM-CACHE
> Task :model:pipeline:processResources
> Task :model:pipeline:classes
> Task :model:pipeline:jar
> Task :model:pipeline:shadowJar FROM-CACHE
> Task :model:job-management:extractIncludeProto
> Task :model:fn-execution:extractIncludeProto
> Task :model:job-management:generateProto FROM-CACHE
> Task :model:fn-execution:generateProto FROM-CACHE
> Task :model:job-management:compileJava FROM-CACHE
> Task :model:job-management:classes
> Task :model:fn-execution:compileJava FROM-CACHE
> Task :model:fn-execution:classes
> Task :model:job-management:shadowJar FROM-CACHE
> Task :model:fn-execution:shadowJar FROM-CACHE
> Task :sdks:java:core:compileJava FROM-CACHE
> Task :sdks:java:core:classes
> Task :sdks:java:core:shadowJar FROM-CACHE
> Task :sdks:java:extensions:arrow:compileJava FROM-CACHE
> Task :sdks:java:extensions:protobuf:extractIncludeProto
> Task :sdks:java:extensions:arrow:classes UP-TO-DATE
> Task :sdks:java:extensions:protobuf:generateProto NO-SOURCE
> Task :sdks:java:extensions:arrow:jar
> Task :sdks:java:extensions:avro:compileJava FROM-CACHE
> Task :sdks:java:extensions:avro:classes UP-TO-DATE
> Task :sdks:java:extensions:protobuf:compileJava FROM-CACHE
> Task :sdks:java:extensions:protobuf:classes UP-TO-DATE
> Task :sdks:java:extensions:protobuf:jar
> Task :sdks:java:fn-execution:compileJava FROM-CACHE
> Task :sdks:java:fn-execution:classes UP-TO-DATE
> Task :sdks:java:extensions:avro:jar
> Task :sdks:java:fn-execution:jar
> Task :runners:core-construction-java:compileJava FROM-CACHE
> Task :runners:core-construction-java:classes UP-TO-DATE
> Task :runners:core-construction-java:jar
> Task :runners:core-java:compileJava FROM-CACHE
> Task :runners:core-java:classes UP-TO-DATE
> Task :runners:core-java:jar
> Task :sdks:java:core:compileTestJava FROM-CACHE
> Task :sdks:java:core:testClasses
> Task :sdks:java:extensions:google-cloud-platform-core:compileJava FROM-CACHE
> Task :sdks:java:extensions:google-cloud-platform-core:classes UP-TO-DATE
> Task :sdks:java:extensions:google-cloud-platform-core:jar
> Task :sdks:java:core:shadowTestJar FROM-CACHE
> Task :sdks:java:harness:compileJava FROM-CACHE
> Task :sdks:java:harness:classes UP-TO-DATE
> Task :sdks:java:harness:jar
> Task :runners:java-fn-execution:compileJava FROM-CACHE
> Task :runners:java-fn-execution:classes UP-TO-DATE
> Task :runners:java-fn-execution:jar
> Task :sdks:java:expansion-service:compileJava FROM-CACHE
> Task :sdks:java:expansion-service:classes UP-TO-DATE
> Task :sdks:java:expansion-service:jar
> Task :runners:core-java:compileTestJava FROM-CACHE
> Task :runners:core-java:testClasses UP-TO-DATE
> Task :runners:java-job-service:compileJava FROM-CACHE
> Task :runners:java-job-service:classes UP-TO-DATE
> Task :runners:core-java:testJar
> Task :runners:java-job-service:jar
> Task :runners:flink:1.15:compileJava FROM-CACHE
> Task :runners:flink:1.15:classes
> Task :runners:flink:1.15:jar
> Task :sdks:java:io:google-cloud-platform:compileJava FROM-CACHE
> Task :sdks:java:io:google-cloud-platform:classes UP-TO-DATE
> Task :sdks:java:io:google-cloud-platform:jar
> Task :runners:flink:1.15:compileTestJava FROM-CACHE
> Task :runners:flink:1.15:testClasses
> Task :runners:flink:1.15:testJar
Deprecated Gradle features were used in this build, making it incompatible with Gradle 9.0.
You can use '--warning-mode all' to show the individual deprecation warnings and determine if they come from your own scripts or plugins.
For more on this, please refer to https://docs.gradle.org/8.4/userguide/command_line_interface.html#sec:command_line_warnings in the Gradle documentation.
BUILD SUCCESSFUL in 24s
92 actionable tasks: 59 executed, 33 from cache
Publishing build scan...
https://ge.apache.org/s/ffytyxuju2zfs
Build step 'Invoke Gradle script' changed build result to SUCCESS
[Gradle] - Launching build.
[src] $ <https://ci-beam.apache.org/job/beam_PostCommit_Java_ValidatesRunner_Flink_Java11/ws/src/gradlew> -x shadowJar -x shadowTestJar -x compileJava -x compileTestJava -x jar -x testJar -x classes -x testClasses -Dorg.gradle.java.home=/usr/lib/jvm/java-11-openjdk-amd64 --continue --max-workers=12 -Dorg.gradle.jvmargs=-Xms2g -Dorg.gradle.jvmargs=-Xmx6g -Dorg.gradle.vfs.watch=false -Pdocker-pull-licenses :runners:flink:1.15:validatesRunner
To honour the JVM settings for this build a single-use Daemon process will be forked. For more on this, please refer to https://docs.gradle.org/8.4/userguide/gradle_daemon.html#sec:disabling_the_daemon in the Gradle documentation.
Daemon will be stopped at the end of the build
Configuration on demand is an incubating feature.
Gradle Enterprise plugins resolution: https://plugins.gradle.org/m2
Enforcing Gradle Enterprise: https://ge.apache.org, allowUntrustedServer: false
> Task :buildSrc:compileJava NO-SOURCE
> Task :buildSrc:compileGroovy FROM-CACHE
> Task :buildSrc:pluginDescriptors UP-TO-DATE
> Task :buildSrc:processResources UP-TO-DATE
> Task :buildSrc:classes UP-TO-DATE
> Task :buildSrc:jar
> Task :runners:flink:1.15:validatesRunnerBatch
WARNING: An illegal reflective access operation has occurred
WARNING: Illegal reflective access by org.apache.flink.api.java.ClosureCleaner (file:/home/jenkins/.gradle/caches/modules-2/files-2.1/org.apache.flink/flink-core/1.15.0/41836e7311354a678c72284a81fde0d0c48ed905/flink-core-1.15.0.jar) to field java.lang.String.value
WARNING: Please consider reporting this to the maintainers of org.apache.flink.api.java.ClosureCleaner
WARNING: Use --illegal-access=warn to enable warnings of further illegal reflective access operations
WARNING: All illegal access operations will be denied in a future release
WARNING: An illegal reflective access operation has occurred
WARNING: Illegal reflective access by org.apache.flink.api.java.ClosureCleaner (file:/home/jenkins/.gradle/caches/modules-2/files-2.1/org.apache.flink/flink-core/1.15.0/41836e7311354a678c72284a81fde0d0c48ed905/flink-core-1.15.0.jar) to field java.lang.String.value
WARNING: Please consider reporting this to the maintainers of org.apache.flink.api.java.ClosureCleaner
WARNING: Use --illegal-access=warn to enable warnings of further illegal reflective access operations
WARNING: All illegal access operations will be denied in a future release
WARNING: An illegal reflective access operation has occurred
WARNING: Illegal reflective access by org.apache.flink.api.java.ClosureCleaner (file:/home/jenkins/.gradle/caches/modules-2/files-2.1/org.apache.flink/flink-core/1.15.0/41836e7311354a678c72284a81fde0d0c48ed905/flink-core-1.15.0.jar) to field java.lang.String.value
WARNING: Please consider reporting this to the maintainers of org.apache.flink.api.java.ClosureCleaner
WARNING: Use --illegal-access=warn to enable warnings of further illegal reflective access operations
WARNING: All illegal access operations will be denied in a future release
> Task :runners:flink:1.15:validatesRunnerBatchWithDataStream
org.apache.beam.sdk.transforms.ParDoLifecycleTest > testTeardownCalledAfterExceptionInStartBundleStateful FAILED
java.lang.AssertionError at Assert.java:89
org.apache.beam.sdk.transforms.ViewTest > testTriggeredLatestSingleton FAILED
org.apache.beam.sdk.Pipeline$PipelineExecutionException at ViewTest.java:330
Caused by: java.lang.IllegalArgumentException at PCollectionViews.java:412
294 tests completed, 2 failed, 1 skipped
> Task :runners:flink:1.15:validatesRunnerBatchWithDataStream FAILED
WARNING: An illegal reflective access operation has occurred
WARNING: Illegal reflective access by org.apache.flink.api.java.ClosureCleaner (file:/home/jenkins/.gradle/caches/modules-2/files-2.1/org.apache.flink/flink-core/1.15.0/41836e7311354a678c72284a81fde0d0c48ed905/flink-core-1.15.0.jar) to field java.lang.String.value
WARNING: Please consider reporting this to the maintainers of org.apache.flink.api.java.ClosureCleaner
WARNING: Use --illegal-access=warn to enable warnings of further illegal reflective access operations
WARNING: All illegal access operations will be denied in a future release
WARNING: An illegal reflective access operation has occurred
WARNING: Illegal reflective access by org.apache.flink.api.java.ClosureCleaner (file:/home/jenkins/.gradle/caches/modules-2/files-2.1/org.apache.flink/flink-core/1.15.0/41836e7311354a678c72284a81fde0d0c48ed905/flink-core-1.15.0.jar) to field java.lang.String.value
WARNING: Please consider reporting this to the maintainers of org.apache.flink.api.java.ClosureCleaner
WARNING: Use --illegal-access=warn to enable warnings of further illegal reflective access operations
WARNING: All illegal access operations will be denied in a future release
> Task :runners:flink:1.15:validatesRunnerStreaming
org.apache.beam.sdk.transforms.GroupByKeyTest > org.apache.beam.sdk.transforms.GroupByKeyTest$BasicTests.testAfterProcessingTimeContinuationTriggerUsingState FAILED
java.lang.AssertionError at GroupByKeyTest.java:302
Caused by: java.lang.AssertionError at MatcherAssert.java:18
324 tests completed, 1 failed, 2 skipped
> Task :runners:flink:1.15:validatesRunnerStreaming FAILED
WARNING: An illegal reflective access operation has occurred
WARNING: Illegal reflective access by org.apache.flink.api.java.ClosureCleaner (file:/home/jenkins/.gradle/caches/modules-2/files-2.1/org.apache.flink/flink-core/1.15.0/41836e7311354a678c72284a81fde0d0c48ed905/flink-core-1.15.0.jar) to field java.lang.String.value
WARNING: Please consider reporting this to the maintainers of org.apache.flink.api.java.ClosureCleaner
WARNING: Use --illegal-access=warn to enable warnings of further illegal reflective access operations
WARNING: All illegal access operations will be denied in a future release
> Task :runners:flink:1.15:validatesRunnerStreamingCheckpointing
FAILURE: Build completed with 2 failures.
1: Task failed with an exception.
-----------
* What went wrong:
Execution failed for task ':runners:flink:1.15:validatesRunnerBatchWithDataStream'.
> There were failing tests. See the report at: file://<https://ci-beam.apache.org/job/beam_PostCommit_Java_ValidatesRunner_Flink_Java11/ws/src/runners/flink/1.15/build/reports/tests/validatesRunnerBatchWithDataStream/index.html>
==============================================================================
2: Task failed with an exception.
-----------
* What went wrong:
Execution failed for task ':runners:flink:1.15:validatesRunnerStreaming'.
> There were failing tests. See the report at: file://<https://ci-beam.apache.org/job/beam_PostCommit_Java_ValidatesRunner_Flink_Java11/ws/src/runners/flink/1.15/build/reports/tests/validatesRunnerStreaming/index.html>
==============================================================================
Deprecated Gradle features were used in this build, making it incompatible with Gradle 9.0.
You can use '--warning-mode all' to show the individual deprecation warnings and determine if they come from your own scripts or plugins.
For more on this, please refer to https://docs.gradle.org/8.4/userguide/command_line_interface.html#sec:command_line_warnings in the Gradle documentation.
BUILD FAILED in 37m 50s
8 actionable tasks: 5 executed, 1 from cache, 2 up-to-date
Publishing build scan...
https://ge.apache.org/s/4uioaaoz4mkto
Build step 'Invoke Gradle script' changed build result to FAILURE
Build step 'Invoke Gradle script' marked build as failure
---------------------------------------------------------------------
To unsubscribe, e-mail: builds-unsubscribe@beam.apache.org
For additional commands, e-mail: builds-help@beam.apache.org
Build failed in Jenkins: beam_PostCommit_Java_ValidatesRunner_Flink_Java11 #5201
Posted by Apache Jenkins Server <je...@builds.apache.org>.
See <https://ci-beam.apache.org/job/beam_PostCommit_Java_ValidatesRunner_Flink_Java11/5201/display/redirect>
Changes:
------------------------------------------
[...truncated 2.69 KB...]
To honour the JVM settings for this build a single-use Daemon process will be forked. For more on this, please refer to https://docs.gradle.org/8.4/userguide/gradle_daemon.html#sec:disabling_the_daemon in the Gradle documentation.
Daemon will be stopped at the end of the build
Configuration on demand is an incubating feature.
Gradle Enterprise plugins resolution: https://plugins.gradle.org/m2
Enforcing Gradle Enterprise: https://ge.apache.org, allowUntrustedServer: false
> Task :buildSrc:compileJava NO-SOURCE
> Task :buildSrc:compileGroovy FROM-CACHE
> Task :buildSrc:pluginDescriptors
> Task :buildSrc:processResources
> Task :buildSrc:classes
> Task :buildSrc:jar
> Task :runners:core-java:createCheckerFrameworkManifest
> Task :model:fn-execution:createCheckerFrameworkManifest
> Task :sdks:java:core:createCheckerFrameworkManifest
> Task :runners:java-fn-execution:createCheckerFrameworkManifest
> Task :model:pipeline:createCheckerFrameworkManifest
> Task :runners:core-java:processResources NO-SOURCE
> Task :runners:java-fn-execution:processResources NO-SOURCE
> Task :model:job-management:createCheckerFrameworkManifest
> Task :sdks:java:expansion-service:createCheckerFrameworkManifest
> Task :sdks:java:extensions:avro:createCheckerFrameworkManifest
> Task :sdks:java:transform-service:launcher:createCheckerFrameworkManifest
> Task :sdks:java:expansion-service:processResources NO-SOURCE
> Task :runners:core-java:processTestResources NO-SOURCE
> Task :sdks:java:harness:createCheckerFrameworkManifest
> Task :sdks:java:fn-execution:createCheckerFrameworkManifest
> Task :runners:core-construction-java:createCheckerFrameworkManifest
> Task :sdks:java:extensions:avro:generateAvroProtocol NO-SOURCE
> Task :sdks:java:harness:processResources NO-SOURCE
> Task :sdks:java:extensions:google-cloud-platform-core:createCheckerFrameworkManifest
> Task :runners:java-job-service:createCheckerFrameworkManifest
> Task :sdks:java:fn-execution:processResources NO-SOURCE
> Task :sdks:java:extensions:google-cloud-platform-core:processResources NO-SOURCE
> Task :sdks:java:extensions:avro:generateAvroJava NO-SOURCE
> Task :sdks:java:build-tools:createCheckerFrameworkManifest
> Task :runners:core-construction-java:processResources NO-SOURCE
> Task :runners:java-job-service:processResources NO-SOURCE
> Task :sdks:java:extensions:avro:processResources NO-SOURCE
> Task :model:fn-execution:extractProto
> Task :model:job-management:extractProto
> Task :runners:flink:1.15:copySourceOverrides
> Task :sdks:java:io:google-cloud-platform:createCheckerFrameworkManifest
> Task :sdks:java:extensions:arrow:createCheckerFrameworkManifest
> Task :sdks:java:extensions:protobuf:createCheckerFrameworkManifest
> Task :sdks:java:extensions:arrow:processResources NO-SOURCE
> Task :sdks:java:core:generateGrammarSource FROM-CACHE
> Task :sdks:java:io:google-cloud-platform:processResources NO-SOURCE
> Task :runners:flink:1.15:createCheckerFrameworkManifest
> Task :sdks:java:extensions:protobuf:extractProto
> Task :model:job-management:processResources
> Task :runners:flink:1.15:copyResourcesOverrides NO-SOURCE
> Task :sdks:java:extensions:protobuf:processResources NO-SOURCE
> Task :model:fn-execution:processResources
> Task :runners:flink:1.15:processResources
> Task :runners:flink:1.15:copyTestSourceOverrides
> Task :sdks:java:core:processResources
> Task :runners:flink:1.15:copyTestResourcesOverrides NO-SOURCE
> Task :sdks:java:core:generateTestGrammarSource NO-SOURCE
> Task :runners:flink:1.15:processTestResources
> Task :sdks:java:core:processTestResources
> Task :sdks:java:transform-service:launcher:compileJava FROM-CACHE
> Task :sdks:java:transform-service:launcher:processResources
> Task :sdks:java:transform-service:launcher:classes
> Task :sdks:java:transform-service:launcher:jar
> Task :sdks:java:transform-service:launcher:shadowJar FROM-CACHE
> Task :model:pipeline:extractIncludeProto
> Task :model:pipeline:extractProto
> Task :model:pipeline:generateProto FROM-CACHE
> Task :sdks:java:build-tools:compileJava FROM-CACHE
> Task :sdks:java:build-tools:processResources
> Task :sdks:java:build-tools:classes
> Task :sdks:java:build-tools:jar
> Task :model:pipeline:compileJava FROM-CACHE
> Task :model:pipeline:processResources
> Task :model:pipeline:classes
> Task :model:pipeline:jar
> Task :model:pipeline:shadowJar FROM-CACHE
> Task :model:job-management:extractIncludeProto
> Task :model:fn-execution:extractIncludeProto
> Task :model:job-management:generateProto FROM-CACHE
> Task :model:fn-execution:generateProto FROM-CACHE
> Task :model:job-management:compileJava FROM-CACHE
> Task :model:job-management:classes
> Task :model:fn-execution:compileJava FROM-CACHE
> Task :model:fn-execution:classes
> Task :model:job-management:shadowJar FROM-CACHE
> Task :model:fn-execution:shadowJar FROM-CACHE
> Task :sdks:java:core:compileJava FROM-CACHE
> Task :sdks:java:core:classes
> Task :sdks:java:core:shadowJar FROM-CACHE
> Task :sdks:java:extensions:protobuf:extractIncludeProto
> Task :sdks:java:extensions:protobuf:generateProto NO-SOURCE
> Task :sdks:java:extensions:protobuf:compileJava FROM-CACHE
> Task :sdks:java:extensions:protobuf:classes UP-TO-DATE
> Task :sdks:java:extensions:arrow:compileJava FROM-CACHE
> Task :sdks:java:extensions:arrow:classes UP-TO-DATE
> Task :sdks:java:extensions:protobuf:jar
> Task :sdks:java:extensions:arrow:jar
> Task :sdks:java:extensions:avro:compileJava FROM-CACHE
> Task :sdks:java:extensions:avro:classes UP-TO-DATE
> Task :sdks:java:fn-execution:compileJava FROM-CACHE
> Task :sdks:java:fn-execution:classes UP-TO-DATE
> Task :sdks:java:extensions:avro:jar
> Task :sdks:java:fn-execution:jar
> Task :runners:core-construction-java:compileJava FROM-CACHE
> Task :runners:core-construction-java:classes UP-TO-DATE
> Task :runners:core-construction-java:jar
> Task :runners:core-java:compileJava FROM-CACHE
> Task :runners:core-java:classes UP-TO-DATE
> Task :sdks:java:core:compileTestJava FROM-CACHE
> Task :sdks:java:core:testClasses
> Task :runners:core-java:jar
> Task :sdks:java:core:shadowTestJar FROM-CACHE
> Task :sdks:java:extensions:google-cloud-platform-core:compileJava FROM-CACHE
> Task :sdks:java:extensions:google-cloud-platform-core:classes UP-TO-DATE
> Task :sdks:java:extensions:google-cloud-platform-core:jar
> Task :sdks:java:harness:compileJava FROM-CACHE
> Task :sdks:java:harness:classes UP-TO-DATE
> Task :sdks:java:harness:jar
> Task :runners:core-java:compileTestJava FROM-CACHE
> Task :runners:core-java:testClasses UP-TO-DATE
> Task :runners:java-fn-execution:compileJava FROM-CACHE
> Task :runners:java-fn-execution:classes UP-TO-DATE
> Task :runners:java-fn-execution:jar
> Task :runners:core-java:testJar
> Task :sdks:java:expansion-service:compileJava FROM-CACHE
> Task :sdks:java:expansion-service:classes UP-TO-DATE
> Task :sdks:java:expansion-service:jar
> Task :runners:java-job-service:compileJava FROM-CACHE
> Task :runners:java-job-service:classes UP-TO-DATE
> Task :runners:java-job-service:jar
> Task :sdks:java:io:google-cloud-platform:compileJava FROM-CACHE
> Task :runners:flink:1.15:compileJava FROM-CACHE
> Task :sdks:java:io:google-cloud-platform:classes UP-TO-DATE
> Task :runners:flink:1.15:classes
> Task :runners:flink:1.15:jar
> Task :sdks:java:io:google-cloud-platform:jar
> Task :runners:flink:1.15:compileTestJava FROM-CACHE
> Task :runners:flink:1.15:testClasses
> Task :runners:flink:1.15:testJar
Deprecated Gradle features were used in this build, making it incompatible with Gradle 9.0.
You can use '--warning-mode all' to show the individual deprecation warnings and determine if they come from your own scripts or plugins.
For more on this, please refer to https://docs.gradle.org/8.4/userguide/command_line_interface.html#sec:command_line_warnings in the Gradle documentation.
BUILD SUCCESSFUL in 27s
92 actionable tasks: 59 executed, 33 from cache
Publishing build scan...
https://ge.apache.org/s/5oa4jthtzksta
Build step 'Invoke Gradle script' changed build result to SUCCESS
[Gradle] - Launching build.
[src] $ <https://ci-beam.apache.org/job/beam_PostCommit_Java_ValidatesRunner_Flink_Java11/ws/src/gradlew> -x shadowJar -x shadowTestJar -x compileJava -x compileTestJava -x jar -x testJar -x classes -x testClasses -Dorg.gradle.java.home=/usr/lib/jvm/java-11-openjdk-amd64 --continue --max-workers=12 -Dorg.gradle.jvmargs=-Xms2g -Dorg.gradle.jvmargs=-Xmx6g -Dorg.gradle.vfs.watch=false -Pdocker-pull-licenses :runners:flink:1.15:validatesRunner
To honour the JVM settings for this build a single-use Daemon process will be forked. For more on this, please refer to https://docs.gradle.org/8.4/userguide/gradle_daemon.html#sec:disabling_the_daemon in the Gradle documentation.
Daemon will be stopped at the end of the build
Configuration on demand is an incubating feature.
Gradle Enterprise plugins resolution: https://plugins.gradle.org/m2
Enforcing Gradle Enterprise: https://ge.apache.org, allowUntrustedServer: false
> Task :buildSrc:compileJava NO-SOURCE
> Task :buildSrc:compileGroovy FROM-CACHE
> Task :buildSrc:pluginDescriptors UP-TO-DATE
> Task :buildSrc:processResources UP-TO-DATE
> Task :buildSrc:classes UP-TO-DATE
> Task :buildSrc:jar
> Task :runners:flink:1.15:validatesRunnerBatch
WARNING: An illegal reflective access operation has occurred
WARNING: Illegal reflective access by org.apache.flink.api.java.ClosureCleaner (file:/home/jenkins/.gradle/caches/modules-2/files-2.1/org.apache.flink/flink-core/1.15.0/41836e7311354a678c72284a81fde0d0c48ed905/flink-core-1.15.0.jar) to field java.lang.String.value
WARNING: Please consider reporting this to the maintainers of org.apache.flink.api.java.ClosureCleaner
WARNING: Use --illegal-access=warn to enable warnings of further illegal reflective access operations
WARNING: All illegal access operations will be denied in a future release
WARNING: An illegal reflective access operation has occurred
WARNING: Illegal reflective access by org.apache.flink.api.java.ClosureCleaner (file:/home/jenkins/.gradle/caches/modules-2/files-2.1/org.apache.flink/flink-core/1.15.0/41836e7311354a678c72284a81fde0d0c48ed905/flink-core-1.15.0.jar) to field java.lang.String.value
WARNING: Please consider reporting this to the maintainers of org.apache.flink.api.java.ClosureCleaner
WARNING: Use --illegal-access=warn to enable warnings of further illegal reflective access operations
WARNING: All illegal access operations will be denied in a future release
WARNING: An illegal reflective access operation has occurred
WARNING: Illegal reflective access by org.apache.flink.api.java.ClosureCleaner (file:/home/jenkins/.gradle/caches/modules-2/files-2.1/org.apache.flink/flink-core/1.15.0/41836e7311354a678c72284a81fde0d0c48ed905/flink-core-1.15.0.jar) to field java.lang.String.value
WARNING: Please consider reporting this to the maintainers of org.apache.flink.api.java.ClosureCleaner
WARNING: Use --illegal-access=warn to enable warnings of further illegal reflective access operations
WARNING: All illegal access operations will be denied in a future release
> Task :runners:flink:1.15:validatesRunnerBatchWithDataStream
org.apache.beam.sdk.transforms.ViewTest > testTriggeredLatestSingleton FAILED
org.apache.beam.sdk.Pipeline$PipelineExecutionException at ViewTest.java:330
Caused by: java.lang.IllegalArgumentException at PCollectionViews.java:412
294 tests completed, 1 failed, 1 skipped
> Task :runners:flink:1.15:validatesRunnerBatchWithDataStream FAILED
WARNING: An illegal reflective access operation has occurred
WARNING: Illegal reflective access by org.apache.flink.api.java.ClosureCleaner (file:/home/jenkins/.gradle/caches/modules-2/files-2.1/org.apache.flink/flink-core/1.15.0/41836e7311354a678c72284a81fde0d0c48ed905/flink-core-1.15.0.jar) to field java.lang.String.value
WARNING: Please consider reporting this to the maintainers of org.apache.flink.api.java.ClosureCleaner
WARNING: Use --illegal-access=warn to enable warnings of further illegal reflective access operations
WARNING: All illegal access operations will be denied in a future release
WARNING: An illegal reflective access operation has occurred
WARNING: Illegal reflective access by org.apache.flink.api.java.ClosureCleaner (file:/home/jenkins/.gradle/caches/modules-2/files-2.1/org.apache.flink/flink-core/1.15.0/41836e7311354a678c72284a81fde0d0c48ed905/flink-core-1.15.0.jar) to field java.lang.String.value
WARNING: Please consider reporting this to the maintainers of org.apache.flink.api.java.ClosureCleaner
WARNING: Use --illegal-access=warn to enable warnings of further illegal reflective access operations
WARNING: All illegal access operations will be denied in a future release
> Task :runners:flink:1.15:validatesRunnerStreaming
org.apache.beam.sdk.transforms.ParDoLifecycleTest > testTeardownCalledAfterExceptionInStartBundleStateful FAILED
java.lang.AssertionError at Assert.java:89
324 tests completed, 1 failed, 2 skipped
> Task :runners:flink:1.15:validatesRunnerStreaming FAILED
WARNING: An illegal reflective access operation has occurred
WARNING: Illegal reflective access by org.apache.flink.api.java.ClosureCleaner (file:/home/jenkins/.gradle/caches/modules-2/files-2.1/org.apache.flink/flink-core/1.15.0/41836e7311354a678c72284a81fde0d0c48ed905/flink-core-1.15.0.jar) to field java.lang.String.value
WARNING: Please consider reporting this to the maintainers of org.apache.flink.api.java.ClosureCleaner
WARNING: Use --illegal-access=warn to enable warnings of further illegal reflective access operations
WARNING: All illegal access operations will be denied in a future release
> Task :runners:flink:1.15:validatesRunnerStreamingCheckpointing
FAILURE: Build completed with 2 failures.
1: Task failed with an exception.
-----------
* What went wrong:
Execution failed for task ':runners:flink:1.15:validatesRunnerBatchWithDataStream'.
> There were failing tests. See the report at: file://<https://ci-beam.apache.org/job/beam_PostCommit_Java_ValidatesRunner_Flink_Java11/ws/src/runners/flink/1.15/build/reports/tests/validatesRunnerBatchWithDataStream/index.html>
==============================================================================
2: Task failed with an exception.
-----------
* What went wrong:
Execution failed for task ':runners:flink:1.15:validatesRunnerStreaming'.
> There were failing tests. See the report at: file://<https://ci-beam.apache.org/job/beam_PostCommit_Java_ValidatesRunner_Flink_Java11/ws/src/runners/flink/1.15/build/reports/tests/validatesRunnerStreaming/index.html>
==============================================================================
Deprecated Gradle features were used in this build, making it incompatible with Gradle 9.0.
You can use '--warning-mode all' to show the individual deprecation warnings and determine if they come from your own scripts or plugins.
For more on this, please refer to https://docs.gradle.org/8.4/userguide/command_line_interface.html#sec:command_line_warnings in the Gradle documentation.
BUILD FAILED in 38m 47s
8 actionable tasks: 5 executed, 1 from cache, 2 up-to-date
Publishing build scan...
https://ge.apache.org/s/bmlp55mgilwfy
Build step 'Invoke Gradle script' changed build result to FAILURE
Build step 'Invoke Gradle script' marked build as failure
---------------------------------------------------------------------
To unsubscribe, e-mail: builds-unsubscribe@beam.apache.org
For additional commands, e-mail: builds-help@beam.apache.org
Build failed in Jenkins: beam_PostCommit_Java_ValidatesRunner_Flink_Java11 #5200
Posted by Apache Jenkins Server <je...@builds.apache.org>.
See <https://ci-beam.apache.org/job/beam_PostCommit_Java_ValidatesRunner_Flink_Java11/5200/display/redirect>
Changes:
------------------------------------------
[...truncated 1.72 KB...]
> git config core.sparsecheckout # timeout=10
> git checkout -f 06265f9087702cd587967ce46ff66d9e0898332d # timeout=10
Commit message: "Update splittable-do-fn.md with links to doc (#29458)"
> git rev-list --no-walk 6235a0c9f050859695ad0e5a2db5f695b05b0fb7 # timeout=10
First time build. Skipping changelog.
No emails were triggered.
[EnvInject] - Executing scripts and injecting environment variables after the SCM step.
[EnvInject] - Injecting as environment variables the properties content
SETUPTOOLS_USE_DISTUTILS=stdlib
SPARK_LOCAL_IP=127.0.0.1
[EnvInject] - Variables injected successfully.
[Gradle] - Launching build.
[src] $ <https://ci-beam.apache.org/job/beam_PostCommit_Java_ValidatesRunner_Flink_Java11/ws/src/gradlew> -Dorg.gradle.java.home=/usr/lib/jvm/java-8-openjdk-amd64 :runners:flink:1.15:jar :runners:flink:1.15:testJar
To honour the JVM settings for this build a single-use Daemon process will be forked. For more on this, please refer to https://docs.gradle.org/8.4/userguide/gradle_daemon.html#sec:disabling_the_daemon in the Gradle documentation.
Daemon will be stopped at the end of the build
Configuration on demand is an incubating feature.
Gradle Enterprise plugins resolution: https://plugins.gradle.org/m2
Enforcing Gradle Enterprise: https://ge.apache.org, allowUntrustedServer: false
> Task :buildSrc:compileJava NO-SOURCE
> Task :buildSrc:compileGroovy FROM-CACHE
> Task :buildSrc:pluginDescriptors
> Task :buildSrc:processResources
> Task :buildSrc:classes
> Task :buildSrc:jar
> Task :sdks:java:harness:createCheckerFrameworkManifest
> Task :model:job-management:createCheckerFrameworkManifest
> Task :runners:core-construction-java:createCheckerFrameworkManifest
> Task :runners:java-fn-execution:createCheckerFrameworkManifest
> Task :runners:java-job-service:createCheckerFrameworkManifest
> Task :sdks:java:extensions:avro:createCheckerFrameworkManifest
> Task :model:fn-execution:createCheckerFrameworkManifest
> Task :model:pipeline:createCheckerFrameworkManifest
> Task :sdks:java:transform-service:launcher:createCheckerFrameworkManifest
> Task :runners:core-java:createCheckerFrameworkManifest
> Task :sdks:java:expansion-service:createCheckerFrameworkManifest
> Task :sdks:java:core:createCheckerFrameworkManifest
> Task :sdks:java:fn-execution:createCheckerFrameworkManifest
> Task :sdks:java:build-tools:createCheckerFrameworkManifest
> Task :sdks:java:extensions:avro:generateAvroProtocol NO-SOURCE
> Task :runners:java-fn-execution:processResources NO-SOURCE
> Task :sdks:java:harness:processResources NO-SOURCE
> Task :sdks:java:expansion-service:processResources NO-SOURCE
> Task :runners:core-java:processResources NO-SOURCE
> Task :sdks:java:extensions:google-cloud-platform-core:createCheckerFrameworkManifest
> Task :runners:core-construction-java:processResources NO-SOURCE
> Task :sdks:java:fn-execution:processResources NO-SOURCE
> Task :sdks:java:extensions:avro:generateAvroJava NO-SOURCE
> Task :runners:java-job-service:processResources NO-SOURCE
> Task :sdks:java:extensions:avro:processResources NO-SOURCE
> Task :runners:core-java:processTestResources NO-SOURCE
> Task :runners:flink:1.15:copySourceOverrides
> Task :sdks:java:extensions:google-cloud-platform-core:processResources NO-SOURCE
> Task :model:fn-execution:extractProto
> Task :model:job-management:extractProto
> Task :sdks:java:extensions:protobuf:createCheckerFrameworkManifest
> Task :sdks:java:extensions:arrow:createCheckerFrameworkManifest
> Task :sdks:java:core:generateGrammarSource FROM-CACHE
> Task :sdks:java:io:google-cloud-platform:createCheckerFrameworkManifest
> Task :runners:flink:1.15:createCheckerFrameworkManifest
> Task :sdks:java:extensions:arrow:processResources NO-SOURCE
> Task :runners:flink:1.15:copyResourcesOverrides NO-SOURCE
> Task :sdks:java:io:google-cloud-platform:processResources NO-SOURCE
> Task :sdks:java:extensions:protobuf:extractProto
> Task :model:fn-execution:processResources
> Task :model:job-management:processResources
> Task :sdks:java:extensions:protobuf:processResources NO-SOURCE
> Task :runners:flink:1.15:processResources
> Task :sdks:java:core:processResources
> Task :runners:flink:1.15:copyTestSourceOverrides
> Task :sdks:java:core:generateTestGrammarSource NO-SOURCE
> Task :runners:flink:1.15:copyTestResourcesOverrides NO-SOURCE
> Task :runners:flink:1.15:processTestResources
> Task :sdks:java:core:processTestResources
> Task :sdks:java:transform-service:launcher:compileJava FROM-CACHE
> Task :sdks:java:build-tools:compileJava FROM-CACHE
> Task :sdks:java:transform-service:launcher:processResources
> Task :sdks:java:transform-service:launcher:classes
> Task :sdks:java:build-tools:processResources
> Task :sdks:java:build-tools:classes
> Task :sdks:java:transform-service:launcher:jar
> Task :sdks:java:build-tools:jar
> Task :sdks:java:transform-service:launcher:shadowJar FROM-CACHE
> Task :model:pipeline:extractIncludeProto
> Task :model:pipeline:extractProto
> Task :model:pipeline:generateProto FROM-CACHE
> Task :model:pipeline:compileJava FROM-CACHE
> Task :model:pipeline:processResources
> Task :model:pipeline:classes
> Task :model:pipeline:jar
> Task :model:pipeline:shadowJar FROM-CACHE
> Task :model:job-management:extractIncludeProto
> Task :model:fn-execution:extractIncludeProto
> Task :model:job-management:generateProto FROM-CACHE
> Task :model:fn-execution:generateProto FROM-CACHE
> Task :model:job-management:compileJava FROM-CACHE
> Task :model:job-management:classes
> Task :model:fn-execution:compileJava FROM-CACHE
> Task :model:fn-execution:classes
> Task :model:job-management:shadowJar FROM-CACHE
> Task :model:fn-execution:shadowJar FROM-CACHE
> Task :sdks:java:core:compileJava FROM-CACHE
> Task :sdks:java:core:classes
> Task :sdks:java:core:shadowJar FROM-CACHE
> Task :sdks:java:extensions:protobuf:extractIncludeProto
> Task :sdks:java:extensions:protobuf:generateProto NO-SOURCE
> Task :sdks:java:extensions:avro:compileJava FROM-CACHE
> Task :sdks:java:extensions:avro:classes UP-TO-DATE
> Task :sdks:java:extensions:protobuf:compileJava FROM-CACHE
> Task :sdks:java:extensions:protobuf:classes UP-TO-DATE
> Task :sdks:java:extensions:arrow:compileJava FROM-CACHE
> Task :sdks:java:extensions:arrow:classes UP-TO-DATE
> Task :sdks:java:extensions:protobuf:jar
> Task :sdks:java:extensions:arrow:jar
> Task :sdks:java:extensions:avro:jar
> Task :sdks:java:fn-execution:compileJava FROM-CACHE
> Task :sdks:java:fn-execution:classes UP-TO-DATE
> Task :sdks:java:fn-execution:jar
> Task :runners:core-construction-java:compileJava FROM-CACHE
> Task :runners:core-construction-java:classes UP-TO-DATE
> Task :runners:core-construction-java:jar
> Task :runners:core-java:compileJava FROM-CACHE
> Task :runners:core-java:classes UP-TO-DATE
> Task :sdks:java:core:compileTestJava FROM-CACHE
> Task :sdks:java:core:testClasses
> Task :runners:core-java:jar
> Task :sdks:java:extensions:google-cloud-platform-core:compileJava FROM-CACHE
> Task :sdks:java:extensions:google-cloud-platform-core:classes UP-TO-DATE
> Task :sdks:java:extensions:google-cloud-platform-core:jar
> Task :sdks:java:core:shadowTestJar FROM-CACHE
> Task :sdks:java:harness:compileJava FROM-CACHE
> Task :sdks:java:harness:classes UP-TO-DATE
> Task :sdks:java:harness:jar
> Task :runners:java-fn-execution:compileJava FROM-CACHE
> Task :runners:java-fn-execution:classes UP-TO-DATE
> Task :runners:java-fn-execution:jar
> Task :runners:core-java:compileTestJava FROM-CACHE
> Task :runners:core-java:testClasses UP-TO-DATE
> Task :runners:core-java:testJar
> Task :sdks:java:expansion-service:compileJava FROM-CACHE
> Task :sdks:java:expansion-service:classes UP-TO-DATE
> Task :sdks:java:expansion-service:jar
> Task :runners:java-job-service:compileJava FROM-CACHE
> Task :runners:java-job-service:classes UP-TO-DATE
> Task :runners:java-job-service:jar
> Task :runners:flink:1.15:compileJava FROM-CACHE
> Task :runners:flink:1.15:classes
> Task :runners:flink:1.15:jar
> Task :sdks:java:io:google-cloud-platform:compileJava FROM-CACHE
> Task :sdks:java:io:google-cloud-platform:classes UP-TO-DATE
> Task :sdks:java:io:google-cloud-platform:jar
> Task :runners:flink:1.15:compileTestJava FROM-CACHE
> Task :runners:flink:1.15:testClasses
> Task :runners:flink:1.15:testJar
Deprecated Gradle features were used in this build, making it incompatible with Gradle 9.0.
You can use '--warning-mode all' to show the individual deprecation warnings and determine if they come from your own scripts or plugins.
For more on this, please refer to https://docs.gradle.org/8.4/userguide/command_line_interface.html#sec:command_line_warnings in the Gradle documentation.
BUILD SUCCESSFUL in 28s
92 actionable tasks: 59 executed, 33 from cache
Publishing build scan...
https://ge.apache.org/s/udf3xm6gwqzci
Build step 'Invoke Gradle script' changed build result to SUCCESS
[Gradle] - Launching build.
[src] $ <https://ci-beam.apache.org/job/beam_PostCommit_Java_ValidatesRunner_Flink_Java11/ws/src/gradlew> -x shadowJar -x shadowTestJar -x compileJava -x compileTestJava -x jar -x testJar -x classes -x testClasses -Dorg.gradle.java.home=/usr/lib/jvm/java-11-openjdk-amd64 --continue --max-workers=12 -Dorg.gradle.jvmargs=-Xms2g -Dorg.gradle.jvmargs=-Xmx6g -Dorg.gradle.vfs.watch=false -Pdocker-pull-licenses :runners:flink:1.15:validatesRunner
To honour the JVM settings for this build a single-use Daemon process will be forked. For more on this, please refer to https://docs.gradle.org/8.4/userguide/gradle_daemon.html#sec:disabling_the_daemon in the Gradle documentation.
Daemon will be stopped at the end of the build
Configuration on demand is an incubating feature.
Gradle Enterprise plugins resolution: https://plugins.gradle.org/m2
Enforcing Gradle Enterprise: https://ge.apache.org, allowUntrustedServer: false
> Task :buildSrc:compileJava NO-SOURCE
> Task :buildSrc:compileGroovy FROM-CACHE
> Task :buildSrc:pluginDescriptors UP-TO-DATE
> Task :buildSrc:processResources UP-TO-DATE
> Task :buildSrc:classes UP-TO-DATE
> Task :buildSrc:jar
> Task :runners:flink:1.15:validatesRunnerBatch
WARNING: An illegal reflective access operation has occurred
WARNING: Illegal reflective access by org.apache.flink.api.java.ClosureCleaner (file:/home/jenkins/.gradle/caches/modules-2/files-2.1/org.apache.flink/flink-core/1.15.0/41836e7311354a678c72284a81fde0d0c48ed905/flink-core-1.15.0.jar) to field java.lang.String.value
WARNING: Please consider reporting this to the maintainers of org.apache.flink.api.java.ClosureCleaner
WARNING: Use --illegal-access=warn to enable warnings of further illegal reflective access operations
WARNING: All illegal access operations will be denied in a future release
WARNING: An illegal reflective access operation has occurred
WARNING: Illegal reflective access by org.apache.flink.api.java.ClosureCleaner (file:/home/jenkins/.gradle/caches/modules-2/files-2.1/org.apache.flink/flink-core/1.15.0/41836e7311354a678c72284a81fde0d0c48ed905/flink-core-1.15.0.jar) to field java.lang.String.value
WARNING: Please consider reporting this to the maintainers of org.apache.flink.api.java.ClosureCleaner
WARNING: Use --illegal-access=warn to enable warnings of further illegal reflective access operations
WARNING: All illegal access operations will be denied in a future release
WARNING: An illegal reflective access operation has occurred
WARNING: Illegal reflective access by org.apache.flink.api.java.ClosureCleaner (file:/home/jenkins/.gradle/caches/modules-2/files-2.1/org.apache.flink/flink-core/1.15.0/41836e7311354a678c72284a81fde0d0c48ed905/flink-core-1.15.0.jar) to field java.lang.String.value
WARNING: Please consider reporting this to the maintainers of org.apache.flink.api.java.ClosureCleaner
WARNING: Use --illegal-access=warn to enable warnings of further illegal reflective access operations
WARNING: All illegal access operations will be denied in a future release
> Task :runners:flink:1.15:validatesRunnerBatchWithDataStream
WARNING: An illegal reflective access operation has occurred
WARNING: Illegal reflective access by org.apache.flink.api.java.ClosureCleaner (file:/home/jenkins/.gradle/caches/modules-2/files-2.1/org.apache.flink/flink-core/1.15.0/41836e7311354a678c72284a81fde0d0c48ed905/flink-core-1.15.0.jar) to field java.lang.String.value
WARNING: Please consider reporting this to the maintainers of org.apache.flink.api.java.ClosureCleaner
WARNING: Use --illegal-access=warn to enable warnings of further illegal reflective access operations
WARNING: All illegal access operations will be denied in a future release
WARNING: An illegal reflective access operation has occurred
WARNING: Illegal reflective access by org.apache.flink.api.java.ClosureCleaner (file:/home/jenkins/.gradle/caches/modules-2/files-2.1/org.apache.flink/flink-core/1.15.0/41836e7311354a678c72284a81fde0d0c48ed905/flink-core-1.15.0.jar) to field java.lang.String.value
WARNING: Please consider reporting this to the maintainers of org.apache.flink.api.java.ClosureCleaner
WARNING: Use --illegal-access=warn to enable warnings of further illegal reflective access operations
WARNING: All illegal access operations will be denied in a future release
> Task :runners:flink:1.15:validatesRunnerStreaming
org.apache.beam.sdk.transforms.GroupByKeyTest > org.apache.beam.sdk.transforms.GroupByKeyTest$BasicTests.testAfterProcessingTimeContinuationTriggerUsingState FAILED
java.lang.AssertionError at GroupByKeyTest.java:302
Caused by: java.lang.AssertionError at MatcherAssert.java:18
org.apache.beam.sdk.transforms.ParDoLifecycleTest > testTeardownCalledAfterExceptionInStartBundleStateful FAILED
java.lang.AssertionError at Assert.java:89
324 tests completed, 2 failed, 2 skipped
> Task :runners:flink:1.15:validatesRunnerStreaming FAILED
WARNING: An illegal reflective access operation has occurred
WARNING: Illegal reflective access by org.apache.flink.api.java.ClosureCleaner (file:/home/jenkins/.gradle/caches/modules-2/files-2.1/org.apache.flink/flink-core/1.15.0/41836e7311354a678c72284a81fde0d0c48ed905/flink-core-1.15.0.jar) to field java.lang.String.value
WARNING: Please consider reporting this to the maintainers of org.apache.flink.api.java.ClosureCleaner
WARNING: Use --illegal-access=warn to enable warnings of further illegal reflective access operations
WARNING: All illegal access operations will be denied in a future release
> Task :runners:flink:1.15:validatesRunnerStreamingCheckpointing
FAILURE: Build failed with an exception.
* What went wrong:
Execution failed for task ':runners:flink:1.15:validatesRunnerStreaming'.
> There were failing tests. See the report at: file://<https://ci-beam.apache.org/job/beam_PostCommit_Java_ValidatesRunner_Flink_Java11/ws/src/runners/flink/1.15/build/reports/tests/validatesRunnerStreaming/index.html>
Deprecated Gradle features were used in this build, making it incompatible with Gradle 9.0.
You can use '--warning-mode all' to show the individual deprecation warnings and determine if they come from your own scripts or plugins.
For more on this, please refer to https://docs.gradle.org/8.4/userguide/command_line_interface.html#sec:command_line_warnings in the Gradle documentation.
BUILD FAILED in 38m 52s
8 actionable tasks: 5 executed, 1 from cache, 2 up-to-date
Publishing build scan...
https://ge.apache.org/s/iavx7bncjqjla
Build step 'Invoke Gradle script' changed build result to FAILURE
Build step 'Invoke Gradle script' marked build as failure
---------------------------------------------------------------------
To unsubscribe, e-mail: builds-unsubscribe@beam.apache.org
For additional commands, e-mail: builds-help@beam.apache.org
Build failed in Jenkins: beam_PostCommit_Java_ValidatesRunner_Flink_Java11 #5199
Posted by Apache Jenkins Server <je...@builds.apache.org>.
See <https://ci-beam.apache.org/job/beam_PostCommit_Java_ValidatesRunner_Flink_Java11/5199/display/redirect>
Changes:
------------------------------------------
[...truncated 3.25 KB...]
Enforcing Gradle Enterprise: https://ge.apache.org, allowUntrustedServer: false
> Task :buildSrc:compileJava NO-SOURCE
> Task :buildSrc:compileGroovy FROM-CACHE
> Task :buildSrc:pluginDescriptors
> Task :buildSrc:processResources
> Task :buildSrc:classes
> Task :buildSrc:jar
> Task :model:fn-execution:createCheckerFrameworkManifest
> Task :sdks:java:core:createCheckerFrameworkManifest
> Task :runners:java-fn-execution:createCheckerFrameworkManifest
> Task :sdks:java:fn-execution:createCheckerFrameworkManifest
> Task :sdks:java:transform-service:launcher:createCheckerFrameworkManifest
> Task :runners:core-java:createCheckerFrameworkManifest
> Task :sdks:java:extensions:google-cloud-platform-core:createCheckerFrameworkManifest
> Task :sdks:java:extensions:avro:createCheckerFrameworkManifest
> Task :model:pipeline:createCheckerFrameworkManifest
> Task :sdks:java:harness:createCheckerFrameworkManifest
> Task :sdks:java:expansion-service:createCheckerFrameworkManifest
> Task :sdks:java:build-tools:createCheckerFrameworkManifest
> Task :runners:core-construction-java:createCheckerFrameworkManifest
> Task :model:job-management:createCheckerFrameworkManifest
> Task :runners:java-job-service:createCheckerFrameworkManifest
> Task :sdks:java:fn-execution:processResources NO-SOURCE
> Task :sdks:java:extensions:avro:generateAvroProtocol NO-SOURCE
> Task :sdks:java:harness:processResources NO-SOURCE
> Task :runners:core-construction-java:processResources NO-SOURCE
> Task :runners:flink:1.15:copySourceOverrides
> Task :sdks:java:extensions:google-cloud-platform-core:processResources NO-SOURCE
> Task :runners:core-java:processResources NO-SOURCE
> Task :sdks:java:expansion-service:processResources NO-SOURCE
> Task :runners:java-job-service:processResources NO-SOURCE
> Task :runners:java-fn-execution:processResources NO-SOURCE
> Task :sdks:java:extensions:avro:generateAvroJava NO-SOURCE
> Task :model:fn-execution:extractProto
> Task :runners:core-java:processTestResources NO-SOURCE
> Task :model:job-management:extractProto
> Task :sdks:java:extensions:avro:processResources NO-SOURCE
> Task :sdks:java:extensions:protobuf:createCheckerFrameworkManifest
> Task :sdks:java:io:google-cloud-platform:createCheckerFrameworkManifest
> Task :sdks:java:extensions:protobuf:extractProto
> Task :sdks:java:extensions:arrow:createCheckerFrameworkManifest
> Task :sdks:java:core:generateGrammarSource FROM-CACHE
> Task :model:fn-execution:processResources
> Task :sdks:java:extensions:arrow:processResources NO-SOURCE
> Task :runners:flink:1.15:createCheckerFrameworkManifest
> Task :sdks:java:io:google-cloud-platform:processResources NO-SOURCE
> Task :runners:flink:1.15:copyResourcesOverrides NO-SOURCE
> Task :model:job-management:processResources
> Task :sdks:java:extensions:protobuf:processResources NO-SOURCE
> Task :runners:flink:1.15:processResources
> Task :runners:flink:1.15:copyTestSourceOverrides
> Task :runners:flink:1.15:copyTestResourcesOverrides NO-SOURCE
> Task :sdks:java:core:processResources
> Task :sdks:java:core:generateTestGrammarSource NO-SOURCE
> Task :runners:flink:1.15:processTestResources
> Task :sdks:java:core:processTestResources
> Task :sdks:java:transform-service:launcher:compileJava FROM-CACHE
> Task :sdks:java:transform-service:launcher:processResources
> Task :sdks:java:transform-service:launcher:classes
> Task :sdks:java:build-tools:compileJava FROM-CACHE
> Task :sdks:java:build-tools:processResources
> Task :sdks:java:build-tools:classes
> Task :sdks:java:transform-service:launcher:jar
> Task :sdks:java:build-tools:jar
> Task :sdks:java:transform-service:launcher:shadowJar FROM-CACHE
> Task :model:pipeline:extractIncludeProto
> Task :model:pipeline:extractProto
> Task :model:pipeline:generateProto FROM-CACHE
> Task :model:pipeline:compileJava FROM-CACHE
> Task :model:pipeline:processResources
> Task :model:pipeline:classes
> Task :model:pipeline:jar
> Task :model:pipeline:shadowJar FROM-CACHE
> Task :model:fn-execution:extractIncludeProto
> Task :model:job-management:extractIncludeProto
> Task :model:fn-execution:generateProto FROM-CACHE
> Task :model:job-management:generateProto FROM-CACHE
> Task :model:fn-execution:compileJava FROM-CACHE
> Task :model:fn-execution:classes
> Task :model:job-management:compileJava FROM-CACHE
> Task :model:job-management:classes
> Task :model:fn-execution:shadowJar FROM-CACHE
> Task :model:job-management:shadowJar FROM-CACHE
> Task :sdks:java:core:compileJava FROM-CACHE
> Task :sdks:java:core:classes
> Task :sdks:java:core:shadowJar FROM-CACHE
> Task :sdks:java:extensions:protobuf:extractIncludeProto
> Task :sdks:java:extensions:protobuf:generateProto NO-SOURCE
> Task :sdks:java:extensions:arrow:compileJava FROM-CACHE
> Task :sdks:java:extensions:arrow:classes UP-TO-DATE
> Task :sdks:java:extensions:arrow:jar
> Task :sdks:java:extensions:avro:compileJava FROM-CACHE
> Task :sdks:java:extensions:avro:classes UP-TO-DATE
> Task :sdks:java:extensions:protobuf:compileJava FROM-CACHE
> Task :sdks:java:extensions:protobuf:classes UP-TO-DATE
> Task :sdks:java:extensions:protobuf:jar
> Task :sdks:java:extensions:avro:jar
> Task :sdks:java:fn-execution:compileJava FROM-CACHE
> Task :sdks:java:fn-execution:classes UP-TO-DATE
> Task :sdks:java:fn-execution:jar
> Task :runners:core-construction-java:compileJava FROM-CACHE
> Task :runners:core-construction-java:classes UP-TO-DATE
> Task :runners:core-construction-java:jar
> Task :runners:core-java:compileJava FROM-CACHE
> Task :runners:core-java:classes UP-TO-DATE
> Task :runners:core-java:jar
> Task :sdks:java:core:compileTestJava FROM-CACHE
> Task :sdks:java:core:testClasses
> Task :sdks:java:extensions:google-cloud-platform-core:compileJava FROM-CACHE
> Task :sdks:java:extensions:google-cloud-platform-core:classes UP-TO-DATE
> Task :sdks:java:extensions:google-cloud-platform-core:jar
> Task :sdks:java:core:shadowTestJar FROM-CACHE
> Task :sdks:java:harness:compileJava FROM-CACHE
> Task :sdks:java:harness:classes UP-TO-DATE
> Task :sdks:java:harness:jar
> Task :runners:java-fn-execution:compileJava FROM-CACHE
> Task :runners:java-fn-execution:classes UP-TO-DATE
> Task :runners:core-java:compileTestJava FROM-CACHE
> Task :runners:core-java:testClasses UP-TO-DATE
> Task :runners:java-fn-execution:jar
> Task :runners:core-java:testJar
> Task :sdks:java:expansion-service:compileJava FROM-CACHE
> Task :sdks:java:expansion-service:classes UP-TO-DATE
> Task :sdks:java:expansion-service:jar
> Task :runners:java-job-service:compileJava FROM-CACHE
> Task :runners:java-job-service:classes UP-TO-DATE
> Task :runners:java-job-service:jar
> Task :runners:flink:1.15:compileJava FROM-CACHE
> Task :runners:flink:1.15:classes
> Task :runners:flink:1.15:jar
> Task :sdks:java:io:google-cloud-platform:compileJava FROM-CACHE
> Task :sdks:java:io:google-cloud-platform:classes UP-TO-DATE
> Task :sdks:java:io:google-cloud-platform:jar
> Task :runners:flink:1.15:compileTestJava FROM-CACHE
> Task :runners:flink:1.15:testClasses
> Task :runners:flink:1.15:testJar
Deprecated Gradle features were used in this build, making it incompatible with Gradle 9.0.
You can use '--warning-mode all' to show the individual deprecation warnings and determine if they come from your own scripts or plugins.
For more on this, please refer to https://docs.gradle.org/8.4/userguide/command_line_interface.html#sec:command_line_warnings in the Gradle documentation.
BUILD SUCCESSFUL in 29s
92 actionable tasks: 59 executed, 33 from cache
Publishing build scan...
https://ge.apache.org/s/s6j3sd74kg35k
Build step 'Invoke Gradle script' changed build result to SUCCESS
[Gradle] - Launching build.
[src] $ <https://ci-beam.apache.org/job/beam_PostCommit_Java_ValidatesRunner_Flink_Java11/ws/src/gradlew> -x shadowJar -x shadowTestJar -x compileJava -x compileTestJava -x jar -x testJar -x classes -x testClasses -Dorg.gradle.java.home=/usr/lib/jvm/java-11-openjdk-amd64 --continue --max-workers=12 -Dorg.gradle.jvmargs=-Xms2g -Dorg.gradle.jvmargs=-Xmx6g -Dorg.gradle.vfs.watch=false -Pdocker-pull-licenses :runners:flink:1.15:validatesRunner
To honour the JVM settings for this build a single-use Daemon process will be forked. For more on this, please refer to https://docs.gradle.org/8.4/userguide/gradle_daemon.html#sec:disabling_the_daemon in the Gradle documentation.
Daemon will be stopped at the end of the build
Configuration on demand is an incubating feature.
Gradle Enterprise plugins resolution: https://plugins.gradle.org/m2
Enforcing Gradle Enterprise: https://ge.apache.org, allowUntrustedServer: false
> Task :buildSrc:compileJava NO-SOURCE
> Task :buildSrc:compileGroovy FROM-CACHE
> Task :buildSrc:pluginDescriptors UP-TO-DATE
> Task :buildSrc:processResources UP-TO-DATE
> Task :buildSrc:classes UP-TO-DATE
> Task :buildSrc:jar
> Task :runners:flink:1.15:validatesRunnerBatch
WARNING: An illegal reflective access operation has occurred
WARNING: Illegal reflective access by org.apache.flink.api.java.ClosureCleaner (file:/home/jenkins/.gradle/caches/modules-2/files-2.1/org.apache.flink/flink-core/1.15.0/41836e7311354a678c72284a81fde0d0c48ed905/flink-core-1.15.0.jar) to field java.lang.String.value
WARNING: Please consider reporting this to the maintainers of org.apache.flink.api.java.ClosureCleaner
WARNING: Use --illegal-access=warn to enable warnings of further illegal reflective access operations
WARNING: All illegal access operations will be denied in a future release
WARNING: An illegal reflective access operation has occurred
WARNING: Illegal reflective access by org.apache.flink.api.java.ClosureCleaner (file:/home/jenkins/.gradle/caches/modules-2/files-2.1/org.apache.flink/flink-core/1.15.0/41836e7311354a678c72284a81fde0d0c48ed905/flink-core-1.15.0.jar) to field java.lang.String.value
WARNING: Please consider reporting this to the maintainers of org.apache.flink.api.java.ClosureCleaner
WARNING: Use --illegal-access=warn to enable warnings of further illegal reflective access operations
WARNING: All illegal access operations will be denied in a future release
WARNING: An illegal reflective access operation has occurred
WARNING: Illegal reflective access by org.apache.flink.api.java.ClosureCleaner (file:/home/jenkins/.gradle/caches/modules-2/files-2.1/org.apache.flink/flink-core/1.15.0/41836e7311354a678c72284a81fde0d0c48ed905/flink-core-1.15.0.jar) to field java.lang.String.value
WARNING: Please consider reporting this to the maintainers of org.apache.flink.api.java.ClosureCleaner
WARNING: Use --illegal-access=warn to enable warnings of further illegal reflective access operations
WARNING: All illegal access operations will be denied in a future release
> Task :runners:flink:1.15:validatesRunnerBatchWithDataStream
org.apache.beam.sdk.transforms.ParDoLifecycleTest > testTeardownCalledAfterExceptionInStartBundleStateful FAILED
java.lang.AssertionError at Assert.java:89
org.apache.beam.sdk.transforms.ViewTest > testTriggeredLatestSingleton FAILED
org.apache.beam.sdk.Pipeline$PipelineExecutionException at ViewTest.java:330
Caused by: java.lang.IllegalArgumentException at PCollectionViews.java:412
294 tests completed, 2 failed, 1 skipped
> Task :runners:flink:1.15:validatesRunnerBatchWithDataStream FAILED
WARNING: An illegal reflective access operation has occurred
WARNING: Illegal reflective access by org.apache.flink.api.java.ClosureCleaner (file:/home/jenkins/.gradle/caches/modules-2/files-2.1/org.apache.flink/flink-core/1.15.0/41836e7311354a678c72284a81fde0d0c48ed905/flink-core-1.15.0.jar) to field java.lang.String.value
WARNING: Please consider reporting this to the maintainers of org.apache.flink.api.java.ClosureCleaner
WARNING: Use --illegal-access=warn to enable warnings of further illegal reflective access operations
WARNING: All illegal access operations will be denied in a future release
WARNING: An illegal reflective access operation has occurred
WARNING: Illegal reflective access by org.apache.flink.api.java.ClosureCleaner (file:/home/jenkins/.gradle/caches/modules-2/files-2.1/org.apache.flink/flink-core/1.15.0/41836e7311354a678c72284a81fde0d0c48ed905/flink-core-1.15.0.jar) to field java.lang.String.value
WARNING: Please consider reporting this to the maintainers of org.apache.flink.api.java.ClosureCleaner
WARNING: Use --illegal-access=warn to enable warnings of further illegal reflective access operations
WARNING: All illegal access operations will be denied in a future release
> Task :runners:flink:1.15:validatesRunnerStreaming
org.apache.beam.sdk.transforms.GroupByKeyTest > org.apache.beam.sdk.transforms.GroupByKeyTest$BasicTests.testAfterProcessingTimeContinuationTriggerUsingState FAILED
java.lang.AssertionError at GroupByKeyTest.java:302
Caused by: java.lang.AssertionError at MatcherAssert.java:18
324 tests completed, 1 failed, 2 skipped
> Task :runners:flink:1.15:validatesRunnerStreaming FAILED
WARNING: An illegal reflective access operation has occurred
WARNING: Illegal reflective access by org.apache.flink.api.java.ClosureCleaner (file:/home/jenkins/.gradle/caches/modules-2/files-2.1/org.apache.flink/flink-core/1.15.0/41836e7311354a678c72284a81fde0d0c48ed905/flink-core-1.15.0.jar) to field java.lang.String.value
WARNING: Please consider reporting this to the maintainers of org.apache.flink.api.java.ClosureCleaner
WARNING: Use --illegal-access=warn to enable warnings of further illegal reflective access operations
WARNING: All illegal access operations will be denied in a future release
> Task :runners:flink:1.15:validatesRunnerStreamingCheckpointing
FAILURE: Build completed with 2 failures.
1: Task failed with an exception.
-----------
* What went wrong:
Execution failed for task ':runners:flink:1.15:validatesRunnerBatchWithDataStream'.
> There were failing tests. See the report at: file://<https://ci-beam.apache.org/job/beam_PostCommit_Java_ValidatesRunner_Flink_Java11/ws/src/runners/flink/1.15/build/reports/tests/validatesRunnerBatchWithDataStream/index.html>
==============================================================================
2: Task failed with an exception.
-----------
* What went wrong:
Execution failed for task ':runners:flink:1.15:validatesRunnerStreaming'.
> There were failing tests. See the report at: file://<https://ci-beam.apache.org/job/beam_PostCommit_Java_ValidatesRunner_Flink_Java11/ws/src/runners/flink/1.15/build/reports/tests/validatesRunnerStreaming/index.html>
==============================================================================
Deprecated Gradle features were used in this build, making it incompatible with Gradle 9.0.
You can use '--warning-mode all' to show the individual deprecation warnings and determine if they come from your own scripts or plugins.
For more on this, please refer to https://docs.gradle.org/8.4/userguide/command_line_interface.html#sec:command_line_warnings in the Gradle documentation.
BUILD FAILED in 43m 36s
8 actionable tasks: 5 executed, 1 from cache, 2 up-to-date
Publishing build scan...
https://ge.apache.org/s/n4vthdham6fnc
Build step 'Invoke Gradle script' changed build result to FAILURE
Build step 'Invoke Gradle script' marked build as failure
---------------------------------------------------------------------
To unsubscribe, e-mail: builds-unsubscribe@beam.apache.org
For additional commands, e-mail: builds-help@beam.apache.org
Build failed in Jenkins: beam_PostCommit_Java_ValidatesRunner_Flink_Java11 #5198
Posted by Apache Jenkins Server <je...@builds.apache.org>.
See <https://ci-beam.apache.org/job/beam_PostCommit_Java_ValidatesRunner_Flink_Java11/5198/display/redirect>
Changes:
------------------------------------------
[...truncated 1.66 KB...]
Checking out Revision 729c4de416b8252ec99f0a1253ac7af3023733df (origin/master)
> git config core.sparsecheckout # timeout=10
> git checkout -f 729c4de416b8252ec99f0a1253ac7af3023733df # timeout=10
Commit message: "Fix Dataflow ARM PostCommit failing Java21 (#29444)"
> git rev-list --no-walk 729c4de416b8252ec99f0a1253ac7af3023733df # timeout=10
No emails were triggered.
[EnvInject] - Executing scripts and injecting environment variables after the SCM step.
[EnvInject] - Injecting as environment variables the properties content
SETUPTOOLS_USE_DISTUTILS=stdlib
SPARK_LOCAL_IP=127.0.0.1
[EnvInject] - Variables injected successfully.
[Gradle] - Launching build.
[src] $ <https://ci-beam.apache.org/job/beam_PostCommit_Java_ValidatesRunner_Flink_Java11/ws/src/gradlew> -Dorg.gradle.java.home=/usr/lib/jvm/java-8-openjdk-amd64 :runners:flink:1.15:jar :runners:flink:1.15:testJar
To honour the JVM settings for this build a single-use Daemon process will be forked. For more on this, please refer to https://docs.gradle.org/8.4/userguide/gradle_daemon.html#sec:disabling_the_daemon in the Gradle documentation.
Daemon will be stopped at the end of the build
Configuration on demand is an incubating feature.
Gradle Enterprise plugins resolution: https://plugins.gradle.org/m2
Enforcing Gradle Enterprise: https://ge.apache.org, allowUntrustedServer: false
> Task :buildSrc:compileJava NO-SOURCE
> Task :buildSrc:compileGroovy FROM-CACHE
> Task :buildSrc:pluginDescriptors
> Task :buildSrc:processResources
> Task :buildSrc:classes
> Task :buildSrc:jar
> Task :runners:core-java:createCheckerFrameworkManifest
> Task :sdks:java:core:createCheckerFrameworkManifest
> Task :model:job-management:createCheckerFrameworkManifest
> Task :sdks:java:extensions:avro:createCheckerFrameworkManifest
> Task :runners:java-job-service:createCheckerFrameworkManifest
> Task :model:pipeline:createCheckerFrameworkManifest
> Task :sdks:java:harness:createCheckerFrameworkManifest
> Task :runners:core-construction-java:createCheckerFrameworkManifest
> Task :model:fn-execution:createCheckerFrameworkManifest
> Task :runners:java-fn-execution:createCheckerFrameworkManifest
> Task :sdks:java:expansion-service:createCheckerFrameworkManifest
> Task :runners:core-construction-java:processResources NO-SOURCE
> Task :sdks:java:harness:processResources NO-SOURCE
> Task :runners:java-fn-execution:processResources NO-SOURCE
> Task :runners:core-java:processResources NO-SOURCE
> Task :sdks:java:extensions:avro:generateAvroProtocol NO-SOURCE
> Task :sdks:java:extensions:google-cloud-platform-core:createCheckerFrameworkManifest
> Task :runners:java-job-service:processResources NO-SOURCE
> Task :sdks:java:transform-service:launcher:createCheckerFrameworkManifest
> Task :sdks:java:expansion-service:processResources NO-SOURCE
> Task :runners:core-java:processTestResources NO-SOURCE
> Task :sdks:java:extensions:avro:generateAvroJava NO-SOURCE
> Task :sdks:java:extensions:google-cloud-platform-core:processResources NO-SOURCE
> Task :sdks:java:extensions:avro:processResources NO-SOURCE
> Task :sdks:java:build-tools:createCheckerFrameworkManifest
> Task :runners:flink:1.15:copySourceOverrides
> Task :sdks:java:fn-execution:createCheckerFrameworkManifest
> Task :sdks:java:fn-execution:processResources NO-SOURCE
> Task :model:job-management:extractProto
> Task :model:fn-execution:extractProto
> Task :sdks:java:extensions:arrow:createCheckerFrameworkManifest
> Task :sdks:java:extensions:protobuf:createCheckerFrameworkManifest
> Task :sdks:java:io:google-cloud-platform:createCheckerFrameworkManifest
> Task :sdks:java:extensions:arrow:processResources NO-SOURCE
> Task :sdks:java:io:google-cloud-platform:processResources NO-SOURCE
> Task :runners:flink:1.15:createCheckerFrameworkManifest
> Task :sdks:java:core:generateGrammarSource FROM-CACHE
> Task :sdks:java:extensions:protobuf:extractProto
> Task :runners:flink:1.15:copyResourcesOverrides NO-SOURCE
> Task :sdks:java:extensions:protobuf:processResources NO-SOURCE
> Task :model:job-management:processResources
> Task :runners:flink:1.15:processResources
> Task :model:fn-execution:processResources
> Task :runners:flink:1.15:copyTestSourceOverrides
> Task :runners:flink:1.15:copyTestResourcesOverrides NO-SOURCE
> Task :sdks:java:core:processResources
> Task :sdks:java:core:generateTestGrammarSource NO-SOURCE
> Task :runners:flink:1.15:processTestResources
> Task :sdks:java:core:processTestResources
> Task :sdks:java:build-tools:compileJava FROM-CACHE
> Task :sdks:java:transform-service:launcher:compileJava FROM-CACHE
> Task :sdks:java:transform-service:launcher:processResources
> Task :sdks:java:transform-service:launcher:classes
> Task :sdks:java:build-tools:processResources
> Task :sdks:java:build-tools:classes
> Task :sdks:java:transform-service:launcher:jar
> Task :sdks:java:build-tools:jar
> Task :sdks:java:transform-service:launcher:shadowJar FROM-CACHE
> Task :model:pipeline:extractIncludeProto
> Task :model:pipeline:extractProto
> Task :model:pipeline:generateProto FROM-CACHE
> Task :model:pipeline:compileJava FROM-CACHE
> Task :model:pipeline:processResources
> Task :model:pipeline:classes
> Task :model:pipeline:jar
> Task :model:pipeline:shadowJar FROM-CACHE
> Task :model:fn-execution:extractIncludeProto
> Task :model:job-management:extractIncludeProto
> Task :model:job-management:generateProto FROM-CACHE
> Task :model:fn-execution:generateProto FROM-CACHE
> Task :model:job-management:compileJava FROM-CACHE
> Task :model:job-management:classes
> Task :model:fn-execution:compileJava FROM-CACHE
> Task :model:fn-execution:classes
> Task :model:job-management:shadowJar FROM-CACHE
> Task :model:fn-execution:shadowJar FROM-CACHE
> Task :sdks:java:core:compileJava FROM-CACHE
> Task :sdks:java:core:classes
> Task :sdks:java:core:shadowJar FROM-CACHE
> Task :sdks:java:extensions:protobuf:extractIncludeProto
> Task :sdks:java:extensions:protobuf:generateProto NO-SOURCE
> Task :sdks:java:extensions:arrow:compileJava FROM-CACHE
> Task :sdks:java:extensions:arrow:classes UP-TO-DATE
> Task :sdks:java:extensions:arrow:jar
> Task :sdks:java:extensions:avro:compileJava FROM-CACHE
> Task :sdks:java:extensions:avro:classes UP-TO-DATE
> Task :sdks:java:extensions:avro:jar
> Task :sdks:java:fn-execution:compileJava FROM-CACHE
> Task :sdks:java:fn-execution:classes UP-TO-DATE
> Task :sdks:java:fn-execution:jar
> Task :runners:core-construction-java:compileJava FROM-CACHE
> Task :runners:core-construction-java:classes UP-TO-DATE
> Task :sdks:java:extensions:protobuf:compileJava FROM-CACHE
> Task :sdks:java:extensions:protobuf:classes UP-TO-DATE
> Task :sdks:java:extensions:protobuf:jar
> Task :runners:core-construction-java:jar
> Task :sdks:java:core:compileTestJava FROM-CACHE
> Task :sdks:java:core:testClasses
> Task :runners:core-java:compileJava FROM-CACHE
> Task :runners:core-java:classes UP-TO-DATE
> Task :runners:core-java:jar
> Task :sdks:java:extensions:google-cloud-platform-core:compileJava FROM-CACHE
> Task :sdks:java:extensions:google-cloud-platform-core:classes UP-TO-DATE
> Task :sdks:java:extensions:google-cloud-platform-core:jar
> Task :sdks:java:core:shadowTestJar FROM-CACHE
> Task :sdks:java:harness:compileJava FROM-CACHE
> Task :sdks:java:harness:classes UP-TO-DATE
> Task :sdks:java:harness:jar
> Task :runners:java-fn-execution:compileJava FROM-CACHE
> Task :runners:java-fn-execution:classes UP-TO-DATE
> Task :runners:java-fn-execution:jar
> Task :sdks:java:expansion-service:compileJava FROM-CACHE
> Task :sdks:java:expansion-service:classes UP-TO-DATE
> Task :sdks:java:expansion-service:jar
> Task :runners:core-java:compileTestJava FROM-CACHE
> Task :runners:core-java:testClasses UP-TO-DATE
> Task :runners:java-job-service:compileJava FROM-CACHE
> Task :runners:java-job-service:classes UP-TO-DATE
> Task :runners:java-job-service:jar
> Task :runners:core-java:testJar
> Task :runners:flink:1.15:compileJava FROM-CACHE
> Task :runners:flink:1.15:classes
> Task :runners:flink:1.15:jar
> Task :sdks:java:io:google-cloud-platform:compileJava FROM-CACHE
> Task :sdks:java:io:google-cloud-platform:classes UP-TO-DATE
> Task :sdks:java:io:google-cloud-platform:jar
> Task :runners:flink:1.15:compileTestJava FROM-CACHE
> Task :runners:flink:1.15:testClasses
> Task :runners:flink:1.15:testJar
Deprecated Gradle features were used in this build, making it incompatible with Gradle 9.0.
You can use '--warning-mode all' to show the individual deprecation warnings and determine if they come from your own scripts or plugins.
For more on this, please refer to https://docs.gradle.org/8.4/userguide/command_line_interface.html#sec:command_line_warnings in the Gradle documentation.
BUILD SUCCESSFUL in 24s
92 actionable tasks: 59 executed, 33 from cache
Publishing build scan...
https://ge.apache.org/s/qhfsv4ex3od7q
Build step 'Invoke Gradle script' changed build result to SUCCESS
[Gradle] - Launching build.
[src] $ <https://ci-beam.apache.org/job/beam_PostCommit_Java_ValidatesRunner_Flink_Java11/ws/src/gradlew> -x shadowJar -x shadowTestJar -x compileJava -x compileTestJava -x jar -x testJar -x classes -x testClasses -Dorg.gradle.java.home=/usr/lib/jvm/java-11-openjdk-amd64 --continue --max-workers=12 -Dorg.gradle.jvmargs=-Xms2g -Dorg.gradle.jvmargs=-Xmx6g -Dorg.gradle.vfs.watch=false -Pdocker-pull-licenses :runners:flink:1.15:validatesRunner
To honour the JVM settings for this build a single-use Daemon process will be forked. For more on this, please refer to https://docs.gradle.org/8.4/userguide/gradle_daemon.html#sec:disabling_the_daemon in the Gradle documentation.
Daemon will be stopped at the end of the build
Configuration on demand is an incubating feature.
Gradle Enterprise plugins resolution: https://plugins.gradle.org/m2
Enforcing Gradle Enterprise: https://ge.apache.org, allowUntrustedServer: false
> Task :buildSrc:compileJava NO-SOURCE
> Task :buildSrc:compileGroovy FROM-CACHE
> Task :buildSrc:pluginDescriptors UP-TO-DATE
> Task :buildSrc:processResources UP-TO-DATE
> Task :buildSrc:classes UP-TO-DATE
> Task :buildSrc:jar
> Task :runners:flink:1.15:validatesRunnerBatch
WARNING: An illegal reflective access operation has occurred
WARNING: Illegal reflective access by org.apache.flink.api.java.ClosureCleaner (file:/home/jenkins/.gradle/caches/modules-2/files-2.1/org.apache.flink/flink-core/1.15.0/41836e7311354a678c72284a81fde0d0c48ed905/flink-core-1.15.0.jar) to field java.lang.String.value
WARNING: Please consider reporting this to the maintainers of org.apache.flink.api.java.ClosureCleaner
WARNING: Use --illegal-access=warn to enable warnings of further illegal reflective access operations
WARNING: All illegal access operations will be denied in a future release
WARNING: An illegal reflective access operation has occurred
WARNING: Illegal reflective access by org.apache.flink.api.java.ClosureCleaner (file:/home/jenkins/.gradle/caches/modules-2/files-2.1/org.apache.flink/flink-core/1.15.0/41836e7311354a678c72284a81fde0d0c48ed905/flink-core-1.15.0.jar) to field java.lang.String.value
WARNING: Please consider reporting this to the maintainers of org.apache.flink.api.java.ClosureCleaner
WARNING: Use --illegal-access=warn to enable warnings of further illegal reflective access operations
WARNING: All illegal access operations will be denied in a future release
WARNING: An illegal reflective access operation has occurred
WARNING: Illegal reflective access by org.apache.flink.api.java.ClosureCleaner (file:/home/jenkins/.gradle/caches/modules-2/files-2.1/org.apache.flink/flink-core/1.15.0/41836e7311354a678c72284a81fde0d0c48ed905/flink-core-1.15.0.jar) to field java.lang.String.value
WARNING: Please consider reporting this to the maintainers of org.apache.flink.api.java.ClosureCleaner
WARNING: Use --illegal-access=warn to enable warnings of further illegal reflective access operations
WARNING: All illegal access operations will be denied in a future release
> Task :runners:flink:1.15:validatesRunnerBatchWithDataStream
org.apache.beam.sdk.transforms.ParDoLifecycleTest > testTeardownCalledAfterExceptionInStartBundleStateful FAILED
java.lang.AssertionError at Assert.java:89
org.apache.beam.sdk.transforms.ViewTest > testTriggeredLatestSingleton FAILED
org.apache.beam.sdk.Pipeline$PipelineExecutionException at ViewTest.java:330
Caused by: java.lang.IllegalArgumentException at PCollectionViews.java:412
294 tests completed, 2 failed, 1 skipped
> Task :runners:flink:1.15:validatesRunnerBatchWithDataStream FAILED
WARNING: An illegal reflective access operation has occurred
WARNING: Illegal reflective access by org.apache.flink.api.java.ClosureCleaner (file:/home/jenkins/.gradle/caches/modules-2/files-2.1/org.apache.flink/flink-core/1.15.0/41836e7311354a678c72284a81fde0d0c48ed905/flink-core-1.15.0.jar) to field java.lang.String.value
WARNING: Please consider reporting this to the maintainers of org.apache.flink.api.java.ClosureCleaner
WARNING: Use --illegal-access=warn to enable warnings of further illegal reflective access operations
WARNING: All illegal access operations will be denied in a future release
WARNING: An illegal reflective access operation has occurred
WARNING: Illegal reflective access by org.apache.flink.api.java.ClosureCleaner (file:/home/jenkins/.gradle/caches/modules-2/files-2.1/org.apache.flink/flink-core/1.15.0/41836e7311354a678c72284a81fde0d0c48ed905/flink-core-1.15.0.jar) to field java.lang.String.value
WARNING: Please consider reporting this to the maintainers of org.apache.flink.api.java.ClosureCleaner
WARNING: Use --illegal-access=warn to enable warnings of further illegal reflective access operations
WARNING: All illegal access operations will be denied in a future release
> Task :runners:flink:1.15:validatesRunnerStreaming
WARNING: An illegal reflective access operation has occurred
WARNING: Illegal reflective access by org.apache.flink.api.java.ClosureCleaner (file:/home/jenkins/.gradle/caches/modules-2/files-2.1/org.apache.flink/flink-core/1.15.0/41836e7311354a678c72284a81fde0d0c48ed905/flink-core-1.15.0.jar) to field java.lang.String.value
WARNING: Please consider reporting this to the maintainers of org.apache.flink.api.java.ClosureCleaner
WARNING: Use --illegal-access=warn to enable warnings of further illegal reflective access operations
WARNING: All illegal access operations will be denied in a future release
> Task :runners:flink:1.15:validatesRunnerStreamingCheckpointing
FAILURE: Build failed with an exception.
* What went wrong:
Execution failed for task ':runners:flink:1.15:validatesRunnerBatchWithDataStream'.
> There were failing tests. See the report at: file://<https://ci-beam.apache.org/job/beam_PostCommit_Java_ValidatesRunner_Flink_Java11/ws/src/runners/flink/1.15/build/reports/tests/validatesRunnerBatchWithDataStream/index.html>
Deprecated Gradle features were used in this build, making it incompatible with Gradle 9.0.
You can use '--warning-mode all' to show the individual deprecation warnings and determine if they come from your own scripts or plugins.
For more on this, please refer to https://docs.gradle.org/8.4/userguide/command_line_interface.html#sec:command_line_warnings in the Gradle documentation.
BUILD FAILED in 38m 3s
8 actionable tasks: 5 executed, 1 from cache, 2 up-to-date
Publishing build scan...
https://ge.apache.org/s/xhvtnmv626464
Build step 'Invoke Gradle script' changed build result to FAILURE
Build step 'Invoke Gradle script' marked build as failure
---------------------------------------------------------------------
To unsubscribe, e-mail: builds-unsubscribe@beam.apache.org
For additional commands, e-mail: builds-help@beam.apache.org
Build failed in Jenkins: beam_PostCommit_Java_ValidatesRunner_Flink_Java11 #5197
Posted by Apache Jenkins Server <je...@builds.apache.org>.
See <https://ci-beam.apache.org/job/beam_PostCommit_Java_ValidatesRunner_Flink_Java11/5197/display/redirect>
Changes:
------------------------------------------
[...truncated 1.40 KB...]
> git fetch --no-tags --force --progress --depth=1 -- https://github.com/apache/beam.git +refs/heads/*:refs/remotes/origin/* +refs/pull/${ghprbPullId}/*:refs/remotes/origin/pr/${ghprbPullId}/* # timeout=10
> git rev-parse origin/master^{commit} # timeout=10
Checking out Revision 729c4de416b8252ec99f0a1253ac7af3023733df (origin/master)
> git config core.sparsecheckout # timeout=10
> git checkout -f 729c4de416b8252ec99f0a1253ac7af3023733df # timeout=10
Commit message: "Fix Dataflow ARM PostCommit failing Java21 (#29444)"
> git rev-list --no-walk 2012107a0fa2bb3fedf1b5aedcb49445534b2dad # timeout=10
First time build. Skipping changelog.
No emails were triggered.
[EnvInject] - Executing scripts and injecting environment variables after the SCM step.
[EnvInject] - Injecting as environment variables the properties content
SETUPTOOLS_USE_DISTUTILS=stdlib
SPARK_LOCAL_IP=127.0.0.1
[EnvInject] - Variables injected successfully.
[Gradle] - Launching build.
[src] $ <https://ci-beam.apache.org/job/beam_PostCommit_Java_ValidatesRunner_Flink_Java11/ws/src/gradlew> -Dorg.gradle.java.home=/usr/lib/jvm/java-8-openjdk-amd64 :runners:flink:1.15:jar :runners:flink:1.15:testJar
To honour the JVM settings for this build a single-use Daemon process will be forked. For more on this, please refer to https://docs.gradle.org/8.4/userguide/gradle_daemon.html#sec:disabling_the_daemon in the Gradle documentation.
Daemon will be stopped at the end of the build
Configuration on demand is an incubating feature.
Gradle Enterprise plugins resolution: https://plugins.gradle.org/m2
Enforcing Gradle Enterprise: https://ge.apache.org, allowUntrustedServer: false
> Task :buildSrc:compileJava NO-SOURCE
> Task :buildSrc:compileGroovy FROM-CACHE
> Task :buildSrc:pluginDescriptors
> Task :buildSrc:processResources
> Task :buildSrc:classes
> Task :buildSrc:jar
> Task :runners:core-java:createCheckerFrameworkManifest
> Task :runners:core-construction-java:createCheckerFrameworkManifest
> Task :sdks:java:core:createCheckerFrameworkManifest
> Task :sdks:java:harness:createCheckerFrameworkManifest
> Task :sdks:java:expansion-service:createCheckerFrameworkManifest
> Task :sdks:java:transform-service:launcher:createCheckerFrameworkManifest
> Task :model:pipeline:createCheckerFrameworkManifest
> Task :model:fn-execution:createCheckerFrameworkManifest
> Task :sdks:java:extensions:avro:createCheckerFrameworkManifest
> Task :runners:core-construction-java:processResources NO-SOURCE
> Task :sdks:java:harness:processResources NO-SOURCE
> Task :runners:java-job-service:createCheckerFrameworkManifest
> Task :sdks:java:expansion-service:processResources NO-SOURCE
> Task :runners:java-fn-execution:createCheckerFrameworkManifest
> Task :sdks:java:extensions:avro:generateAvroProtocol NO-SOURCE
> Task :sdks:java:build-tools:createCheckerFrameworkManifest
> Task :runners:java-job-service:processResources NO-SOURCE
> Task :runners:java-fn-execution:processResources NO-SOURCE
> Task :model:job-management:createCheckerFrameworkManifest
> Task :runners:core-java:processResources NO-SOURCE
> Task :sdks:java:extensions:google-cloud-platform-core:createCheckerFrameworkManifest
> Task :sdks:java:extensions:avro:generateAvroJava NO-SOURCE
> Task :sdks:java:extensions:google-cloud-platform-core:processResources NO-SOURCE
> Task :runners:core-java:processTestResources NO-SOURCE
> Task :sdks:java:fn-execution:createCheckerFrameworkManifest
> Task :model:fn-execution:extractProto
> Task :sdks:java:extensions:avro:processResources NO-SOURCE
> Task :sdks:java:fn-execution:processResources NO-SOURCE
> Task :model:job-management:extractProto
> Task :runners:flink:1.15:copySourceOverrides
> Task :sdks:java:extensions:arrow:createCheckerFrameworkManifest
> Task :sdks:java:io:google-cloud-platform:createCheckerFrameworkManifest
> Task :sdks:java:extensions:protobuf:createCheckerFrameworkManifest
> Task :sdks:java:extensions:arrow:processResources NO-SOURCE
> Task :sdks:java:io:google-cloud-platform:processResources NO-SOURCE
> Task :sdks:java:core:generateGrammarSource FROM-CACHE
> Task :runners:flink:1.15:createCheckerFrameworkManifest
> Task :model:job-management:processResources
> Task :runners:flink:1.15:copyResourcesOverrides NO-SOURCE
> Task :model:fn-execution:processResources
> Task :sdks:java:extensions:protobuf:extractProto
> Task :sdks:java:extensions:protobuf:processResources NO-SOURCE
> Task :runners:flink:1.15:processResources
> Task :sdks:java:core:processResources
> Task :runners:flink:1.15:copyTestSourceOverrides
> Task :sdks:java:core:generateTestGrammarSource NO-SOURCE
> Task :runners:flink:1.15:copyTestResourcesOverrides NO-SOURCE
> Task :sdks:java:transform-service:launcher:compileJava FROM-CACHE
> Task :runners:flink:1.15:processTestResources
> Task :sdks:java:transform-service:launcher:processResources
> Task :sdks:java:transform-service:launcher:classes
> Task :sdks:java:core:processTestResources
> Task :sdks:java:transform-service:launcher:jar
> Task :sdks:java:transform-service:launcher:shadowJar FROM-CACHE
> Task :model:pipeline:extractIncludeProto
> Task :model:pipeline:extractProto
> Task :model:pipeline:generateProto FROM-CACHE
> Task :sdks:java:build-tools:compileJava FROM-CACHE
> Task :sdks:java:build-tools:processResources
> Task :sdks:java:build-tools:classes
> Task :sdks:java:build-tools:jar
> Task :model:pipeline:compileJava FROM-CACHE
> Task :model:pipeline:processResources
> Task :model:pipeline:classes
> Task :model:pipeline:jar
> Task :model:pipeline:shadowJar FROM-CACHE
> Task :model:job-management:extractIncludeProto
> Task :model:fn-execution:extractIncludeProto
> Task :model:job-management:generateProto FROM-CACHE
> Task :model:fn-execution:generateProto FROM-CACHE
> Task :model:job-management:compileJava FROM-CACHE
> Task :model:job-management:classes
> Task :model:fn-execution:compileJava FROM-CACHE
> Task :model:fn-execution:classes
> Task :model:job-management:shadowJar FROM-CACHE
> Task :model:fn-execution:shadowJar FROM-CACHE
> Task :sdks:java:core:compileJava FROM-CACHE
> Task :sdks:java:core:classes
> Task :sdks:java:core:shadowJar FROM-CACHE
> Task :sdks:java:extensions:avro:compileJava FROM-CACHE
> Task :sdks:java:extensions:avro:classes UP-TO-DATE
> Task :sdks:java:extensions:protobuf:extractIncludeProto
> Task :sdks:java:extensions:protobuf:generateProto NO-SOURCE
> Task :sdks:java:extensions:arrow:compileJava FROM-CACHE
> Task :sdks:java:extensions:arrow:classes UP-TO-DATE
> Task :sdks:java:extensions:arrow:jar
> Task :sdks:java:extensions:avro:jar
> Task :sdks:java:extensions:protobuf:compileJava FROM-CACHE
> Task :sdks:java:extensions:protobuf:classes UP-TO-DATE
> Task :sdks:java:extensions:protobuf:jar
> Task :sdks:java:fn-execution:compileJava FROM-CACHE
> Task :sdks:java:fn-execution:classes UP-TO-DATE
> Task :sdks:java:fn-execution:jar
> Task :runners:core-construction-java:compileJava FROM-CACHE
> Task :runners:core-construction-java:classes UP-TO-DATE
> Task :runners:core-construction-java:jar
> Task :runners:core-java:compileJava FROM-CACHE
> Task :runners:core-java:classes UP-TO-DATE
> Task :runners:core-java:jar
> Task :sdks:java:core:compileTestJava FROM-CACHE
> Task :sdks:java:core:testClasses
> Task :sdks:java:core:shadowTestJar FROM-CACHE
> Task :sdks:java:extensions:google-cloud-platform-core:compileJava FROM-CACHE
> Task :sdks:java:extensions:google-cloud-platform-core:classes UP-TO-DATE
> Task :sdks:java:extensions:google-cloud-platform-core:jar
> Task :sdks:java:harness:compileJava FROM-CACHE
> Task :sdks:java:harness:classes UP-TO-DATE
> Task :sdks:java:harness:jar
> Task :runners:core-java:compileTestJava FROM-CACHE
> Task :runners:core-java:testClasses UP-TO-DATE
> Task :runners:java-fn-execution:compileJava FROM-CACHE
> Task :runners:java-fn-execution:classes UP-TO-DATE
> Task :runners:core-java:testJar
> Task :runners:java-fn-execution:jar
> Task :sdks:java:expansion-service:compileJava FROM-CACHE
> Task :sdks:java:expansion-service:classes UP-TO-DATE
> Task :sdks:java:expansion-service:jar
> Task :runners:java-job-service:compileJava FROM-CACHE
> Task :runners:java-job-service:classes UP-TO-DATE
> Task :runners:java-job-service:jar
> Task :sdks:java:io:google-cloud-platform:compileJava FROM-CACHE
> Task :runners:flink:1.15:compileJava FROM-CACHE
> Task :runners:flink:1.15:classes
> Task :sdks:java:io:google-cloud-platform:classes UP-TO-DATE
> Task :runners:flink:1.15:jar
> Task :sdks:java:io:google-cloud-platform:jar
> Task :runners:flink:1.15:compileTestJava FROM-CACHE
> Task :runners:flink:1.15:testClasses
> Task :runners:flink:1.15:testJar
Deprecated Gradle features were used in this build, making it incompatible with Gradle 9.0.
You can use '--warning-mode all' to show the individual deprecation warnings and determine if they come from your own scripts or plugins.
For more on this, please refer to https://docs.gradle.org/8.4/userguide/command_line_interface.html#sec:command_line_warnings in the Gradle documentation.
BUILD SUCCESSFUL in 27s
92 actionable tasks: 59 executed, 33 from cache
Publishing build scan...
https://ge.apache.org/s/he6mt7oubrx3o
Build step 'Invoke Gradle script' changed build result to SUCCESS
[Gradle] - Launching build.
[src] $ <https://ci-beam.apache.org/job/beam_PostCommit_Java_ValidatesRunner_Flink_Java11/ws/src/gradlew> -x shadowJar -x shadowTestJar -x compileJava -x compileTestJava -x jar -x testJar -x classes -x testClasses -Dorg.gradle.java.home=/usr/lib/jvm/java-11-openjdk-amd64 --continue --max-workers=12 -Dorg.gradle.jvmargs=-Xms2g -Dorg.gradle.jvmargs=-Xmx6g -Dorg.gradle.vfs.watch=false -Pdocker-pull-licenses :runners:flink:1.15:validatesRunner
To honour the JVM settings for this build a single-use Daemon process will be forked. For more on this, please refer to https://docs.gradle.org/8.4/userguide/gradle_daemon.html#sec:disabling_the_daemon in the Gradle documentation.
Daemon will be stopped at the end of the build
Configuration on demand is an incubating feature.
Gradle Enterprise plugins resolution: https://plugins.gradle.org/m2
Enforcing Gradle Enterprise: https://ge.apache.org, allowUntrustedServer: false
> Task :buildSrc:compileJava NO-SOURCE
> Task :buildSrc:compileGroovy FROM-CACHE
> Task :buildSrc:pluginDescriptors UP-TO-DATE
> Task :buildSrc:processResources UP-TO-DATE
> Task :buildSrc:classes UP-TO-DATE
> Task :buildSrc:jar
> Task :runners:flink:1.15:validatesRunnerBatch
WARNING: An illegal reflective access operation has occurred
WARNING: Illegal reflective access by org.apache.flink.api.java.ClosureCleaner (file:/home/jenkins/.gradle/caches/modules-2/files-2.1/org.apache.flink/flink-core/1.15.0/41836e7311354a678c72284a81fde0d0c48ed905/flink-core-1.15.0.jar) to field java.lang.String.value
WARNING: Please consider reporting this to the maintainers of org.apache.flink.api.java.ClosureCleaner
WARNING: Use --illegal-access=warn to enable warnings of further illegal reflective access operations
WARNING: All illegal access operations will be denied in a future release
WARNING: An illegal reflective access operation has occurred
WARNING: Illegal reflective access by org.apache.flink.api.java.ClosureCleaner (file:/home/jenkins/.gradle/caches/modules-2/files-2.1/org.apache.flink/flink-core/1.15.0/41836e7311354a678c72284a81fde0d0c48ed905/flink-core-1.15.0.jar) to field java.lang.String.value
WARNING: Please consider reporting this to the maintainers of org.apache.flink.api.java.ClosureCleaner
WARNING: Use --illegal-access=warn to enable warnings of further illegal reflective access operations
WARNING: All illegal access operations will be denied in a future release
WARNING: An illegal reflective access operation has occurred
WARNING: Illegal reflective access by org.apache.flink.api.java.ClosureCleaner (file:/home/jenkins/.gradle/caches/modules-2/files-2.1/org.apache.flink/flink-core/1.15.0/41836e7311354a678c72284a81fde0d0c48ed905/flink-core-1.15.0.jar) to field java.lang.String.value
WARNING: Please consider reporting this to the maintainers of org.apache.flink.api.java.ClosureCleaner
WARNING: Use --illegal-access=warn to enable warnings of further illegal reflective access operations
WARNING: All illegal access operations will be denied in a future release
> Task :runners:flink:1.15:validatesRunnerBatchWithDataStream
org.apache.beam.sdk.transforms.ViewTest > testTriggeredLatestSingleton FAILED
org.apache.beam.sdk.Pipeline$PipelineExecutionException at ViewTest.java:330
Caused by: java.lang.IllegalArgumentException at PCollectionViews.java:412
294 tests completed, 1 failed, 1 skipped
> Task :runners:flink:1.15:validatesRunnerBatchWithDataStream FAILED
WARNING: An illegal reflective access operation has occurred
WARNING: Illegal reflective access by org.apache.flink.api.java.ClosureCleaner (file:/home/jenkins/.gradle/caches/modules-2/files-2.1/org.apache.flink/flink-core/1.15.0/41836e7311354a678c72284a81fde0d0c48ed905/flink-core-1.15.0.jar) to field java.lang.String.value
WARNING: Please consider reporting this to the maintainers of org.apache.flink.api.java.ClosureCleaner
WARNING: Use --illegal-access=warn to enable warnings of further illegal reflective access operations
WARNING: All illegal access operations will be denied in a future release
WARNING: An illegal reflective access operation has occurred
WARNING: Illegal reflective access by org.apache.flink.api.java.ClosureCleaner (file:/home/jenkins/.gradle/caches/modules-2/files-2.1/org.apache.flink/flink-core/1.15.0/41836e7311354a678c72284a81fde0d0c48ed905/flink-core-1.15.0.jar) to field java.lang.String.value
WARNING: Please consider reporting this to the maintainers of org.apache.flink.api.java.ClosureCleaner
WARNING: Use --illegal-access=warn to enable warnings of further illegal reflective access operations
WARNING: All illegal access operations will be denied in a future release
> Task :runners:flink:1.15:validatesRunnerStreaming
WARNING: An illegal reflective access operation has occurred
WARNING: Illegal reflective access by org.apache.flink.api.java.ClosureCleaner (file:/home/jenkins/.gradle/caches/modules-2/files-2.1/org.apache.flink/flink-core/1.15.0/41836e7311354a678c72284a81fde0d0c48ed905/flink-core-1.15.0.jar) to field java.lang.String.value
WARNING: Please consider reporting this to the maintainers of org.apache.flink.api.java.ClosureCleaner
WARNING: Use --illegal-access=warn to enable warnings of further illegal reflective access operations
WARNING: All illegal access operations will be denied in a future release
> Task :runners:flink:1.15:validatesRunnerStreamingCheckpointing
FAILURE: Build failed with an exception.
* What went wrong:
Execution failed for task ':runners:flink:1.15:validatesRunnerBatchWithDataStream'.
> There were failing tests. See the report at: file://<https://ci-beam.apache.org/job/beam_PostCommit_Java_ValidatesRunner_Flink_Java11/ws/src/runners/flink/1.15/build/reports/tests/validatesRunnerBatchWithDataStream/index.html>
Deprecated Gradle features were used in this build, making it incompatible with Gradle 9.0.
You can use '--warning-mode all' to show the individual deprecation warnings and determine if they come from your own scripts or plugins.
For more on this, please refer to https://docs.gradle.org/8.4/userguide/command_line_interface.html#sec:command_line_warnings in the Gradle documentation.
BUILD FAILED in 38m 41s
8 actionable tasks: 5 executed, 1 from cache, 2 up-to-date
Publishing build scan...
https://ge.apache.org/s/a6fkcqliaqrhw
Build step 'Invoke Gradle script' changed build result to FAILURE
Build step 'Invoke Gradle script' marked build as failure
---------------------------------------------------------------------
To unsubscribe, e-mail: builds-unsubscribe@beam.apache.org
For additional commands, e-mail: builds-help@beam.apache.org
Build failed in Jenkins: beam_PostCommit_Java_ValidatesRunner_Flink_Java11 #5196
Posted by Apache Jenkins Server <je...@builds.apache.org>.
See <https://ci-beam.apache.org/job/beam_PostCommit_Java_ValidatesRunner_Flink_Java11/5196/display/redirect>
Changes:
------------------------------------------
[...truncated 3.20 KB...]
Gradle Enterprise plugins resolution: https://plugins.gradle.org/m2
Enforcing Gradle Enterprise: https://ge.apache.org, allowUntrustedServer: false
> Task :buildSrc:compileJava NO-SOURCE
> Task :buildSrc:compileGroovy FROM-CACHE
> Task :buildSrc:pluginDescriptors
> Task :buildSrc:processResources
> Task :buildSrc:classes
> Task :buildSrc:jar
> Task :sdks:java:extensions:avro:createCheckerFrameworkManifest
> Task :sdks:java:harness:createCheckerFrameworkManifest
> Task :sdks:java:expansion-service:createCheckerFrameworkManifest
> Task :sdks:java:fn-execution:createCheckerFrameworkManifest
> Task :sdks:java:transform-service:launcher:createCheckerFrameworkManifest
> Task :model:job-management:createCheckerFrameworkManifest
> Task :runners:java-fn-execution:createCheckerFrameworkManifest
> Task :model:fn-execution:createCheckerFrameworkManifest
> Task :model:pipeline:createCheckerFrameworkManifest
> Task :runners:java-job-service:createCheckerFrameworkManifest
> Task :runners:core-construction-java:createCheckerFrameworkManifest
> Task :sdks:java:fn-execution:processResources NO-SOURCE
> Task :sdks:java:harness:processResources NO-SOURCE
> Task :sdks:java:expansion-service:processResources NO-SOURCE
> Task :runners:core-construction-java:processResources NO-SOURCE
> Task :sdks:java:extensions:avro:generateAvroProtocol NO-SOURCE
> Task :runners:java-fn-execution:processResources NO-SOURCE
> Task :sdks:java:extensions:google-cloud-platform-core:createCheckerFrameworkManifest
> Task :runners:java-job-service:processResources NO-SOURCE
> Task :sdks:java:build-tools:createCheckerFrameworkManifest
> Task :runners:core-java:createCheckerFrameworkManifest
> Task :sdks:java:core:createCheckerFrameworkManifest
> Task :sdks:java:extensions:avro:generateAvroJava NO-SOURCE
> Task :sdks:java:extensions:google-cloud-platform-core:processResources NO-SOURCE
> Task :runners:core-java:processResources NO-SOURCE
> Task :sdks:java:extensions:avro:processResources NO-SOURCE
> Task :runners:core-java:processTestResources NO-SOURCE
> Task :runners:flink:1.15:copySourceOverrides
> Task :sdks:java:extensions:arrow:createCheckerFrameworkManifest
> Task :sdks:java:io:google-cloud-platform:createCheckerFrameworkManifest
> Task :sdks:java:extensions:protobuf:createCheckerFrameworkManifest
> Task :sdks:java:io:google-cloud-platform:processResources NO-SOURCE
> Task :sdks:java:extensions:arrow:processResources NO-SOURCE
> Task :runners:flink:1.15:createCheckerFrameworkManifest
> Task :model:job-management:extractProto
> Task :sdks:java:extensions:protobuf:extractProto
> Task :model:fn-execution:extractProto
> Task :runners:flink:1.15:copyResourcesOverrides NO-SOURCE
> Task :sdks:java:core:generateGrammarSource FROM-CACHE
> Task :runners:flink:1.15:processResources
> Task :sdks:java:extensions:protobuf:processResources NO-SOURCE
> Task :model:job-management:processResources
> Task :model:fn-execution:processResources
> Task :runners:flink:1.15:copyTestSourceOverrides
> Task :runners:flink:1.15:copyTestResourcesOverrides NO-SOURCE
> Task :runners:flink:1.15:processTestResources
> Task :sdks:java:core:processResources
> Task :sdks:java:build-tools:compileJava FROM-CACHE
> Task :sdks:java:core:generateTestGrammarSource NO-SOURCE
> Task :sdks:java:transform-service:launcher:compileJava FROM-CACHE
> Task :sdks:java:transform-service:launcher:processResources
> Task :sdks:java:transform-service:launcher:classes
> Task :sdks:java:build-tools:processResources
> Task :sdks:java:build-tools:classes
> Task :sdks:java:core:processTestResources
> Task :sdks:java:transform-service:launcher:jar
> Task :sdks:java:build-tools:jar
> Task :sdks:java:transform-service:launcher:shadowJar FROM-CACHE
> Task :model:pipeline:extractIncludeProto
> Task :model:pipeline:extractProto
> Task :model:pipeline:generateProto FROM-CACHE
> Task :model:pipeline:compileJava FROM-CACHE
> Task :model:pipeline:processResources
> Task :model:pipeline:classes
> Task :model:pipeline:jar
> Task :model:pipeline:shadowJar FROM-CACHE
> Task :model:job-management:extractIncludeProto
> Task :model:fn-execution:extractIncludeProto
> Task :model:job-management:generateProto FROM-CACHE
> Task :model:fn-execution:generateProto FROM-CACHE
> Task :model:job-management:compileJava FROM-CACHE
> Task :model:job-management:classes
> Task :model:fn-execution:compileJava FROM-CACHE
> Task :model:fn-execution:classes
> Task :model:job-management:shadowJar FROM-CACHE
> Task :model:fn-execution:shadowJar FROM-CACHE
> Task :sdks:java:core:compileJava FROM-CACHE
> Task :sdks:java:core:classes
> Task :sdks:java:core:shadowJar FROM-CACHE
> Task :sdks:java:extensions:avro:compileJava FROM-CACHE
> Task :sdks:java:extensions:avro:classes UP-TO-DATE
> Task :sdks:java:extensions:protobuf:extractIncludeProto
> Task :sdks:java:extensions:protobuf:generateProto NO-SOURCE
> Task :sdks:java:extensions:arrow:compileJava FROM-CACHE
> Task :sdks:java:extensions:arrow:classes UP-TO-DATE
> Task :sdks:java:extensions:avro:jar
> Task :sdks:java:extensions:arrow:jar
> Task :sdks:java:extensions:protobuf:compileJava FROM-CACHE
> Task :sdks:java:extensions:protobuf:classes UP-TO-DATE
> Task :sdks:java:extensions:protobuf:jar
> Task :sdks:java:fn-execution:compileJava FROM-CACHE
> Task :sdks:java:fn-execution:classes UP-TO-DATE
> Task :sdks:java:fn-execution:jar
> Task :runners:core-construction-java:compileJava FROM-CACHE
> Task :runners:core-construction-java:classes UP-TO-DATE
> Task :runners:core-construction-java:jar
> Task :runners:core-java:compileJava FROM-CACHE
> Task :runners:core-java:classes UP-TO-DATE
> Task :runners:core-java:jar
> Task :sdks:java:core:compileTestJava FROM-CACHE
> Task :sdks:java:core:testClasses
> Task :sdks:java:extensions:google-cloud-platform-core:compileJava FROM-CACHE
> Task :sdks:java:extensions:google-cloud-platform-core:classes UP-TO-DATE
> Task :sdks:java:core:shadowTestJar FROM-CACHE
> Task :sdks:java:extensions:google-cloud-platform-core:jar
> Task :sdks:java:harness:compileJava FROM-CACHE
> Task :sdks:java:harness:classes UP-TO-DATE
> Task :sdks:java:harness:jar
> Task :runners:core-java:compileTestJava FROM-CACHE
> Task :runners:core-java:testClasses UP-TO-DATE
> Task :runners:java-fn-execution:compileJava FROM-CACHE
> Task :runners:java-fn-execution:classes UP-TO-DATE
> Task :runners:core-java:testJar
> Task :runners:java-fn-execution:jar
> Task :sdks:java:expansion-service:compileJava FROM-CACHE
> Task :sdks:java:expansion-service:classes UP-TO-DATE
> Task :sdks:java:expansion-service:jar
> Task :runners:java-job-service:compileJava FROM-CACHE
> Task :runners:java-job-service:classes UP-TO-DATE
> Task :runners:java-job-service:jar
> Task :sdks:java:io:google-cloud-platform:compileJava FROM-CACHE
> Task :sdks:java:io:google-cloud-platform:classes UP-TO-DATE
> Task :sdks:java:io:google-cloud-platform:jar
> Task :runners:flink:1.15:compileJava FROM-CACHE
> Task :runners:flink:1.15:classes
> Task :runners:flink:1.15:jar
> Task :runners:flink:1.15:compileTestJava FROM-CACHE
> Task :runners:flink:1.15:testClasses
> Task :runners:flink:1.15:testJar
Deprecated Gradle features were used in this build, making it incompatible with Gradle 9.0.
You can use '--warning-mode all' to show the individual deprecation warnings and determine if they come from your own scripts or plugins.
For more on this, please refer to https://docs.gradle.org/8.4/userguide/command_line_interface.html#sec:command_line_warnings in the Gradle documentation.
BUILD SUCCESSFUL in 24s
92 actionable tasks: 59 executed, 33 from cache
Publishing build scan...
https://ge.apache.org/s/hbkx6vu4lefos
Build step 'Invoke Gradle script' changed build result to SUCCESS
[Gradle] - Launching build.
[src] $ <https://ci-beam.apache.org/job/beam_PostCommit_Java_ValidatesRunner_Flink_Java11/ws/src/gradlew> -x shadowJar -x shadowTestJar -x compileJava -x compileTestJava -x jar -x testJar -x classes -x testClasses -Dorg.gradle.java.home=/usr/lib/jvm/java-11-openjdk-amd64 --continue --max-workers=12 -Dorg.gradle.jvmargs=-Xms2g -Dorg.gradle.jvmargs=-Xmx6g -Dorg.gradle.vfs.watch=false -Pdocker-pull-licenses :runners:flink:1.15:validatesRunner
To honour the JVM settings for this build a single-use Daemon process will be forked. For more on this, please refer to https://docs.gradle.org/8.4/userguide/gradle_daemon.html#sec:disabling_the_daemon in the Gradle documentation.
Daemon will be stopped at the end of the build
Configuration on demand is an incubating feature.
Gradle Enterprise plugins resolution: https://plugins.gradle.org/m2
Enforcing Gradle Enterprise: https://ge.apache.org, allowUntrustedServer: false
> Task :buildSrc:compileJava NO-SOURCE
> Task :buildSrc:compileGroovy FROM-CACHE
> Task :buildSrc:pluginDescriptors UP-TO-DATE
> Task :buildSrc:processResources UP-TO-DATE
> Task :buildSrc:classes UP-TO-DATE
> Task :buildSrc:jar
> Task :runners:flink:1.15:validatesRunnerBatch
WARNING: An illegal reflective access operation has occurred
WARNING: Illegal reflective access by org.apache.flink.api.java.ClosureCleaner (file:/home/jenkins/.gradle/caches/modules-2/files-2.1/org.apache.flink/flink-core/1.15.0/41836e7311354a678c72284a81fde0d0c48ed905/flink-core-1.15.0.jar) to field java.lang.String.value
WARNING: Please consider reporting this to the maintainers of org.apache.flink.api.java.ClosureCleaner
WARNING: Use --illegal-access=warn to enable warnings of further illegal reflective access operations
WARNING: All illegal access operations will be denied in a future release
WARNING: An illegal reflective access operation has occurred
WARNING: Illegal reflective access by org.apache.flink.api.java.ClosureCleaner (file:/home/jenkins/.gradle/caches/modules-2/files-2.1/org.apache.flink/flink-core/1.15.0/41836e7311354a678c72284a81fde0d0c48ed905/flink-core-1.15.0.jar) to field java.lang.String.value
WARNING: Please consider reporting this to the maintainers of org.apache.flink.api.java.ClosureCleaner
WARNING: Use --illegal-access=warn to enable warnings of further illegal reflective access operations
WARNING: All illegal access operations will be denied in a future release
WARNING: An illegal reflective access operation has occurred
WARNING: Illegal reflective access by org.apache.flink.api.java.ClosureCleaner (file:/home/jenkins/.gradle/caches/modules-2/files-2.1/org.apache.flink/flink-core/1.15.0/41836e7311354a678c72284a81fde0d0c48ed905/flink-core-1.15.0.jar) to field java.lang.String.value
WARNING: Please consider reporting this to the maintainers of org.apache.flink.api.java.ClosureCleaner
WARNING: Use --illegal-access=warn to enable warnings of further illegal reflective access operations
WARNING: All illegal access operations will be denied in a future release
> Task :runners:flink:1.15:validatesRunnerBatchWithDataStream
org.apache.beam.sdk.transforms.ParDoLifecycleTest > testTeardownCalledAfterExceptionInStartBundleStateful FAILED
java.lang.AssertionError at Assert.java:89
org.apache.beam.sdk.transforms.ViewTest > testTriggeredLatestSingleton FAILED
org.apache.beam.sdk.Pipeline$PipelineExecutionException at ViewTest.java:330
Caused by: java.lang.IllegalArgumentException at PCollectionViews.java:412
294 tests completed, 2 failed, 1 skipped
> Task :runners:flink:1.15:validatesRunnerBatchWithDataStream FAILED
WARNING: An illegal reflective access operation has occurred
WARNING: Illegal reflective access by org.apache.flink.api.java.ClosureCleaner (file:/home/jenkins/.gradle/caches/modules-2/files-2.1/org.apache.flink/flink-core/1.15.0/41836e7311354a678c72284a81fde0d0c48ed905/flink-core-1.15.0.jar) to field java.lang.String.value
WARNING: Please consider reporting this to the maintainers of org.apache.flink.api.java.ClosureCleaner
WARNING: Use --illegal-access=warn to enable warnings of further illegal reflective access operations
WARNING: All illegal access operations will be denied in a future release
WARNING: An illegal reflective access operation has occurred
WARNING: Illegal reflective access by org.apache.flink.api.java.ClosureCleaner (file:/home/jenkins/.gradle/caches/modules-2/files-2.1/org.apache.flink/flink-core/1.15.0/41836e7311354a678c72284a81fde0d0c48ed905/flink-core-1.15.0.jar) to field java.lang.String.value
WARNING: Please consider reporting this to the maintainers of org.apache.flink.api.java.ClosureCleaner
WARNING: Use --illegal-access=warn to enable warnings of further illegal reflective access operations
WARNING: All illegal access operations will be denied in a future release
> Task :runners:flink:1.15:validatesRunnerStreaming
org.apache.beam.sdk.transforms.ParDoLifecycleTest > testTeardownCalledAfterExceptionInStartBundleStateful FAILED
java.lang.AssertionError at Assert.java:89
324 tests completed, 1 failed, 2 skipped
> Task :runners:flink:1.15:validatesRunnerStreaming FAILED
WARNING: An illegal reflective access operation has occurred
WARNING: Illegal reflective access by org.apache.flink.api.java.ClosureCleaner (file:/home/jenkins/.gradle/caches/modules-2/files-2.1/org.apache.flink/flink-core/1.15.0/41836e7311354a678c72284a81fde0d0c48ed905/flink-core-1.15.0.jar) to field java.lang.String.value
WARNING: Please consider reporting this to the maintainers of org.apache.flink.api.java.ClosureCleaner
WARNING: Use --illegal-access=warn to enable warnings of further illegal reflective access operations
WARNING: All illegal access operations will be denied in a future release
> Task :runners:flink:1.15:validatesRunnerStreamingCheckpointing
FAILURE: Build completed with 2 failures.
1: Task failed with an exception.
-----------
* What went wrong:
Execution failed for task ':runners:flink:1.15:validatesRunnerBatchWithDataStream'.
> There were failing tests. See the report at: file://<https://ci-beam.apache.org/job/beam_PostCommit_Java_ValidatesRunner_Flink_Java11/ws/src/runners/flink/1.15/build/reports/tests/validatesRunnerBatchWithDataStream/index.html>
==============================================================================
2: Task failed with an exception.
-----------
* What went wrong:
Execution failed for task ':runners:flink:1.15:validatesRunnerStreaming'.
> There were failing tests. See the report at: file://<https://ci-beam.apache.org/job/beam_PostCommit_Java_ValidatesRunner_Flink_Java11/ws/src/runners/flink/1.15/build/reports/tests/validatesRunnerStreaming/index.html>
==============================================================================
Deprecated Gradle features were used in this build, making it incompatible with Gradle 9.0.
You can use '--warning-mode all' to show the individual deprecation warnings and determine if they come from your own scripts or plugins.
For more on this, please refer to https://docs.gradle.org/8.4/userguide/command_line_interface.html#sec:command_line_warnings in the Gradle documentation.
BUILD FAILED in 39m 41s
8 actionable tasks: 5 executed, 1 from cache, 2 up-to-date
Publishing build scan...
https://ge.apache.org/s/xfbtfd7c3vzaa
Build step 'Invoke Gradle script' changed build result to FAILURE
Build step 'Invoke Gradle script' marked build as failure
---------------------------------------------------------------------
To unsubscribe, e-mail: builds-unsubscribe@beam.apache.org
For additional commands, e-mail: builds-help@beam.apache.org
Build failed in Jenkins: beam_PostCommit_Java_ValidatesRunner_Flink_Java11 #5195
Posted by Apache Jenkins Server <je...@builds.apache.org>.
See <https://ci-beam.apache.org/job/beam_PostCommit_Java_ValidatesRunner_Flink_Java11/5195/display/redirect>
Changes:
------------------------------------------
[...truncated 1.37 KB...]
Fetching upstream changes from https://github.com/apache/beam.git
> git fetch --no-tags --force --progress --depth=1 -- https://github.com/apache/beam.git +refs/heads/*:refs/remotes/origin/* +refs/pull/${ghprbPullId}/*:refs/remotes/origin/pr/${ghprbPullId}/* # timeout=10
> git rev-parse origin/master^{commit} # timeout=10
Checking out Revision 1f4bc684ccc84856e68d3b27a22634a1d6ea1c4f (origin/master)
> git config core.sparsecheckout # timeout=10
> git checkout -f 1f4bc684ccc84856e68d3b27a22634a1d6ea1c4f # timeout=10
Commit message: "Garbage collect side inputs. (#29423)"
> git rev-list --no-walk 1f4bc684ccc84856e68d3b27a22634a1d6ea1c4f # timeout=10
No emails were triggered.
[EnvInject] - Executing scripts and injecting environment variables after the SCM step.
[EnvInject] - Injecting as environment variables the properties content
SETUPTOOLS_USE_DISTUTILS=stdlib
SPARK_LOCAL_IP=127.0.0.1
[EnvInject] - Variables injected successfully.
[Gradle] - Launching build.
[src] $ <https://ci-beam.apache.org/job/beam_PostCommit_Java_ValidatesRunner_Flink_Java11/ws/src/gradlew> -Dorg.gradle.java.home=/usr/lib/jvm/java-8-openjdk-amd64 :runners:flink:1.15:jar :runners:flink:1.15:testJar
To honour the JVM settings for this build a single-use Daemon process will be forked. For more on this, please refer to https://docs.gradle.org/8.4/userguide/gradle_daemon.html#sec:disabling_the_daemon in the Gradle documentation.
Daemon will be stopped at the end of the build
Configuration on demand is an incubating feature.
Gradle Enterprise plugins resolution: https://plugins.gradle.org/m2
Enforcing Gradle Enterprise: https://ge.apache.org, allowUntrustedServer: false
> Task :buildSrc:compileJava NO-SOURCE
> Task :buildSrc:compileGroovy FROM-CACHE
> Task :buildSrc:pluginDescriptors
> Task :buildSrc:processResources
> Task :buildSrc:classes
> Task :buildSrc:jar
> Task :runners:java-fn-execution:createCheckerFrameworkManifest
> Task :runners:core-java:createCheckerFrameworkManifest
> Task :sdks:java:fn-execution:createCheckerFrameworkManifest
> Task :model:pipeline:createCheckerFrameworkManifest
> Task :model:fn-execution:createCheckerFrameworkManifest
> Task :runners:core-construction-java:createCheckerFrameworkManifest
> Task :sdks:java:harness:createCheckerFrameworkManifest
> Task :sdks:java:extensions:avro:createCheckerFrameworkManifest
> Task :model:job-management:createCheckerFrameworkManifest
> Task :sdks:java:transform-service:launcher:createCheckerFrameworkManifest
> Task :sdks:java:core:createCheckerFrameworkManifest
> Task :sdks:java:build-tools:createCheckerFrameworkManifest
> Task :sdks:java:extensions:google-cloud-platform-core:createCheckerFrameworkManifest
> Task :runners:java-fn-execution:processResources NO-SOURCE
> Task :runners:java-job-service:createCheckerFrameworkManifest
> Task :sdks:java:expansion-service:createCheckerFrameworkManifest
> Task :sdks:java:extensions:avro:generateAvroProtocol NO-SOURCE
> Task :runners:flink:1.15:copySourceOverrides
> Task :runners:core-construction-java:processResources NO-SOURCE
> Task :sdks:java:harness:processResources NO-SOURCE
> Task :runners:core-java:processResources NO-SOURCE
> Task :sdks:java:fn-execution:processResources NO-SOURCE
> Task :runners:java-job-service:processResources NO-SOURCE
> Task :sdks:java:extensions:google-cloud-platform-core:processResources NO-SOURCE
> Task :runners:core-java:processTestResources NO-SOURCE
> Task :sdks:java:expansion-service:processResources NO-SOURCE
> Task :sdks:java:extensions:avro:generateAvroJava NO-SOURCE
> Task :sdks:java:extensions:avro:processResources NO-SOURCE
> Task :model:job-management:extractProto
> Task :model:fn-execution:extractProto
> Task :sdks:java:io:google-cloud-platform:createCheckerFrameworkManifest
> Task :runners:flink:1.15:createCheckerFrameworkManifest
> Task :sdks:java:io:google-cloud-platform:processResources NO-SOURCE
> Task :runners:flink:1.15:copyResourcesOverrides NO-SOURCE
> Task :sdks:java:extensions:protobuf:createCheckerFrameworkManifest
> Task :sdks:java:extensions:arrow:createCheckerFrameworkManifest
> Task :sdks:java:extensions:arrow:processResources NO-SOURCE
> Task :sdks:java:core:generateGrammarSource FROM-CACHE
> Task :runners:flink:1.15:processResources
> Task :sdks:java:extensions:protobuf:extractProto
> Task :model:job-management:processResources
> Task :sdks:java:extensions:protobuf:processResources NO-SOURCE
> Task :model:fn-execution:processResources
> Task :runners:flink:1.15:copyTestSourceOverrides
> Task :runners:flink:1.15:copyTestResourcesOverrides NO-SOURCE
> Task :runners:flink:1.15:processTestResources
> Task :sdks:java:core:processResources
> Task :sdks:java:core:generateTestGrammarSource NO-SOURCE
> Task :sdks:java:core:processTestResources
> Task :sdks:java:transform-service:launcher:compileJava FROM-CACHE
> Task :sdks:java:build-tools:compileJava FROM-CACHE
> Task :sdks:java:transform-service:launcher:processResources
> Task :sdks:java:build-tools:processResources
> Task :sdks:java:transform-service:launcher:classes
> Task :sdks:java:build-tools:classes
> Task :sdks:java:build-tools:jar
> Task :sdks:java:transform-service:launcher:jar
> Task :sdks:java:transform-service:launcher:shadowJar FROM-CACHE
> Task :model:pipeline:extractIncludeProto
> Task :model:pipeline:extractProto
> Task :model:pipeline:generateProto FROM-CACHE
> Task :model:pipeline:compileJava FROM-CACHE
> Task :model:pipeline:processResources
> Task :model:pipeline:classes
> Task :model:pipeline:jar
> Task :model:pipeline:shadowJar FROM-CACHE
> Task :model:fn-execution:extractIncludeProto
> Task :model:job-management:extractIncludeProto
> Task :model:job-management:generateProto FROM-CACHE
> Task :model:fn-execution:generateProto FROM-CACHE
> Task :model:job-management:compileJava FROM-CACHE
> Task :model:fn-execution:compileJava FROM-CACHE
> Task :model:job-management:classes
> Task :model:fn-execution:classes
> Task :model:job-management:shadowJar FROM-CACHE
> Task :model:fn-execution:shadowJar FROM-CACHE
> Task :sdks:java:core:compileJava FROM-CACHE
> Task :sdks:java:core:classes
> Task :sdks:java:core:shadowJar FROM-CACHE
> Task :sdks:java:extensions:protobuf:extractIncludeProto
> Task :sdks:java:extensions:protobuf:generateProto NO-SOURCE
> Task :sdks:java:extensions:arrow:compileJava FROM-CACHE
> Task :sdks:java:extensions:arrow:classes UP-TO-DATE
> Task :sdks:java:extensions:arrow:jar
> Task :sdks:java:extensions:avro:compileJava FROM-CACHE
> Task :sdks:java:extensions:avro:classes UP-TO-DATE
> Task :sdks:java:extensions:protobuf:compileJava FROM-CACHE
> Task :sdks:java:extensions:protobuf:classes UP-TO-DATE
> Task :sdks:java:extensions:protobuf:jar
> Task :sdks:java:extensions:avro:jar
> Task :sdks:java:fn-execution:compileJava FROM-CACHE
> Task :sdks:java:fn-execution:classes UP-TO-DATE
> Task :sdks:java:fn-execution:jar
> Task :runners:core-construction-java:compileJava FROM-CACHE
> Task :runners:core-construction-java:classes UP-TO-DATE
> Task :runners:core-construction-java:jar
> Task :runners:core-java:compileJava FROM-CACHE
> Task :runners:core-java:classes UP-TO-DATE
> Task :runners:core-java:jar
> Task :sdks:java:core:compileTestJava FROM-CACHE
> Task :sdks:java:core:testClasses
> Task :sdks:java:core:shadowTestJar FROM-CACHE
> Task :sdks:java:extensions:google-cloud-platform-core:compileJava FROM-CACHE
> Task :sdks:java:extensions:google-cloud-platform-core:classes UP-TO-DATE
> Task :sdks:java:extensions:google-cloud-platform-core:jar
> Task :sdks:java:harness:compileJava FROM-CACHE
> Task :sdks:java:harness:classes UP-TO-DATE
> Task :sdks:java:harness:jar
> Task :runners:core-java:compileTestJava FROM-CACHE
> Task :runners:core-java:testClasses UP-TO-DATE
> Task :runners:java-fn-execution:compileJava FROM-CACHE
> Task :runners:java-fn-execution:classes UP-TO-DATE
> Task :runners:core-java:testJar
> Task :runners:java-fn-execution:jar
> Task :sdks:java:expansion-service:compileJava FROM-CACHE
> Task :sdks:java:expansion-service:classes UP-TO-DATE
> Task :sdks:java:expansion-service:jar
> Task :runners:java-job-service:compileJava FROM-CACHE
> Task :runners:java-job-service:classes UP-TO-DATE
> Task :runners:java-job-service:jar
> Task :runners:flink:1.15:compileJava FROM-CACHE
> Task :runners:flink:1.15:classes
> Task :runners:flink:1.15:jar
> Task :sdks:java:io:google-cloud-platform:compileJava FROM-CACHE
> Task :sdks:java:io:google-cloud-platform:classes UP-TO-DATE
> Task :sdks:java:io:google-cloud-platform:jar
> Task :runners:flink:1.15:compileTestJava FROM-CACHE
> Task :runners:flink:1.15:testClasses
> Task :runners:flink:1.15:testJar
Deprecated Gradle features were used in this build, making it incompatible with Gradle 9.0.
You can use '--warning-mode all' to show the individual deprecation warnings and determine if they come from your own scripts or plugins.
For more on this, please refer to https://docs.gradle.org/8.4/userguide/command_line_interface.html#sec:command_line_warnings in the Gradle documentation.
BUILD SUCCESSFUL in 24s
92 actionable tasks: 59 executed, 33 from cache
Publishing build scan...
https://ge.apache.org/s/ojyuxemd6ay2e
Build step 'Invoke Gradle script' changed build result to SUCCESS
[Gradle] - Launching build.
[src] $ <https://ci-beam.apache.org/job/beam_PostCommit_Java_ValidatesRunner_Flink_Java11/ws/src/gradlew> -x shadowJar -x shadowTestJar -x compileJava -x compileTestJava -x jar -x testJar -x classes -x testClasses -Dorg.gradle.java.home=/usr/lib/jvm/java-11-openjdk-amd64 --continue --max-workers=12 -Dorg.gradle.jvmargs=-Xms2g -Dorg.gradle.jvmargs=-Xmx6g -Dorg.gradle.vfs.watch=false -Pdocker-pull-licenses :runners:flink:1.15:validatesRunner
To honour the JVM settings for this build a single-use Daemon process will be forked. For more on this, please refer to https://docs.gradle.org/8.4/userguide/gradle_daemon.html#sec:disabling_the_daemon in the Gradle documentation.
Daemon will be stopped at the end of the build
Configuration on demand is an incubating feature.
Gradle Enterprise plugins resolution: https://plugins.gradle.org/m2
Enforcing Gradle Enterprise: https://ge.apache.org, allowUntrustedServer: false
> Task :buildSrc:compileJava NO-SOURCE
> Task :buildSrc:compileGroovy FROM-CACHE
> Task :buildSrc:pluginDescriptors UP-TO-DATE
> Task :buildSrc:processResources UP-TO-DATE
> Task :buildSrc:classes UP-TO-DATE
> Task :buildSrc:jar
> Task :runners:flink:1.15:validatesRunnerBatch
WARNING: An illegal reflective access operation has occurred
WARNING: Illegal reflective access by org.apache.flink.api.java.ClosureCleaner (file:/home/jenkins/.gradle/caches/modules-2/files-2.1/org.apache.flink/flink-core/1.15.0/41836e7311354a678c72284a81fde0d0c48ed905/flink-core-1.15.0.jar) to field java.lang.String.value
WARNING: Please consider reporting this to the maintainers of org.apache.flink.api.java.ClosureCleaner
WARNING: Use --illegal-access=warn to enable warnings of further illegal reflective access operations
WARNING: All illegal access operations will be denied in a future release
WARNING: An illegal reflective access operation has occurred
WARNING: Illegal reflective access by org.apache.flink.api.java.ClosureCleaner (file:/home/jenkins/.gradle/caches/modules-2/files-2.1/org.apache.flink/flink-core/1.15.0/41836e7311354a678c72284a81fde0d0c48ed905/flink-core-1.15.0.jar) to field java.lang.String.value
WARNING: Please consider reporting this to the maintainers of org.apache.flink.api.java.ClosureCleaner
WARNING: Use --illegal-access=warn to enable warnings of further illegal reflective access operations
WARNING: All illegal access operations will be denied in a future release
WARNING: An illegal reflective access operation has occurred
WARNING: Illegal reflective access by org.apache.flink.api.java.ClosureCleaner (file:/home/jenkins/.gradle/caches/modules-2/files-2.1/org.apache.flink/flink-core/1.15.0/41836e7311354a678c72284a81fde0d0c48ed905/flink-core-1.15.0.jar) to field java.lang.String.value
WARNING: Please consider reporting this to the maintainers of org.apache.flink.api.java.ClosureCleaner
WARNING: Use --illegal-access=warn to enable warnings of further illegal reflective access operations
WARNING: All illegal access operations will be denied in a future release
> Task :runners:flink:1.15:validatesRunnerBatchWithDataStream
org.apache.beam.sdk.transforms.ViewTest > testTriggeredLatestSingleton FAILED
org.apache.beam.sdk.Pipeline$PipelineExecutionException at ViewTest.java:330
Caused by: java.lang.IllegalArgumentException at PCollectionViews.java:412
294 tests completed, 1 failed, 1 skipped
> Task :runners:flink:1.15:validatesRunnerBatchWithDataStream FAILED
WARNING: An illegal reflective access operation has occurred
WARNING: Illegal reflective access by org.apache.flink.api.java.ClosureCleaner (file:/home/jenkins/.gradle/caches/modules-2/files-2.1/org.apache.flink/flink-core/1.15.0/41836e7311354a678c72284a81fde0d0c48ed905/flink-core-1.15.0.jar) to field java.lang.String.value
WARNING: Please consider reporting this to the maintainers of org.apache.flink.api.java.ClosureCleaner
WARNING: Use --illegal-access=warn to enable warnings of further illegal reflective access operations
WARNING: All illegal access operations will be denied in a future release
WARNING: An illegal reflective access operation has occurred
WARNING: Illegal reflective access by org.apache.flink.api.java.ClosureCleaner (file:/home/jenkins/.gradle/caches/modules-2/files-2.1/org.apache.flink/flink-core/1.15.0/41836e7311354a678c72284a81fde0d0c48ed905/flink-core-1.15.0.jar) to field java.lang.String.value
WARNING: Please consider reporting this to the maintainers of org.apache.flink.api.java.ClosureCleaner
WARNING: Use --illegal-access=warn to enable warnings of further illegal reflective access operations
WARNING: All illegal access operations will be denied in a future release
> Task :runners:flink:1.15:validatesRunnerStreaming
WARNING: An illegal reflective access operation has occurred
WARNING: Illegal reflective access by org.apache.flink.api.java.ClosureCleaner (file:/home/jenkins/.gradle/caches/modules-2/files-2.1/org.apache.flink/flink-core/1.15.0/41836e7311354a678c72284a81fde0d0c48ed905/flink-core-1.15.0.jar) to field java.lang.String.value
WARNING: Please consider reporting this to the maintainers of org.apache.flink.api.java.ClosureCleaner
WARNING: Use --illegal-access=warn to enable warnings of further illegal reflective access operations
WARNING: All illegal access operations will be denied in a future release
> Task :runners:flink:1.15:validatesRunnerStreamingCheckpointing
FAILURE: Build failed with an exception.
* What went wrong:
Execution failed for task ':runners:flink:1.15:validatesRunnerBatchWithDataStream'.
> There were failing tests. See the report at: file://<https://ci-beam.apache.org/job/beam_PostCommit_Java_ValidatesRunner_Flink_Java11/ws/src/runners/flink/1.15/build/reports/tests/validatesRunnerBatchWithDataStream/index.html>
Deprecated Gradle features were used in this build, making it incompatible with Gradle 9.0.
You can use '--warning-mode all' to show the individual deprecation warnings and determine if they come from your own scripts or plugins.
For more on this, please refer to https://docs.gradle.org/8.4/userguide/command_line_interface.html#sec:command_line_warnings in the Gradle documentation.
BUILD FAILED in 41m 33s
8 actionable tasks: 5 executed, 1 from cache, 2 up-to-date
Publishing build scan...
https://ge.apache.org/s/nr5wjl5ji7c7a
Build step 'Invoke Gradle script' changed build result to FAILURE
Build step 'Invoke Gradle script' marked build as failure
---------------------------------------------------------------------
To unsubscribe, e-mail: builds-unsubscribe@beam.apache.org
For additional commands, e-mail: builds-help@beam.apache.org
Build failed in Jenkins: beam_PostCommit_Java_ValidatesRunner_Flink_Java11 #5194
Posted by Apache Jenkins Server <je...@builds.apache.org>.
See <https://ci-beam.apache.org/job/beam_PostCommit_Java_ValidatesRunner_Flink_Java11/5194/display/redirect?page=changes>
Changes:
[noreply] Garbage collect side inputs. (#29423)
------------------------------------------
[...truncated 1.37 KB...]
Fetching upstream changes from https://github.com/apache/beam.git
> git fetch --no-tags --force --progress --depth=1 -- https://github.com/apache/beam.git +refs/heads/*:refs/remotes/origin/* +refs/pull/${ghprbPullId}/*:refs/remotes/origin/pr/${ghprbPullId}/* # timeout=10
> git rev-parse origin/master^{commit} # timeout=10
Checking out Revision 1f4bc684ccc84856e68d3b27a22634a1d6ea1c4f (origin/master)
> git config core.sparsecheckout # timeout=10
> git checkout -f 1f4bc684ccc84856e68d3b27a22634a1d6ea1c4f # timeout=10
Commit message: "Garbage collect side inputs. (#29423)"
> git rev-list --no-walk 427faae497db525e8cddd6a307ecddf4c9539919 # timeout=10
No emails were triggered.
[EnvInject] - Executing scripts and injecting environment variables after the SCM step.
[EnvInject] - Injecting as environment variables the properties content
SETUPTOOLS_USE_DISTUTILS=stdlib
SPARK_LOCAL_IP=127.0.0.1
[EnvInject] - Variables injected successfully.
[Gradle] - Launching build.
[src] $ <https://ci-beam.apache.org/job/beam_PostCommit_Java_ValidatesRunner_Flink_Java11/ws/src/gradlew> -Dorg.gradle.java.home=/usr/lib/jvm/java-8-openjdk-amd64 :runners:flink:1.15:jar :runners:flink:1.15:testJar
To honour the JVM settings for this build a single-use Daemon process will be forked. For more on this, please refer to https://docs.gradle.org/8.4/userguide/gradle_daemon.html#sec:disabling_the_daemon in the Gradle documentation.
Daemon will be stopped at the end of the build
Configuration on demand is an incubating feature.
Gradle Enterprise plugins resolution: https://plugins.gradle.org/m2
Enforcing Gradle Enterprise: https://ge.apache.org, allowUntrustedServer: false
> Task :buildSrc:compileJava NO-SOURCE
> Task :buildSrc:compileGroovy FROM-CACHE
> Task :buildSrc:pluginDescriptors
> Task :buildSrc:processResources
> Task :buildSrc:classes
> Task :buildSrc:jar
> Task :sdks:java:fn-execution:createCheckerFrameworkManifest
> Task :model:job-management:createCheckerFrameworkManifest
> Task :runners:core-java:createCheckerFrameworkManifest
> Task :model:pipeline:createCheckerFrameworkManifest
> Task :sdks:java:core:createCheckerFrameworkManifest
> Task :model:fn-execution:createCheckerFrameworkManifest
> Task :sdks:java:harness:createCheckerFrameworkManifest
> Task :sdks:java:extensions:avro:createCheckerFrameworkManifest
> Task :runners:core-construction-java:createCheckerFrameworkManifest
> Task :runners:java-job-service:createCheckerFrameworkManifest
> Task :sdks:java:transform-service:launcher:createCheckerFrameworkManifest
> Task :runners:core-java:processResources NO-SOURCE
> Task :sdks:java:fn-execution:processResources NO-SOURCE
> Task :sdks:java:harness:processResources NO-SOURCE
> Task :sdks:java:extensions:avro:generateAvroProtocol NO-SOURCE
> Task :sdks:java:extensions:google-cloud-platform-core:createCheckerFrameworkManifest
> Task :sdks:java:build-tools:createCheckerFrameworkManifest
> Task :runners:java-fn-execution:createCheckerFrameworkManifest
> Task :runners:core-construction-java:processResources NO-SOURCE
> Task :sdks:java:expansion-service:createCheckerFrameworkManifest
> Task :runners:java-job-service:processResources NO-SOURCE
> Task :runners:core-java:processTestResources NO-SOURCE
> Task :sdks:java:extensions:avro:generateAvroJava NO-SOURCE
> Task :sdks:java:expansion-service:processResources NO-SOURCE
> Task :runners:java-fn-execution:processResources NO-SOURCE
> Task :runners:flink:1.15:copySourceOverrides
> Task :sdks:java:extensions:avro:processResources NO-SOURCE
> Task :model:fn-execution:extractProto
> Task :sdks:java:extensions:google-cloud-platform-core:processResources NO-SOURCE
> Task :model:job-management:extractProto
> Task :sdks:java:extensions:protobuf:createCheckerFrameworkManifest
> Task :sdks:java:io:google-cloud-platform:createCheckerFrameworkManifest
> Task :sdks:java:extensions:arrow:createCheckerFrameworkManifest
> Task :sdks:java:io:google-cloud-platform:processResources NO-SOURCE
> Task :sdks:java:extensions:protobuf:extractProto
> Task :sdks:java:core:generateGrammarSource FROM-CACHE
> Task :sdks:java:extensions:arrow:processResources NO-SOURCE
> Task :sdks:java:extensions:protobuf:processResources NO-SOURCE
> Task :runners:flink:1.15:createCheckerFrameworkManifest
> Task :runners:flink:1.15:copyResourcesOverrides NO-SOURCE
> Task :model:job-management:processResources
> Task :model:fn-execution:processResources
> Task :runners:flink:1.15:processResources
> Task :sdks:java:core:processResources
> Task :runners:flink:1.15:copyTestSourceOverrides
> Task :sdks:java:core:generateTestGrammarSource NO-SOURCE
> Task :runners:flink:1.15:copyTestResourcesOverrides NO-SOURCE
> Task :runners:flink:1.15:processTestResources
> Task :sdks:java:core:processTestResources
> Task :sdks:java:build-tools:compileJava FROM-CACHE
> Task :sdks:java:transform-service:launcher:compileJava FROM-CACHE
> Task :sdks:java:transform-service:launcher:processResources
> Task :sdks:java:transform-service:launcher:classes
> Task :sdks:java:build-tools:processResources
> Task :sdks:java:build-tools:classes
> Task :sdks:java:transform-service:launcher:jar
> Task :sdks:java:build-tools:jar
> Task :sdks:java:transform-service:launcher:shadowJar FROM-CACHE
> Task :model:pipeline:extractIncludeProto
> Task :model:pipeline:extractProto
> Task :model:pipeline:generateProto FROM-CACHE
> Task :model:pipeline:compileJava FROM-CACHE
> Task :model:pipeline:processResources
> Task :model:pipeline:classes
> Task :model:pipeline:jar
> Task :model:pipeline:shadowJar FROM-CACHE
> Task :model:fn-execution:extractIncludeProto
> Task :model:job-management:extractIncludeProto
> Task :model:job-management:generateProto FROM-CACHE
> Task :model:fn-execution:generateProto FROM-CACHE
> Task :model:job-management:compileJava FROM-CACHE
> Task :model:job-management:classes
> Task :model:fn-execution:compileJava FROM-CACHE
> Task :model:fn-execution:classes
> Task :model:job-management:shadowJar FROM-CACHE
> Task :model:fn-execution:shadowJar FROM-CACHE
> Task :sdks:java:core:compileJava FROM-CACHE
> Task :sdks:java:core:classes
> Task :sdks:java:core:shadowJar FROM-CACHE
> Task :sdks:java:extensions:protobuf:extractIncludeProto
> Task :sdks:java:extensions:protobuf:generateProto NO-SOURCE
> Task :sdks:java:extensions:arrow:compileJava FROM-CACHE
> Task :sdks:java:extensions:arrow:classes UP-TO-DATE
> Task :sdks:java:extensions:arrow:jar
> Task :sdks:java:extensions:avro:compileJava FROM-CACHE
> Task :sdks:java:extensions:avro:classes UP-TO-DATE
> Task :sdks:java:extensions:avro:jar
> Task :sdks:java:fn-execution:compileJava FROM-CACHE
> Task :sdks:java:fn-execution:classes UP-TO-DATE
> Task :sdks:java:fn-execution:jar
> Task :sdks:java:extensions:protobuf:compileJava FROM-CACHE
> Task :sdks:java:extensions:protobuf:classes UP-TO-DATE
> Task :runners:core-construction-java:compileJava FROM-CACHE
> Task :runners:core-construction-java:classes UP-TO-DATE
> Task :sdks:java:extensions:protobuf:jar
> Task :runners:core-construction-java:jar
> Task :runners:core-java:compileJava FROM-CACHE
> Task :runners:core-java:classes UP-TO-DATE
> Task :sdks:java:core:compileTestJava FROM-CACHE
> Task :sdks:java:core:testClasses
> Task :runners:core-java:jar
> Task :sdks:java:core:shadowTestJar FROM-CACHE
> Task :sdks:java:extensions:google-cloud-platform-core:compileJava FROM-CACHE
> Task :sdks:java:extensions:google-cloud-platform-core:classes UP-TO-DATE
> Task :sdks:java:extensions:google-cloud-platform-core:jar
> Task :sdks:java:harness:compileJava FROM-CACHE
> Task :sdks:java:harness:classes UP-TO-DATE
> Task :sdks:java:harness:jar
> Task :runners:java-fn-execution:compileJava FROM-CACHE
> Task :runners:java-fn-execution:classes UP-TO-DATE
> Task :runners:core-java:compileTestJava FROM-CACHE
> Task :runners:core-java:testClasses UP-TO-DATE
> Task :runners:java-fn-execution:jar
> Task :runners:core-java:testJar
> Task :sdks:java:expansion-service:compileJava FROM-CACHE
> Task :sdks:java:expansion-service:classes UP-TO-DATE
> Task :sdks:java:expansion-service:jar
> Task :runners:java-job-service:compileJava FROM-CACHE
> Task :runners:java-job-service:classes UP-TO-DATE
> Task :runners:java-job-service:jar
> Task :runners:flink:1.15:compileJava FROM-CACHE
> Task :runners:flink:1.15:classes
> Task :runners:flink:1.15:jar
> Task :sdks:java:io:google-cloud-platform:compileJava FROM-CACHE
> Task :sdks:java:io:google-cloud-platform:classes UP-TO-DATE
> Task :sdks:java:io:google-cloud-platform:jar
> Task :runners:flink:1.15:compileTestJava FROM-CACHE
> Task :runners:flink:1.15:testClasses
> Task :runners:flink:1.15:testJar
Deprecated Gradle features were used in this build, making it incompatible with Gradle 9.0.
You can use '--warning-mode all' to show the individual deprecation warnings and determine if they come from your own scripts or plugins.
For more on this, please refer to https://docs.gradle.org/8.4/userguide/command_line_interface.html#sec:command_line_warnings in the Gradle documentation.
BUILD SUCCESSFUL in 29s
92 actionable tasks: 59 executed, 33 from cache
Publishing build scan...
https://ge.apache.org/s/x7fic4rxuvdrk
Build step 'Invoke Gradle script' changed build result to SUCCESS
[Gradle] - Launching build.
[src] $ <https://ci-beam.apache.org/job/beam_PostCommit_Java_ValidatesRunner_Flink_Java11/ws/src/gradlew> -x shadowJar -x shadowTestJar -x compileJava -x compileTestJava -x jar -x testJar -x classes -x testClasses -Dorg.gradle.java.home=/usr/lib/jvm/java-11-openjdk-amd64 --continue --max-workers=12 -Dorg.gradle.jvmargs=-Xms2g -Dorg.gradle.jvmargs=-Xmx6g -Dorg.gradle.vfs.watch=false -Pdocker-pull-licenses :runners:flink:1.15:validatesRunner
To honour the JVM settings for this build a single-use Daemon process will be forked. For more on this, please refer to https://docs.gradle.org/8.4/userguide/gradle_daemon.html#sec:disabling_the_daemon in the Gradle documentation.
Daemon will be stopped at the end of the build
Configuration on demand is an incubating feature.
Gradle Enterprise plugins resolution: https://plugins.gradle.org/m2
Enforcing Gradle Enterprise: https://ge.apache.org, allowUntrustedServer: false
> Task :buildSrc:compileJava NO-SOURCE
> Task :buildSrc:compileGroovy FROM-CACHE
> Task :buildSrc:pluginDescriptors UP-TO-DATE
> Task :buildSrc:processResources UP-TO-DATE
> Task :buildSrc:classes UP-TO-DATE
> Task :buildSrc:jar
> Task :runners:flink:1.15:validatesRunnerBatch
WARNING: An illegal reflective access operation has occurred
WARNING: Illegal reflective access by org.apache.flink.api.java.ClosureCleaner (file:/home/jenkins/.gradle/caches/modules-2/files-2.1/org.apache.flink/flink-core/1.15.0/41836e7311354a678c72284a81fde0d0c48ed905/flink-core-1.15.0.jar) to field java.lang.String.value
WARNING: Please consider reporting this to the maintainers of org.apache.flink.api.java.ClosureCleaner
WARNING: Use --illegal-access=warn to enable warnings of further illegal reflective access operations
WARNING: All illegal access operations will be denied in a future release
WARNING: An illegal reflective access operation has occurred
WARNING: Illegal reflective access by org.apache.flink.api.java.ClosureCleaner (file:/home/jenkins/.gradle/caches/modules-2/files-2.1/org.apache.flink/flink-core/1.15.0/41836e7311354a678c72284a81fde0d0c48ed905/flink-core-1.15.0.jar) to field java.lang.String.value
WARNING: Please consider reporting this to the maintainers of org.apache.flink.api.java.ClosureCleaner
WARNING: Use --illegal-access=warn to enable warnings of further illegal reflective access operations
WARNING: All illegal access operations will be denied in a future release
WARNING: An illegal reflective access operation has occurred
WARNING: Illegal reflective access by org.apache.flink.api.java.ClosureCleaner (file:/home/jenkins/.gradle/caches/modules-2/files-2.1/org.apache.flink/flink-core/1.15.0/41836e7311354a678c72284a81fde0d0c48ed905/flink-core-1.15.0.jar) to field java.lang.String.value
WARNING: Please consider reporting this to the maintainers of org.apache.flink.api.java.ClosureCleaner
WARNING: Use --illegal-access=warn to enable warnings of further illegal reflective access operations
WARNING: All illegal access operations will be denied in a future release
> Task :runners:flink:1.15:validatesRunnerBatchWithDataStream
org.apache.beam.sdk.transforms.ViewTest > testTriggeredLatestSingleton FAILED
org.apache.beam.sdk.Pipeline$PipelineExecutionException at ViewTest.java:330
Caused by: java.lang.IllegalArgumentException at PCollectionViews.java:412
294 tests completed, 1 failed, 1 skipped
> Task :runners:flink:1.15:validatesRunnerBatchWithDataStream FAILED
WARNING: An illegal reflective access operation has occurred
WARNING: Illegal reflective access by org.apache.flink.api.java.ClosureCleaner (file:/home/jenkins/.gradle/caches/modules-2/files-2.1/org.apache.flink/flink-core/1.15.0/41836e7311354a678c72284a81fde0d0c48ed905/flink-core-1.15.0.jar) to field java.lang.String.value
WARNING: Please consider reporting this to the maintainers of org.apache.flink.api.java.ClosureCleaner
WARNING: Use --illegal-access=warn to enable warnings of further illegal reflective access operations
WARNING: All illegal access operations will be denied in a future release
WARNING: An illegal reflective access operation has occurred
WARNING: Illegal reflective access by org.apache.flink.api.java.ClosureCleaner (file:/home/jenkins/.gradle/caches/modules-2/files-2.1/org.apache.flink/flink-core/1.15.0/41836e7311354a678c72284a81fde0d0c48ed905/flink-core-1.15.0.jar) to field java.lang.String.value
WARNING: Please consider reporting this to the maintainers of org.apache.flink.api.java.ClosureCleaner
WARNING: Use --illegal-access=warn to enable warnings of further illegal reflective access operations
WARNING: All illegal access operations will be denied in a future release
> Task :runners:flink:1.15:validatesRunnerStreaming
WARNING: An illegal reflective access operation has occurred
WARNING: Illegal reflective access by org.apache.flink.api.java.ClosureCleaner (file:/home/jenkins/.gradle/caches/modules-2/files-2.1/org.apache.flink/flink-core/1.15.0/41836e7311354a678c72284a81fde0d0c48ed905/flink-core-1.15.0.jar) to field java.lang.String.value
WARNING: Please consider reporting this to the maintainers of org.apache.flink.api.java.ClosureCleaner
WARNING: Use --illegal-access=warn to enable warnings of further illegal reflective access operations
WARNING: All illegal access operations will be denied in a future release
> Task :runners:flink:1.15:validatesRunnerStreamingCheckpointing
FAILURE: Build failed with an exception.
* What went wrong:
Execution failed for task ':runners:flink:1.15:validatesRunnerBatchWithDataStream'.
> There were failing tests. See the report at: file://<https://ci-beam.apache.org/job/beam_PostCommit_Java_ValidatesRunner_Flink_Java11/ws/src/runners/flink/1.15/build/reports/tests/validatesRunnerBatchWithDataStream/index.html>
Deprecated Gradle features were used in this build, making it incompatible with Gradle 9.0.
You can use '--warning-mode all' to show the individual deprecation warnings and determine if they come from your own scripts or plugins.
For more on this, please refer to https://docs.gradle.org/8.4/userguide/command_line_interface.html#sec:command_line_warnings in the Gradle documentation.
BUILD FAILED in 38m 46s
8 actionable tasks: 5 executed, 1 from cache, 2 up-to-date
Publishing build scan...
https://ge.apache.org/s/bx2gndfjwlsow
Build step 'Invoke Gradle script' changed build result to FAILURE
Build step 'Invoke Gradle script' marked build as failure
---------------------------------------------------------------------
To unsubscribe, e-mail: builds-unsubscribe@beam.apache.org
For additional commands, e-mail: builds-help@beam.apache.org
Build failed in Jenkins: beam_PostCommit_Java_ValidatesRunner_Flink_Java11 #5193
Posted by Apache Jenkins Server <je...@builds.apache.org>.
See <https://ci-beam.apache.org/job/beam_PostCommit_Java_ValidatesRunner_Flink_Java11/5193/display/redirect>
Changes:
------------------------------------------
[...truncated 1.40 KB...]
> git fetch --no-tags --force --progress --depth=1 -- https://github.com/apache/beam.git +refs/heads/*:refs/remotes/origin/* +refs/pull/${ghprbPullId}/*:refs/remotes/origin/pr/${ghprbPullId}/* # timeout=10
> git rev-parse origin/master^{commit} # timeout=10
Checking out Revision 427faae497db525e8cddd6a307ecddf4c9539919 (origin/master)
> git config core.sparsecheckout # timeout=10
> git checkout -f 427faae497db525e8cddd6a307ecddf4c9539919 # timeout=10
Commit message: "Add logging in data plane code when processing is stuck waiting on data for an instruction. (#29399)"
> git rev-list --no-walk b35fd2a5de072b70da6f69fc467e73927c835df4 # timeout=10
First time build. Skipping changelog.
No emails were triggered.
[EnvInject] - Executing scripts and injecting environment variables after the SCM step.
[EnvInject] - Injecting as environment variables the properties content
SETUPTOOLS_USE_DISTUTILS=stdlib
SPARK_LOCAL_IP=127.0.0.1
[EnvInject] - Variables injected successfully.
[Gradle] - Launching build.
[src] $ <https://ci-beam.apache.org/job/beam_PostCommit_Java_ValidatesRunner_Flink_Java11/ws/src/gradlew> -Dorg.gradle.java.home=/usr/lib/jvm/java-8-openjdk-amd64 :runners:flink:1.15:jar :runners:flink:1.15:testJar
To honour the JVM settings for this build a single-use Daemon process will be forked. For more on this, please refer to https://docs.gradle.org/8.4/userguide/gradle_daemon.html#sec:disabling_the_daemon in the Gradle documentation.
Daemon will be stopped at the end of the build
Configuration on demand is an incubating feature.
Gradle Enterprise plugins resolution: https://plugins.gradle.org/m2
Enforcing Gradle Enterprise: https://ge.apache.org, allowUntrustedServer: false
> Task :buildSrc:compileJava NO-SOURCE
> Task :buildSrc:compileGroovy FROM-CACHE
> Task :buildSrc:pluginDescriptors
> Task :buildSrc:processResources
> Task :buildSrc:classes
> Task :buildSrc:jar
> Task :sdks:java:transform-service:launcher:createCheckerFrameworkManifest
> Task :sdks:java:core:createCheckerFrameworkManifest
> Task :sdks:java:expansion-service:createCheckerFrameworkManifest
> Task :sdks:java:fn-execution:createCheckerFrameworkManifest
> Task :sdks:java:extensions:avro:createCheckerFrameworkManifest
> Task :runners:java-fn-execution:createCheckerFrameworkManifest
> Task :sdks:java:harness:createCheckerFrameworkManifest
> Task :runners:core-java:createCheckerFrameworkManifest
> Task :model:job-management:createCheckerFrameworkManifest
> Task :runners:java-job-service:createCheckerFrameworkManifest
> Task :runners:core-construction-java:createCheckerFrameworkManifest
> Task :model:pipeline:createCheckerFrameworkManifest
> Task :model:fn-execution:createCheckerFrameworkManifest
> Task :sdks:java:extensions:avro:generateAvroProtocol NO-SOURCE
> Task :sdks:java:extensions:google-cloud-platform-core:createCheckerFrameworkManifest
> Task :sdks:java:build-tools:createCheckerFrameworkManifest
> Task :runners:java-fn-execution:processResources NO-SOURCE
> Task :sdks:java:harness:processResources NO-SOURCE
> Task :sdks:java:expansion-service:processResources NO-SOURCE
> Task :sdks:java:fn-execution:processResources NO-SOURCE
> Task :runners:core-java:processResources NO-SOURCE
> Task :runners:flink:1.15:copySourceOverrides
> Task :sdks:java:extensions:avro:generateAvroJava NO-SOURCE
> Task :runners:core-construction-java:processResources NO-SOURCE
> Task :runners:core-java:processTestResources NO-SOURCE
> Task :runners:java-job-service:processResources NO-SOURCE
> Task :sdks:java:extensions:google-cloud-platform-core:processResources NO-SOURCE
> Task :sdks:java:extensions:avro:processResources NO-SOURCE
> Task :model:fn-execution:extractProto
> Task :model:job-management:extractProto
> Task :sdks:java:extensions:protobuf:createCheckerFrameworkManifest
> Task :runners:flink:1.15:createCheckerFrameworkManifest
> Task :sdks:java:io:google-cloud-platform:createCheckerFrameworkManifest
> Task :runners:flink:1.15:copyResourcesOverrides NO-SOURCE
> Task :sdks:java:extensions:protobuf:extractProto
> Task :sdks:java:extensions:arrow:createCheckerFrameworkManifest
> Task :sdks:java:core:generateGrammarSource FROM-CACHE
> Task :sdks:java:extensions:protobuf:processResources NO-SOURCE
> Task :sdks:java:io:google-cloud-platform:processResources NO-SOURCE
> Task :model:job-management:processResources
> Task :sdks:java:extensions:arrow:processResources NO-SOURCE
> Task :runners:flink:1.15:processResources
> Task :model:fn-execution:processResources
> Task :runners:flink:1.15:copyTestSourceOverrides
> Task :runners:flink:1.15:copyTestResourcesOverrides NO-SOURCE
> Task :sdks:java:core:processResources
> Task :sdks:java:core:generateTestGrammarSource NO-SOURCE
> Task :runners:flink:1.15:processTestResources
> Task :sdks:java:core:processTestResources
> Task :sdks:java:transform-service:launcher:compileJava FROM-CACHE
> Task :sdks:java:transform-service:launcher:processResources
> Task :sdks:java:transform-service:launcher:classes
> Task :sdks:java:transform-service:launcher:jar
> Task :sdks:java:transform-service:launcher:shadowJar FROM-CACHE
> Task :model:pipeline:extractIncludeProto
> Task :model:pipeline:extractProto
> Task :sdks:java:build-tools:compileJava FROM-CACHE
> Task :sdks:java:build-tools:processResources
> Task :sdks:java:build-tools:classes
> Task :sdks:java:build-tools:jar
> Task :model:pipeline:generateProto FROM-CACHE
> Task :model:pipeline:compileJava FROM-CACHE
> Task :model:pipeline:processResources
> Task :model:pipeline:classes
> Task :model:pipeline:jar
> Task :model:pipeline:shadowJar FROM-CACHE
> Task :model:job-management:extractIncludeProto
> Task :model:fn-execution:extractIncludeProto
> Task :model:job-management:generateProto FROM-CACHE
> Task :model:fn-execution:generateProto FROM-CACHE
> Task :model:job-management:compileJava FROM-CACHE
> Task :model:job-management:classes
> Task :model:fn-execution:compileJava FROM-CACHE
> Task :model:fn-execution:classes
> Task :model:job-management:shadowJar FROM-CACHE
> Task :model:fn-execution:shadowJar FROM-CACHE
> Task :sdks:java:core:compileJava FROM-CACHE
> Task :sdks:java:core:classes
> Task :sdks:java:core:shadowJar FROM-CACHE
> Task :sdks:java:extensions:protobuf:extractIncludeProto
> Task :sdks:java:extensions:protobuf:generateProto NO-SOURCE
> Task :sdks:java:extensions:avro:compileJava FROM-CACHE
> Task :sdks:java:extensions:avro:classes UP-TO-DATE
> Task :sdks:java:extensions:arrow:compileJava FROM-CACHE
> Task :sdks:java:extensions:arrow:classes UP-TO-DATE
> Task :sdks:java:extensions:arrow:jar
> Task :sdks:java:extensions:avro:jar
> Task :sdks:java:fn-execution:compileJava FROM-CACHE
> Task :sdks:java:fn-execution:classes UP-TO-DATE
> Task :sdks:java:fn-execution:jar
> Task :runners:core-construction-java:compileJava FROM-CACHE
> Task :sdks:java:extensions:protobuf:compileJava FROM-CACHE
> Task :runners:core-construction-java:classes UP-TO-DATE
> Task :sdks:java:extensions:protobuf:classes UP-TO-DATE
> Task :sdks:java:extensions:protobuf:jar
> Task :runners:core-construction-java:jar
> Task :runners:core-java:compileJava FROM-CACHE
> Task :runners:core-java:classes UP-TO-DATE
> Task :runners:core-java:jar
> Task :sdks:java:extensions:google-cloud-platform-core:compileJava FROM-CACHE
> Task :sdks:java:extensions:google-cloud-platform-core:classes UP-TO-DATE
> Task :sdks:java:extensions:google-cloud-platform-core:jar
> Task :sdks:java:core:compileTestJava FROM-CACHE
> Task :sdks:java:core:testClasses
> Task :sdks:java:harness:compileJava FROM-CACHE
> Task :sdks:java:harness:classes UP-TO-DATE
> Task :sdks:java:harness:jar
> Task :runners:java-fn-execution:compileJava FROM-CACHE
> Task :runners:java-fn-execution:classes UP-TO-DATE
> Task :sdks:java:core:shadowTestJar FROM-CACHE
> Task :runners:java-fn-execution:jar
> Task :sdks:java:expansion-service:compileJava FROM-CACHE
> Task :sdks:java:expansion-service:classes UP-TO-DATE
> Task :sdks:java:expansion-service:jar
> Task :runners:java-job-service:compileJava FROM-CACHE
> Task :runners:java-job-service:classes UP-TO-DATE
> Task :runners:java-job-service:jar
> Task :runners:core-java:compileTestJava FROM-CACHE
> Task :runners:core-java:testClasses UP-TO-DATE
> Task :runners:core-java:testJar
> Task :sdks:java:io:google-cloud-platform:compileJava FROM-CACHE
> Task :runners:flink:1.15:compileJava FROM-CACHE
> Task :runners:flink:1.15:classes
> Task :sdks:java:io:google-cloud-platform:classes UP-TO-DATE
> Task :runners:flink:1.15:jar
> Task :sdks:java:io:google-cloud-platform:jar
> Task :runners:flink:1.15:compileTestJava FROM-CACHE
> Task :runners:flink:1.15:testClasses
> Task :runners:flink:1.15:testJar
Deprecated Gradle features were used in this build, making it incompatible with Gradle 9.0.
You can use '--warning-mode all' to show the individual deprecation warnings and determine if they come from your own scripts or plugins.
For more on this, please refer to https://docs.gradle.org/8.4/userguide/command_line_interface.html#sec:command_line_warnings in the Gradle documentation.
BUILD SUCCESSFUL in 27s
92 actionable tasks: 59 executed, 33 from cache
Publishing build scan...
https://ge.apache.org/s/3sdnklult7vbe
Build step 'Invoke Gradle script' changed build result to SUCCESS
[Gradle] - Launching build.
[src] $ <https://ci-beam.apache.org/job/beam_PostCommit_Java_ValidatesRunner_Flink_Java11/ws/src/gradlew> -x shadowJar -x shadowTestJar -x compileJava -x compileTestJava -x jar -x testJar -x classes -x testClasses -Dorg.gradle.java.home=/usr/lib/jvm/java-11-openjdk-amd64 --continue --max-workers=12 -Dorg.gradle.jvmargs=-Xms2g -Dorg.gradle.jvmargs=-Xmx6g -Dorg.gradle.vfs.watch=false -Pdocker-pull-licenses :runners:flink:1.15:validatesRunner
To honour the JVM settings for this build a single-use Daemon process will be forked. For more on this, please refer to https://docs.gradle.org/8.4/userguide/gradle_daemon.html#sec:disabling_the_daemon in the Gradle documentation.
Daemon will be stopped at the end of the build
Configuration on demand is an incubating feature.
Gradle Enterprise plugins resolution: https://plugins.gradle.org/m2
Enforcing Gradle Enterprise: https://ge.apache.org, allowUntrustedServer: false
> Task :buildSrc:compileJava NO-SOURCE
> Task :buildSrc:compileGroovy FROM-CACHE
> Task :buildSrc:pluginDescriptors UP-TO-DATE
> Task :buildSrc:processResources UP-TO-DATE
> Task :buildSrc:classes UP-TO-DATE
> Task :buildSrc:jar
> Task :runners:flink:1.15:validatesRunnerBatch
WARNING: An illegal reflective access operation has occurred
WARNING: Illegal reflective access by org.apache.flink.api.java.ClosureCleaner (file:/home/jenkins/.gradle/caches/modules-2/files-2.1/org.apache.flink/flink-core/1.15.0/41836e7311354a678c72284a81fde0d0c48ed905/flink-core-1.15.0.jar) to field java.lang.String.value
WARNING: Please consider reporting this to the maintainers of org.apache.flink.api.java.ClosureCleaner
WARNING: Use --illegal-access=warn to enable warnings of further illegal reflective access operations
WARNING: All illegal access operations will be denied in a future release
WARNING: An illegal reflective access operation has occurred
WARNING: Illegal reflective access by org.apache.flink.api.java.ClosureCleaner (file:/home/jenkins/.gradle/caches/modules-2/files-2.1/org.apache.flink/flink-core/1.15.0/41836e7311354a678c72284a81fde0d0c48ed905/flink-core-1.15.0.jar) to field java.lang.String.value
WARNING: Please consider reporting this to the maintainers of org.apache.flink.api.java.ClosureCleaner
WARNING: Use --illegal-access=warn to enable warnings of further illegal reflective access operations
WARNING: All illegal access operations will be denied in a future release
WARNING: An illegal reflective access operation has occurred
WARNING: Illegal reflective access by org.apache.flink.api.java.ClosureCleaner (file:/home/jenkins/.gradle/caches/modules-2/files-2.1/org.apache.flink/flink-core/1.15.0/41836e7311354a678c72284a81fde0d0c48ed905/flink-core-1.15.0.jar) to field java.lang.String.value
WARNING: Please consider reporting this to the maintainers of org.apache.flink.api.java.ClosureCleaner
WARNING: Use --illegal-access=warn to enable warnings of further illegal reflective access operations
WARNING: All illegal access operations will be denied in a future release
> Task :runners:flink:1.15:validatesRunnerBatchWithDataStream
org.apache.beam.sdk.transforms.ViewTest > testTriggeredLatestSingleton FAILED
org.apache.beam.sdk.Pipeline$PipelineExecutionException at ViewTest.java:330
Caused by: java.lang.IllegalArgumentException at PCollectionViews.java:412
294 tests completed, 1 failed, 1 skipped
> Task :runners:flink:1.15:validatesRunnerBatchWithDataStream FAILED
WARNING: An illegal reflective access operation has occurred
WARNING: Illegal reflective access by org.apache.flink.api.java.ClosureCleaner (file:/home/jenkins/.gradle/caches/modules-2/files-2.1/org.apache.flink/flink-core/1.15.0/41836e7311354a678c72284a81fde0d0c48ed905/flink-core-1.15.0.jar) to field java.lang.String.value
WARNING: Please consider reporting this to the maintainers of org.apache.flink.api.java.ClosureCleaner
WARNING: Use --illegal-access=warn to enable warnings of further illegal reflective access operations
WARNING: All illegal access operations will be denied in a future release
WARNING: An illegal reflective access operation has occurred
WARNING: Illegal reflective access by org.apache.flink.api.java.ClosureCleaner (file:/home/jenkins/.gradle/caches/modules-2/files-2.1/org.apache.flink/flink-core/1.15.0/41836e7311354a678c72284a81fde0d0c48ed905/flink-core-1.15.0.jar) to field java.lang.String.value
WARNING: Please consider reporting this to the maintainers of org.apache.flink.api.java.ClosureCleaner
WARNING: Use --illegal-access=warn to enable warnings of further illegal reflective access operations
WARNING: All illegal access operations will be denied in a future release
> Task :runners:flink:1.15:validatesRunnerStreaming
WARNING: An illegal reflective access operation has occurred
WARNING: Illegal reflective access by org.apache.flink.api.java.ClosureCleaner (file:/home/jenkins/.gradle/caches/modules-2/files-2.1/org.apache.flink/flink-core/1.15.0/41836e7311354a678c72284a81fde0d0c48ed905/flink-core-1.15.0.jar) to field java.lang.String.value
WARNING: Please consider reporting this to the maintainers of org.apache.flink.api.java.ClosureCleaner
WARNING: Use --illegal-access=warn to enable warnings of further illegal reflective access operations
WARNING: All illegal access operations will be denied in a future release
> Task :runners:flink:1.15:validatesRunnerStreamingCheckpointing
FAILURE: Build failed with an exception.
* What went wrong:
Execution failed for task ':runners:flink:1.15:validatesRunnerBatchWithDataStream'.
> There were failing tests. See the report at: file://<https://ci-beam.apache.org/job/beam_PostCommit_Java_ValidatesRunner_Flink_Java11/ws/src/runners/flink/1.15/build/reports/tests/validatesRunnerBatchWithDataStream/index.html>
Deprecated Gradle features were used in this build, making it incompatible with Gradle 9.0.
You can use '--warning-mode all' to show the individual deprecation warnings and determine if they come from your own scripts or plugins.
For more on this, please refer to https://docs.gradle.org/8.4/userguide/command_line_interface.html#sec:command_line_warnings in the Gradle documentation.
BUILD FAILED in 38m 17s
8 actionable tasks: 5 executed, 1 from cache, 2 up-to-date
Publishing build scan...
https://ge.apache.org/s/jxiqixj26kygs
Build step 'Invoke Gradle script' changed build result to FAILURE
Build step 'Invoke Gradle script' marked build as failure
---------------------------------------------------------------------
To unsubscribe, e-mail: builds-unsubscribe@beam.apache.org
For additional commands, e-mail: builds-help@beam.apache.org
Build failed in Jenkins: beam_PostCommit_Java_ValidatesRunner_Flink_Java11 #5192
Posted by Apache Jenkins Server <je...@builds.apache.org>.
See <https://ci-beam.apache.org/job/beam_PostCommit_Java_ValidatesRunner_Flink_Java11/5192/display/redirect>
Changes:
------------------------------------------
[...truncated 1.40 KB...]
> git fetch --no-tags --force --progress --depth=1 -- https://github.com/apache/beam.git +refs/heads/*:refs/remotes/origin/* +refs/pull/${ghprbPullId}/*:refs/remotes/origin/pr/${ghprbPullId}/* # timeout=10
> git rev-parse origin/master^{commit} # timeout=10
Checking out Revision b35fd2a5de072b70da6f69fc467e73927c835df4 (origin/master)
> git config core.sparsecheckout # timeout=10
> git checkout -f b35fd2a5de072b70da6f69fc467e73927c835df4 # timeout=10
Commit message: "Bump github.com/testcontainers/testcontainers-go in /sdks (#29158)"
> git rev-list --no-walk 38db0e58438456e26d4480d22819e592c4e9ccbe # timeout=10
First time build. Skipping changelog.
No emails were triggered.
[EnvInject] - Executing scripts and injecting environment variables after the SCM step.
[EnvInject] - Injecting as environment variables the properties content
SETUPTOOLS_USE_DISTUTILS=stdlib
SPARK_LOCAL_IP=127.0.0.1
[EnvInject] - Variables injected successfully.
[Gradle] - Launching build.
[src] $ <https://ci-beam.apache.org/job/beam_PostCommit_Java_ValidatesRunner_Flink_Java11/ws/src/gradlew> -Dorg.gradle.java.home=/usr/lib/jvm/java-8-openjdk-amd64 :runners:flink:1.15:jar :runners:flink:1.15:testJar
To honour the JVM settings for this build a single-use Daemon process will be forked. For more on this, please refer to https://docs.gradle.org/8.4/userguide/gradle_daemon.html#sec:disabling_the_daemon in the Gradle documentation.
Daemon will be stopped at the end of the build
Configuration on demand is an incubating feature.
Gradle Enterprise plugins resolution: https://plugins.gradle.org/m2
Enforcing Gradle Enterprise: https://ge.apache.org, allowUntrustedServer: false
> Task :buildSrc:compileJava NO-SOURCE
> Task :buildSrc:compileGroovy FROM-CACHE
> Task :buildSrc:pluginDescriptors
> Task :buildSrc:processResources
> Task :buildSrc:classes
> Task :buildSrc:jar
> Task :runners:java-job-service:createCheckerFrameworkManifest
> Task :sdks:java:harness:createCheckerFrameworkManifest
> Task :runners:core-construction-java:createCheckerFrameworkManifest
> Task :sdks:java:core:createCheckerFrameworkManifest
> Task :runners:core-java:createCheckerFrameworkManifest
> Task :runners:java-job-service:processResources NO-SOURCE
> Task :sdks:java:harness:processResources NO-SOURCE
> Task :runners:java-fn-execution:createCheckerFrameworkManifest
> Task :model:pipeline:createCheckerFrameworkManifest
> Task :runners:core-java:processResources NO-SOURCE
> Task :runners:core-construction-java:processResources NO-SOURCE
> Task :sdks:java:transform-service:launcher:createCheckerFrameworkManifest
> Task :sdks:java:extensions:avro:createCheckerFrameworkManifest
> Task :runners:core-java:processTestResources NO-SOURCE
> Task :model:fn-execution:createCheckerFrameworkManifest
> Task :runners:java-fn-execution:processResources NO-SOURCE
> Task :model:job-management:createCheckerFrameworkManifest
> Task :sdks:java:extensions:avro:generateAvroProtocol NO-SOURCE
> Task :sdks:java:fn-execution:createCheckerFrameworkManifest
> Task :sdks:java:build-tools:createCheckerFrameworkManifest
> Task :sdks:java:extensions:google-cloud-platform-core:createCheckerFrameworkManifest
> Task :sdks:java:expansion-service:createCheckerFrameworkManifest
> Task :sdks:java:extensions:avro:generateAvroJava NO-SOURCE
> Task :runners:flink:1.15:copySourceOverrides
> Task :sdks:java:fn-execution:processResources NO-SOURCE
> Task :sdks:java:expansion-service:processResources NO-SOURCE
> Task :sdks:java:extensions:avro:processResources NO-SOURCE
> Task :sdks:java:extensions:google-cloud-platform-core:processResources NO-SOURCE
> Task :model:fn-execution:extractProto
> Task :model:job-management:extractProto
> Task :sdks:java:io:google-cloud-platform:createCheckerFrameworkManifest
> Task :sdks:java:extensions:arrow:createCheckerFrameworkManifest
> Task :sdks:java:io:google-cloud-platform:processResources NO-SOURCE
> Task :sdks:java:extensions:protobuf:createCheckerFrameworkManifest
> Task :sdks:java:extensions:arrow:processResources NO-SOURCE
> Task :sdks:java:core:generateGrammarSource FROM-CACHE
> Task :runners:flink:1.15:createCheckerFrameworkManifest
> Task :runners:flink:1.15:copyResourcesOverrides NO-SOURCE
> Task :sdks:java:extensions:protobuf:extractProto
> Task :model:job-management:processResources
> Task :model:fn-execution:processResources
> Task :sdks:java:extensions:protobuf:processResources NO-SOURCE
> Task :runners:flink:1.15:processResources
> Task :runners:flink:1.15:copyTestSourceOverrides
> Task :runners:flink:1.15:copyTestResourcesOverrides NO-SOURCE
> Task :sdks:java:core:processResources
> Task :sdks:java:core:generateTestGrammarSource NO-SOURCE
> Task :runners:flink:1.15:processTestResources
> Task :sdks:java:core:processTestResources
> Task :sdks:java:transform-service:launcher:compileJava FROM-CACHE
> Task :sdks:java:build-tools:compileJava FROM-CACHE
> Task :sdks:java:transform-service:launcher:processResources
> Task :sdks:java:transform-service:launcher:classes
> Task :sdks:java:build-tools:processResources
> Task :sdks:java:build-tools:classes
> Task :sdks:java:transform-service:launcher:jar
> Task :sdks:java:build-tools:jar
> Task :sdks:java:transform-service:launcher:shadowJar FROM-CACHE
> Task :model:pipeline:extractIncludeProto
> Task :model:pipeline:extractProto
> Task :model:pipeline:generateProto FROM-CACHE
> Task :model:pipeline:compileJava FROM-CACHE
> Task :model:pipeline:processResources
> Task :model:pipeline:classes
> Task :model:pipeline:jar
> Task :model:pipeline:shadowJar FROM-CACHE
> Task :model:job-management:extractIncludeProto
> Task :model:fn-execution:extractIncludeProto
> Task :model:job-management:generateProto FROM-CACHE
> Task :model:fn-execution:generateProto FROM-CACHE
> Task :model:job-management:compileJava FROM-CACHE
> Task :model:job-management:classes
> Task :model:fn-execution:compileJava FROM-CACHE
> Task :model:fn-execution:classes
> Task :model:job-management:shadowJar FROM-CACHE
> Task :model:fn-execution:shadowJar FROM-CACHE
> Task :sdks:java:core:compileJava FROM-CACHE
> Task :sdks:java:core:classes
> Task :sdks:java:core:shadowJar FROM-CACHE
> Task :sdks:java:extensions:arrow:compileJava FROM-CACHE
> Task :sdks:java:extensions:arrow:classes UP-TO-DATE
> Task :sdks:java:extensions:protobuf:extractIncludeProto
> Task :sdks:java:extensions:arrow:jar
> Task :sdks:java:extensions:protobuf:generateProto NO-SOURCE
> Task :sdks:java:extensions:protobuf:compileJava FROM-CACHE
> Task :sdks:java:extensions:protobuf:classes UP-TO-DATE
> Task :sdks:java:extensions:avro:compileJava FROM-CACHE
> Task :sdks:java:extensions:avro:classes UP-TO-DATE
> Task :sdks:java:extensions:protobuf:jar
> Task :sdks:java:extensions:avro:jar
> Task :sdks:java:fn-execution:compileJava FROM-CACHE
> Task :sdks:java:fn-execution:classes UP-TO-DATE
> Task :sdks:java:fn-execution:jar
> Task :runners:core-construction-java:compileJava FROM-CACHE
> Task :runners:core-construction-java:classes UP-TO-DATE
> Task :runners:core-construction-java:jar
> Task :runners:core-java:compileJava FROM-CACHE
> Task :runners:core-java:classes UP-TO-DATE
> Task :runners:core-java:jar
> Task :sdks:java:extensions:google-cloud-platform-core:compileJava FROM-CACHE
> Task :sdks:java:extensions:google-cloud-platform-core:classes UP-TO-DATE
> Task :sdks:java:core:compileTestJava FROM-CACHE
> Task :sdks:java:core:testClasses
> Task :sdks:java:extensions:google-cloud-platform-core:jar
> Task :sdks:java:harness:compileJava FROM-CACHE
> Task :sdks:java:harness:classes UP-TO-DATE
> Task :sdks:java:harness:jar
> Task :sdks:java:core:shadowTestJar FROM-CACHE
> Task :runners:java-fn-execution:compileJava FROM-CACHE
> Task :runners:java-fn-execution:classes UP-TO-DATE
> Task :runners:java-fn-execution:jar
> Task :sdks:java:expansion-service:compileJava FROM-CACHE
> Task :sdks:java:expansion-service:classes UP-TO-DATE
> Task :sdks:java:expansion-service:jar
> Task :runners:java-job-service:compileJava FROM-CACHE
> Task :runners:java-job-service:classes UP-TO-DATE
> Task :runners:java-job-service:jar
> Task :runners:core-java:compileTestJava FROM-CACHE
> Task :runners:core-java:testClasses UP-TO-DATE
> Task :runners:flink:1.15:compileJava FROM-CACHE
> Task :runners:flink:1.15:classes
> Task :runners:core-java:testJar
> Task :runners:flink:1.15:jar
> Task :sdks:java:io:google-cloud-platform:compileJava FROM-CACHE
> Task :sdks:java:io:google-cloud-platform:classes UP-TO-DATE
> Task :sdks:java:io:google-cloud-platform:jar
> Task :runners:flink:1.15:compileTestJava FROM-CACHE
> Task :runners:flink:1.15:testClasses
> Task :runners:flink:1.15:testJar
Deprecated Gradle features were used in this build, making it incompatible with Gradle 9.0.
You can use '--warning-mode all' to show the individual deprecation warnings and determine if they come from your own scripts or plugins.
For more on this, please refer to https://docs.gradle.org/8.4/userguide/command_line_interface.html#sec:command_line_warnings in the Gradle documentation.
BUILD SUCCESSFUL in 23s
92 actionable tasks: 59 executed, 33 from cache
Publishing build scan...
https://ge.apache.org/s/ovwjz4qpnutli
Build step 'Invoke Gradle script' changed build result to SUCCESS
[Gradle] - Launching build.
[src] $ <https://ci-beam.apache.org/job/beam_PostCommit_Java_ValidatesRunner_Flink_Java11/ws/src/gradlew> -x shadowJar -x shadowTestJar -x compileJava -x compileTestJava -x jar -x testJar -x classes -x testClasses -Dorg.gradle.java.home=/usr/lib/jvm/java-11-openjdk-amd64 --continue --max-workers=12 -Dorg.gradle.jvmargs=-Xms2g -Dorg.gradle.jvmargs=-Xmx6g -Dorg.gradle.vfs.watch=false -Pdocker-pull-licenses :runners:flink:1.15:validatesRunner
To honour the JVM settings for this build a single-use Daemon process will be forked. For more on this, please refer to https://docs.gradle.org/8.4/userguide/gradle_daemon.html#sec:disabling_the_daemon in the Gradle documentation.
Daemon will be stopped at the end of the build
Configuration on demand is an incubating feature.
Gradle Enterprise plugins resolution: https://plugins.gradle.org/m2
Enforcing Gradle Enterprise: https://ge.apache.org, allowUntrustedServer: false
> Task :buildSrc:compileJava NO-SOURCE
> Task :buildSrc:compileGroovy FROM-CACHE
> Task :buildSrc:pluginDescriptors UP-TO-DATE
> Task :buildSrc:processResources UP-TO-DATE
> Task :buildSrc:classes UP-TO-DATE
> Task :buildSrc:jar
> Task :runners:flink:1.15:validatesRunnerBatch
WARNING: An illegal reflective access operation has occurred
WARNING: Illegal reflective access by org.apache.flink.api.java.ClosureCleaner (file:/home/jenkins/.gradle/caches/modules-2/files-2.1/org.apache.flink/flink-core/1.15.0/41836e7311354a678c72284a81fde0d0c48ed905/flink-core-1.15.0.jar) to field java.lang.String.value
WARNING: Please consider reporting this to the maintainers of org.apache.flink.api.java.ClosureCleaner
WARNING: Use --illegal-access=warn to enable warnings of further illegal reflective access operations
WARNING: All illegal access operations will be denied in a future release
WARNING: An illegal reflective access operation has occurred
WARNING: Illegal reflective access by org.apache.flink.api.java.ClosureCleaner (file:/home/jenkins/.gradle/caches/modules-2/files-2.1/org.apache.flink/flink-core/1.15.0/41836e7311354a678c72284a81fde0d0c48ed905/flink-core-1.15.0.jar) to field java.lang.String.value
WARNING: Please consider reporting this to the maintainers of org.apache.flink.api.java.ClosureCleaner
WARNING: Use --illegal-access=warn to enable warnings of further illegal reflective access operations
WARNING: All illegal access operations will be denied in a future release
WARNING: An illegal reflective access operation has occurred
WARNING: Illegal reflective access by org.apache.flink.api.java.ClosureCleaner (file:/home/jenkins/.gradle/caches/modules-2/files-2.1/org.apache.flink/flink-core/1.15.0/41836e7311354a678c72284a81fde0d0c48ed905/flink-core-1.15.0.jar) to field java.lang.String.value
WARNING: Please consider reporting this to the maintainers of org.apache.flink.api.java.ClosureCleaner
WARNING: Use --illegal-access=warn to enable warnings of further illegal reflective access operations
WARNING: All illegal access operations will be denied in a future release
> Task :runners:flink:1.15:validatesRunnerBatchWithDataStream
org.apache.beam.sdk.transforms.ViewTest > testTriggeredLatestSingleton FAILED
org.apache.beam.sdk.Pipeline$PipelineExecutionException at ViewTest.java:330
Caused by: java.lang.IllegalArgumentException at PCollectionViews.java:412
294 tests completed, 1 failed, 1 skipped
> Task :runners:flink:1.15:validatesRunnerBatchWithDataStream FAILED
WARNING: An illegal reflective access operation has occurred
WARNING: Illegal reflective access by org.apache.flink.api.java.ClosureCleaner (file:/home/jenkins/.gradle/caches/modules-2/files-2.1/org.apache.flink/flink-core/1.15.0/41836e7311354a678c72284a81fde0d0c48ed905/flink-core-1.15.0.jar) to field java.lang.String.value
WARNING: Please consider reporting this to the maintainers of org.apache.flink.api.java.ClosureCleaner
WARNING: Use --illegal-access=warn to enable warnings of further illegal reflective access operations
WARNING: All illegal access operations will be denied in a future release
WARNING: An illegal reflective access operation has occurred
WARNING: Illegal reflective access by org.apache.flink.api.java.ClosureCleaner (file:/home/jenkins/.gradle/caches/modules-2/files-2.1/org.apache.flink/flink-core/1.15.0/41836e7311354a678c72284a81fde0d0c48ed905/flink-core-1.15.0.jar) to field java.lang.String.value
WARNING: Please consider reporting this to the maintainers of org.apache.flink.api.java.ClosureCleaner
WARNING: Use --illegal-access=warn to enable warnings of further illegal reflective access operations
WARNING: All illegal access operations will be denied in a future release
> Task :runners:flink:1.15:validatesRunnerStreaming
WARNING: An illegal reflective access operation has occurred
WARNING: Illegal reflective access by org.apache.flink.api.java.ClosureCleaner (file:/home/jenkins/.gradle/caches/modules-2/files-2.1/org.apache.flink/flink-core/1.15.0/41836e7311354a678c72284a81fde0d0c48ed905/flink-core-1.15.0.jar) to field java.lang.String.value
WARNING: Please consider reporting this to the maintainers of org.apache.flink.api.java.ClosureCleaner
WARNING: Use --illegal-access=warn to enable warnings of further illegal reflective access operations
WARNING: All illegal access operations will be denied in a future release
> Task :runners:flink:1.15:validatesRunnerStreamingCheckpointing
FAILURE: Build failed with an exception.
* What went wrong:
Execution failed for task ':runners:flink:1.15:validatesRunnerBatchWithDataStream'.
> There were failing tests. See the report at: file://<https://ci-beam.apache.org/job/beam_PostCommit_Java_ValidatesRunner_Flink_Java11/ws/src/runners/flink/1.15/build/reports/tests/validatesRunnerBatchWithDataStream/index.html>
Deprecated Gradle features were used in this build, making it incompatible with Gradle 9.0.
You can use '--warning-mode all' to show the individual deprecation warnings and determine if they come from your own scripts or plugins.
For more on this, please refer to https://docs.gradle.org/8.4/userguide/command_line_interface.html#sec:command_line_warnings in the Gradle documentation.
BUILD FAILED in 37m 37s
8 actionable tasks: 5 executed, 1 from cache, 2 up-to-date
Publishing build scan...
https://ge.apache.org/s/pmjd7ykcvxene
Build step 'Invoke Gradle script' changed build result to FAILURE
Build step 'Invoke Gradle script' marked build as failure
---------------------------------------------------------------------
To unsubscribe, e-mail: builds-unsubscribe@beam.apache.org
For additional commands, e-mail: builds-help@beam.apache.org
Build failed in Jenkins: beam_PostCommit_Java_ValidatesRunner_Flink_Java11 #5191
Posted by Apache Jenkins Server <je...@builds.apache.org>.
See <https://ci-beam.apache.org/job/beam_PostCommit_Java_ValidatesRunner_Flink_Java11/5191/display/redirect?page=changes>
Changes:
[noreply] Merge pull request #29330: TPC-DS query processing should fail if output
------------------------------------------
[...truncated 3.17 KB...]
Gradle Enterprise plugins resolution: https://plugins.gradle.org/m2
Enforcing Gradle Enterprise: https://ge.apache.org, allowUntrustedServer: false
> Task :buildSrc:compileJava NO-SOURCE
> Task :buildSrc:compileGroovy FROM-CACHE
> Task :buildSrc:pluginDescriptors
> Task :buildSrc:processResources
> Task :buildSrc:classes
> Task :buildSrc:jar
> Task :sdks:java:harness:createCheckerFrameworkManifest
> Task :model:pipeline:createCheckerFrameworkManifest
> Task :sdks:java:fn-execution:createCheckerFrameworkManifest
> Task :sdks:java:extensions:avro:createCheckerFrameworkManifest
> Task :runners:java-job-service:createCheckerFrameworkManifest
> Task :runners:core-construction-java:createCheckerFrameworkManifest
> Task :runners:java-fn-execution:createCheckerFrameworkManifest
> Task :sdks:java:harness:processResources NO-SOURCE
> Task :sdks:java:fn-execution:processResources NO-SOURCE
> Task :sdks:java:core:createCheckerFrameworkManifest
> Task :sdks:java:expansion-service:createCheckerFrameworkManifest
> Task :model:fn-execution:createCheckerFrameworkManifest
> Task :runners:java-job-service:processResources NO-SOURCE
> Task :sdks:java:extensions:avro:generateAvroProtocol NO-SOURCE
> Task :runners:core-construction-java:processResources NO-SOURCE
> Task :sdks:java:transform-service:launcher:createCheckerFrameworkManifest
> Task :runners:java-fn-execution:processResources NO-SOURCE
> Task :sdks:java:expansion-service:processResources NO-SOURCE
> Task :model:job-management:createCheckerFrameworkManifest
> Task :sdks:java:build-tools:createCheckerFrameworkManifest
> Task :runners:core-java:createCheckerFrameworkManifest
> Task :sdks:java:extensions:avro:generateAvroJava NO-SOURCE
> Task :sdks:java:extensions:google-cloud-platform-core:createCheckerFrameworkManifest
> Task :sdks:java:extensions:google-cloud-platform-core:processResources NO-SOURCE
> Task :runners:core-java:processResources NO-SOURCE
> Task :sdks:java:extensions:avro:processResources NO-SOURCE
> Task :runners:core-java:processTestResources NO-SOURCE
> Task :runners:flink:1.15:copySourceOverrides
> Task :model:fn-execution:extractProto
> Task :model:job-management:extractProto
> Task :sdks:java:io:google-cloud-platform:createCheckerFrameworkManifest
> Task :sdks:java:extensions:protobuf:createCheckerFrameworkManifest
> Task :sdks:java:core:generateGrammarSource FROM-CACHE
> Task :sdks:java:io:google-cloud-platform:processResources NO-SOURCE
> Task :sdks:java:extensions:arrow:createCheckerFrameworkManifest
> Task :sdks:java:extensions:protobuf:extractProto
> Task :sdks:java:extensions:arrow:processResources NO-SOURCE
> Task :runners:flink:1.15:createCheckerFrameworkManifest
> Task :runners:flink:1.15:copyResourcesOverrides NO-SOURCE
> Task :sdks:java:extensions:protobuf:processResources NO-SOURCE
> Task :model:job-management:processResources
> Task :model:fn-execution:processResources
> Task :runners:flink:1.15:processResources
> Task :sdks:java:core:processResources
> Task :runners:flink:1.15:copyTestSourceOverrides
> Task :runners:flink:1.15:copyTestResourcesOverrides NO-SOURCE
> Task :sdks:java:core:generateTestGrammarSource NO-SOURCE
> Task :runners:flink:1.15:processTestResources
> Task :sdks:java:core:processTestResources
> Task :sdks:java:transform-service:launcher:compileJava FROM-CACHE
> Task :sdks:java:build-tools:compileJava FROM-CACHE
> Task :sdks:java:transform-service:launcher:processResources
> Task :sdks:java:transform-service:launcher:classes
> Task :sdks:java:build-tools:processResources
> Task :sdks:java:build-tools:classes
> Task :sdks:java:build-tools:jar
> Task :sdks:java:transform-service:launcher:jar
> Task :sdks:java:transform-service:launcher:shadowJar FROM-CACHE
> Task :model:pipeline:extractIncludeProto
> Task :model:pipeline:extractProto
> Task :model:pipeline:generateProto FROM-CACHE
> Task :model:pipeline:compileJava FROM-CACHE
> Task :model:pipeline:processResources
> Task :model:pipeline:classes
> Task :model:pipeline:jar
> Task :model:pipeline:shadowJar FROM-CACHE
> Task :model:fn-execution:extractIncludeProto
> Task :model:job-management:extractIncludeProto
> Task :model:job-management:generateProto FROM-CACHE
> Task :model:fn-execution:generateProto FROM-CACHE
> Task :model:job-management:compileJava FROM-CACHE
> Task :model:job-management:classes
> Task :model:fn-execution:compileJava FROM-CACHE
> Task :model:fn-execution:classes
> Task :model:job-management:shadowJar FROM-CACHE
> Task :model:fn-execution:shadowJar FROM-CACHE
> Task :sdks:java:core:compileJava FROM-CACHE
> Task :sdks:java:core:classes
> Task :sdks:java:core:shadowJar FROM-CACHE
> Task :sdks:java:extensions:protobuf:extractIncludeProto
> Task :sdks:java:extensions:protobuf:generateProto NO-SOURCE
> Task :sdks:java:extensions:avro:compileJava FROM-CACHE
> Task :sdks:java:extensions:avro:classes UP-TO-DATE
> Task :sdks:java:extensions:arrow:compileJava FROM-CACHE
> Task :sdks:java:extensions:arrow:classes UP-TO-DATE
> Task :sdks:java:extensions:protobuf:compileJava FROM-CACHE
> Task :sdks:java:extensions:protobuf:classes UP-TO-DATE
> Task :sdks:java:extensions:arrow:jar
> Task :sdks:java:fn-execution:compileJava FROM-CACHE
> Task :sdks:java:extensions:protobuf:jar
> Task :sdks:java:fn-execution:classes UP-TO-DATE
> Task :sdks:java:extensions:avro:jar
> Task :sdks:java:fn-execution:jar
> Task :runners:core-construction-java:compileJava FROM-CACHE
> Task :runners:core-construction-java:classes UP-TO-DATE
> Task :runners:core-construction-java:jar
> Task :runners:core-java:compileJava FROM-CACHE
> Task :runners:core-java:classes UP-TO-DATE
> Task :sdks:java:core:compileTestJava FROM-CACHE
> Task :sdks:java:core:testClasses
> Task :runners:core-java:jar
> Task :sdks:java:core:shadowTestJar FROM-CACHE
> Task :sdks:java:extensions:google-cloud-platform-core:compileJava FROM-CACHE
> Task :sdks:java:extensions:google-cloud-platform-core:classes UP-TO-DATE
> Task :sdks:java:extensions:google-cloud-platform-core:jar
> Task :sdks:java:harness:compileJava FROM-CACHE
> Task :sdks:java:harness:classes UP-TO-DATE
> Task :sdks:java:harness:jar
> Task :runners:core-java:compileTestJava FROM-CACHE
> Task :runners:core-java:testClasses UP-TO-DATE
> Task :runners:core-java:testJar
> Task :runners:java-fn-execution:compileJava FROM-CACHE
> Task :runners:java-fn-execution:classes UP-TO-DATE
> Task :runners:java-fn-execution:jar
> Task :sdks:java:expansion-service:compileJava FROM-CACHE
> Task :sdks:java:expansion-service:classes UP-TO-DATE
> Task :sdks:java:expansion-service:jar
> Task :runners:java-job-service:compileJava FROM-CACHE
> Task :runners:java-job-service:classes UP-TO-DATE
> Task :runners:java-job-service:jar
> Task :runners:flink:1.15:compileJava FROM-CACHE
> Task :runners:flink:1.15:classes
> Task :runners:flink:1.15:jar
> Task :sdks:java:io:google-cloud-platform:compileJava FROM-CACHE
> Task :sdks:java:io:google-cloud-platform:classes UP-TO-DATE
> Task :sdks:java:io:google-cloud-platform:jar
> Task :runners:flink:1.15:compileTestJava FROM-CACHE
> Task :runners:flink:1.15:testClasses
> Task :runners:flink:1.15:testJar
Deprecated Gradle features were used in this build, making it incompatible with Gradle 9.0.
You can use '--warning-mode all' to show the individual deprecation warnings and determine if they come from your own scripts or plugins.
For more on this, please refer to https://docs.gradle.org/8.4/userguide/command_line_interface.html#sec:command_line_warnings in the Gradle documentation.
BUILD SUCCESSFUL in 24s
92 actionable tasks: 59 executed, 33 from cache
Publishing build scan...
https://ge.apache.org/s/3vtserjpa64po
Build step 'Invoke Gradle script' changed build result to SUCCESS
[Gradle] - Launching build.
[src] $ <https://ci-beam.apache.org/job/beam_PostCommit_Java_ValidatesRunner_Flink_Java11/ws/src/gradlew> -x shadowJar -x shadowTestJar -x compileJava -x compileTestJava -x jar -x testJar -x classes -x testClasses -Dorg.gradle.java.home=/usr/lib/jvm/java-11-openjdk-amd64 --continue --max-workers=12 -Dorg.gradle.jvmargs=-Xms2g -Dorg.gradle.jvmargs=-Xmx6g -Dorg.gradle.vfs.watch=false -Pdocker-pull-licenses :runners:flink:1.15:validatesRunner
To honour the JVM settings for this build a single-use Daemon process will be forked. For more on this, please refer to https://docs.gradle.org/8.4/userguide/gradle_daemon.html#sec:disabling_the_daemon in the Gradle documentation.
Daemon will be stopped at the end of the build
Configuration on demand is an incubating feature.
Gradle Enterprise plugins resolution: https://plugins.gradle.org/m2
Enforcing Gradle Enterprise: https://ge.apache.org, allowUntrustedServer: false
> Task :buildSrc:compileJava NO-SOURCE
> Task :buildSrc:compileGroovy FROM-CACHE
> Task :buildSrc:pluginDescriptors UP-TO-DATE
> Task :buildSrc:processResources UP-TO-DATE
> Task :buildSrc:classes UP-TO-DATE
> Task :buildSrc:jar
> Task :runners:flink:1.15:validatesRunnerBatch
WARNING: An illegal reflective access operation has occurred
WARNING: Illegal reflective access by org.apache.flink.api.java.ClosureCleaner (file:/home/jenkins/.gradle/caches/modules-2/files-2.1/org.apache.flink/flink-core/1.15.0/41836e7311354a678c72284a81fde0d0c48ed905/flink-core-1.15.0.jar) to field java.lang.String.value
WARNING: Please consider reporting this to the maintainers of org.apache.flink.api.java.ClosureCleaner
WARNING: Use --illegal-access=warn to enable warnings of further illegal reflective access operations
WARNING: All illegal access operations will be denied in a future release
WARNING: An illegal reflective access operation has occurred
WARNING: Illegal reflective access by org.apache.flink.api.java.ClosureCleaner (file:/home/jenkins/.gradle/caches/modules-2/files-2.1/org.apache.flink/flink-core/1.15.0/41836e7311354a678c72284a81fde0d0c48ed905/flink-core-1.15.0.jar) to field java.lang.String.value
WARNING: Please consider reporting this to the maintainers of org.apache.flink.api.java.ClosureCleaner
WARNING: Use --illegal-access=warn to enable warnings of further illegal reflective access operations
WARNING: All illegal access operations will be denied in a future release
WARNING: An illegal reflective access operation has occurred
WARNING: Illegal reflective access by org.apache.flink.api.java.ClosureCleaner (file:/home/jenkins/.gradle/caches/modules-2/files-2.1/org.apache.flink/flink-core/1.15.0/41836e7311354a678c72284a81fde0d0c48ed905/flink-core-1.15.0.jar) to field java.lang.String.value
WARNING: Please consider reporting this to the maintainers of org.apache.flink.api.java.ClosureCleaner
WARNING: Use --illegal-access=warn to enable warnings of further illegal reflective access operations
WARNING: All illegal access operations will be denied in a future release
> Task :runners:flink:1.15:validatesRunnerBatchWithDataStream
org.apache.beam.sdk.transforms.ParDoLifecycleTest > testTeardownCalledAfterExceptionInStartBundleStateful FAILED
java.lang.AssertionError at Assert.java:89
org.apache.beam.sdk.transforms.ViewTest > testTriggeredLatestSingleton FAILED
org.apache.beam.sdk.Pipeline$PipelineExecutionException at ViewTest.java:330
Caused by: java.lang.IllegalArgumentException at PCollectionViews.java:412
294 tests completed, 2 failed, 1 skipped
> Task :runners:flink:1.15:validatesRunnerBatchWithDataStream FAILED
WARNING: An illegal reflective access operation has occurred
WARNING: Illegal reflective access by org.apache.flink.api.java.ClosureCleaner (file:/home/jenkins/.gradle/caches/modules-2/files-2.1/org.apache.flink/flink-core/1.15.0/41836e7311354a678c72284a81fde0d0c48ed905/flink-core-1.15.0.jar) to field java.lang.String.value
WARNING: Please consider reporting this to the maintainers of org.apache.flink.api.java.ClosureCleaner
WARNING: Use --illegal-access=warn to enable warnings of further illegal reflective access operations
WARNING: All illegal access operations will be denied in a future release
WARNING: An illegal reflective access operation has occurred
WARNING: Illegal reflective access by org.apache.flink.api.java.ClosureCleaner (file:/home/jenkins/.gradle/caches/modules-2/files-2.1/org.apache.flink/flink-core/1.15.0/41836e7311354a678c72284a81fde0d0c48ed905/flink-core-1.15.0.jar) to field java.lang.String.value
WARNING: Please consider reporting this to the maintainers of org.apache.flink.api.java.ClosureCleaner
WARNING: Use --illegal-access=warn to enable warnings of further illegal reflective access operations
WARNING: All illegal access operations will be denied in a future release
> Task :runners:flink:1.15:validatesRunnerStreaming
org.apache.beam.sdk.transforms.ParDoLifecycleTest > testTeardownCalledAfterExceptionInProcessElementStateful FAILED
java.lang.AssertionError at Assert.java:89
324 tests completed, 1 failed, 2 skipped
> Task :runners:flink:1.15:validatesRunnerStreaming FAILED
WARNING: An illegal reflective access operation has occurred
WARNING: Illegal reflective access by org.apache.flink.api.java.ClosureCleaner (file:/home/jenkins/.gradle/caches/modules-2/files-2.1/org.apache.flink/flink-core/1.15.0/41836e7311354a678c72284a81fde0d0c48ed905/flink-core-1.15.0.jar) to field java.lang.String.value
WARNING: Please consider reporting this to the maintainers of org.apache.flink.api.java.ClosureCleaner
WARNING: Use --illegal-access=warn to enable warnings of further illegal reflective access operations
WARNING: All illegal access operations will be denied in a future release
> Task :runners:flink:1.15:validatesRunnerStreamingCheckpointing
FAILURE: Build completed with 2 failures.
1: Task failed with an exception.
-----------
* What went wrong:
Execution failed for task ':runners:flink:1.15:validatesRunnerBatchWithDataStream'.
> There were failing tests. See the report at: file://<https://ci-beam.apache.org/job/beam_PostCommit_Java_ValidatesRunner_Flink_Java11/ws/src/runners/flink/1.15/build/reports/tests/validatesRunnerBatchWithDataStream/index.html>
==============================================================================
2: Task failed with an exception.
-----------
* What went wrong:
Execution failed for task ':runners:flink:1.15:validatesRunnerStreaming'.
> There were failing tests. See the report at: file://<https://ci-beam.apache.org/job/beam_PostCommit_Java_ValidatesRunner_Flink_Java11/ws/src/runners/flink/1.15/build/reports/tests/validatesRunnerStreaming/index.html>
==============================================================================
Deprecated Gradle features were used in this build, making it incompatible with Gradle 9.0.
You can use '--warning-mode all' to show the individual deprecation warnings and determine if they come from your own scripts or plugins.
For more on this, please refer to https://docs.gradle.org/8.4/userguide/command_line_interface.html#sec:command_line_warnings in the Gradle documentation.
BUILD FAILED in 38m 53s
8 actionable tasks: 5 executed, 1 from cache, 2 up-to-date
Publishing build scan...
https://ge.apache.org/s/yjag262bedt7g
Build step 'Invoke Gradle script' changed build result to FAILURE
Build step 'Invoke Gradle script' marked build as failure
---------------------------------------------------------------------
To unsubscribe, e-mail: builds-unsubscribe@beam.apache.org
For additional commands, e-mail: builds-help@beam.apache.org
Build failed in Jenkins: beam_PostCommit_Java_ValidatesRunner_Flink_Java11 #5190
Posted by Apache Jenkins Server <je...@builds.apache.org>.
See <https://ci-beam.apache.org/job/beam_PostCommit_Java_ValidatesRunner_Flink_Java11/5190/display/redirect>
Changes:
------------------------------------------
[...truncated 3.21 KB...]
Enforcing Gradle Enterprise: https://ge.apache.org, allowUntrustedServer: false
> Task :buildSrc:compileJava NO-SOURCE
> Task :buildSrc:compileGroovy FROM-CACHE
> Task :buildSrc:pluginDescriptors
> Task :buildSrc:processResources
> Task :buildSrc:classes
> Task :buildSrc:jar
> Task :sdks:java:expansion-service:createCheckerFrameworkManifest
> Task :sdks:java:transform-service:launcher:createCheckerFrameworkManifest
> Task :sdks:java:extensions:avro:createCheckerFrameworkManifest
> Task :sdks:java:fn-execution:createCheckerFrameworkManifest
> Task :runners:java-fn-execution:createCheckerFrameworkManifest
> Task :sdks:java:expansion-service:processResources NO-SOURCE
> Task :sdks:java:core:createCheckerFrameworkManifest
> Task :sdks:java:fn-execution:processResources NO-SOURCE
> Task :model:fn-execution:createCheckerFrameworkManifest
> Task :runners:core-construction-java:createCheckerFrameworkManifest
> Task :sdks:java:extensions:avro:generateAvroProtocol NO-SOURCE
> Task :runners:java-fn-execution:processResources NO-SOURCE
> Task :model:job-management:createCheckerFrameworkManifest
> Task :runners:core-java:createCheckerFrameworkManifest
> Task :model:pipeline:createCheckerFrameworkManifest
> Task :runners:core-construction-java:processResources NO-SOURCE
> Task :sdks:java:build-tools:createCheckerFrameworkManifest
> Task :sdks:java:extensions:avro:generateAvroJava NO-SOURCE
> Task :sdks:java:harness:createCheckerFrameworkManifest
> Task :sdks:java:extensions:google-cloud-platform-core:createCheckerFrameworkManifest
> Task :sdks:java:extensions:avro:processResources NO-SOURCE
> Task :runners:java-job-service:createCheckerFrameworkManifest
> Task :runners:core-java:processResources NO-SOURCE
> Task :sdks:java:harness:processResources NO-SOURCE
> Task :sdks:java:extensions:google-cloud-platform-core:processResources NO-SOURCE
> Task :runners:java-job-service:processResources NO-SOURCE
> Task :runners:core-java:processTestResources NO-SOURCE
> Task :runners:flink:1.15:copySourceOverrides
> Task :model:fn-execution:extractProto
> Task :model:job-management:extractProto
> Task :sdks:java:extensions:arrow:createCheckerFrameworkManifest
> Task :sdks:java:core:generateGrammarSource FROM-CACHE
> Task :sdks:java:extensions:protobuf:createCheckerFrameworkManifest
> Task :sdks:java:extensions:arrow:processResources NO-SOURCE
> Task :sdks:java:io:google-cloud-platform:createCheckerFrameworkManifest
> Task :runners:flink:1.15:createCheckerFrameworkManifest
> Task :sdks:java:io:google-cloud-platform:processResources NO-SOURCE
> Task :runners:flink:1.15:copyResourcesOverrides NO-SOURCE
> Task :model:job-management:processResources
> Task :sdks:java:extensions:protobuf:extractProto
> Task :runners:flink:1.15:processResources
> Task :model:fn-execution:processResources
> Task :sdks:java:extensions:protobuf:processResources NO-SOURCE
> Task :runners:flink:1.15:copyTestSourceOverrides
> Task :runners:flink:1.15:copyTestResourcesOverrides NO-SOURCE
> Task :runners:flink:1.15:processTestResources
> Task :sdks:java:core:processResources
> Task :sdks:java:core:generateTestGrammarSource NO-SOURCE
> Task :sdks:java:core:processTestResources
> Task :sdks:java:build-tools:compileJava FROM-CACHE
> Task :sdks:java:transform-service:launcher:compileJava FROM-CACHE
> Task :sdks:java:build-tools:processResources
> Task :sdks:java:build-tools:classes
> Task :sdks:java:transform-service:launcher:processResources
> Task :sdks:java:transform-service:launcher:classes
> Task :sdks:java:transform-service:launcher:jar
> Task :sdks:java:build-tools:jar
> Task :sdks:java:transform-service:launcher:shadowJar FROM-CACHE
> Task :model:pipeline:extractIncludeProto
> Task :model:pipeline:extractProto
> Task :model:pipeline:generateProto FROM-CACHE
> Task :model:pipeline:compileJava FROM-CACHE
> Task :model:pipeline:processResources
> Task :model:pipeline:classes
> Task :model:pipeline:jar
> Task :model:pipeline:shadowJar FROM-CACHE
> Task :model:job-management:extractIncludeProto
> Task :model:fn-execution:extractIncludeProto
> Task :model:job-management:generateProto FROM-CACHE
> Task :model:fn-execution:generateProto FROM-CACHE
> Task :model:job-management:compileJava FROM-CACHE
> Task :model:job-management:classes
> Task :model:fn-execution:compileJava FROM-CACHE
> Task :model:fn-execution:classes
> Task :model:job-management:shadowJar FROM-CACHE
> Task :model:fn-execution:shadowJar FROM-CACHE
> Task :sdks:java:core:compileJava FROM-CACHE
> Task :sdks:java:core:classes
> Task :sdks:java:core:shadowJar FROM-CACHE
> Task :sdks:java:extensions:protobuf:extractIncludeProto
> Task :sdks:java:extensions:protobuf:generateProto NO-SOURCE
> Task :sdks:java:extensions:arrow:compileJava FROM-CACHE
> Task :sdks:java:extensions:arrow:classes UP-TO-DATE
> Task :sdks:java:extensions:avro:compileJava FROM-CACHE
> Task :sdks:java:extensions:avro:classes UP-TO-DATE
> Task :sdks:java:extensions:arrow:jar
> Task :sdks:java:extensions:avro:jar
> Task :sdks:java:fn-execution:compileJava FROM-CACHE
> Task :sdks:java:fn-execution:classes UP-TO-DATE
> Task :sdks:java:fn-execution:jar
> Task :sdks:java:extensions:protobuf:compileJava FROM-CACHE
> Task :sdks:java:extensions:protobuf:classes UP-TO-DATE
> Task :runners:core-construction-java:compileJava FROM-CACHE
> Task :runners:core-construction-java:classes UP-TO-DATE
> Task :sdks:java:extensions:protobuf:jar
> Task :runners:core-construction-java:jar
> Task :runners:core-java:compileJava FROM-CACHE
> Task :runners:core-java:classes UP-TO-DATE
> Task :sdks:java:core:compileTestJava FROM-CACHE
> Task :sdks:java:core:testClasses
> Task :runners:core-java:jar
> Task :sdks:java:core:shadowTestJar FROM-CACHE
> Task :sdks:java:extensions:google-cloud-platform-core:compileJava FROM-CACHE
> Task :sdks:java:extensions:google-cloud-platform-core:classes UP-TO-DATE
> Task :sdks:java:extensions:google-cloud-platform-core:jar
> Task :sdks:java:harness:compileJava FROM-CACHE
> Task :sdks:java:harness:classes UP-TO-DATE
> Task :sdks:java:harness:jar
> Task :runners:core-java:compileTestJava FROM-CACHE
> Task :runners:core-java:testClasses UP-TO-DATE
> Task :runners:core-java:testJar
> Task :runners:java-fn-execution:compileJava FROM-CACHE
> Task :runners:java-fn-execution:classes UP-TO-DATE
> Task :runners:java-fn-execution:jar
> Task :sdks:java:expansion-service:compileJava FROM-CACHE
> Task :sdks:java:expansion-service:classes UP-TO-DATE
> Task :sdks:java:expansion-service:jar
> Task :runners:java-job-service:compileJava FROM-CACHE
> Task :runners:java-job-service:classes UP-TO-DATE
> Task :runners:java-job-service:jar
> Task :runners:flink:1.15:compileJava FROM-CACHE
> Task :runners:flink:1.15:classes
> Task :runners:flink:1.15:jar
> Task :sdks:java:io:google-cloud-platform:compileJava FROM-CACHE
> Task :sdks:java:io:google-cloud-platform:classes UP-TO-DATE
> Task :sdks:java:io:google-cloud-platform:jar
> Task :runners:flink:1.15:compileTestJava FROM-CACHE
> Task :runners:flink:1.15:testClasses
> Task :runners:flink:1.15:testJar
Deprecated Gradle features were used in this build, making it incompatible with Gradle 9.0.
You can use '--warning-mode all' to show the individual deprecation warnings and determine if they come from your own scripts or plugins.
For more on this, please refer to https://docs.gradle.org/8.4/userguide/command_line_interface.html#sec:command_line_warnings in the Gradle documentation.
BUILD SUCCESSFUL in 24s
92 actionable tasks: 59 executed, 33 from cache
Publishing build scan...
https://ge.apache.org/s/ohijyjzdbat7i
Build step 'Invoke Gradle script' changed build result to SUCCESS
[Gradle] - Launching build.
[src] $ <https://ci-beam.apache.org/job/beam_PostCommit_Java_ValidatesRunner_Flink_Java11/ws/src/gradlew> -x shadowJar -x shadowTestJar -x compileJava -x compileTestJava -x jar -x testJar -x classes -x testClasses -Dorg.gradle.java.home=/usr/lib/jvm/java-11-openjdk-amd64 --continue --max-workers=12 -Dorg.gradle.jvmargs=-Xms2g -Dorg.gradle.jvmargs=-Xmx6g -Dorg.gradle.vfs.watch=false -Pdocker-pull-licenses :runners:flink:1.15:validatesRunner
To honour the JVM settings for this build a single-use Daemon process will be forked. For more on this, please refer to https://docs.gradle.org/8.4/userguide/gradle_daemon.html#sec:disabling_the_daemon in the Gradle documentation.
Daemon will be stopped at the end of the build
Configuration on demand is an incubating feature.
Gradle Enterprise plugins resolution: https://plugins.gradle.org/m2
Enforcing Gradle Enterprise: https://ge.apache.org, allowUntrustedServer: false
> Task :buildSrc:compileJava NO-SOURCE
> Task :buildSrc:compileGroovy FROM-CACHE
> Task :buildSrc:pluginDescriptors UP-TO-DATE
> Task :buildSrc:processResources UP-TO-DATE
> Task :buildSrc:classes UP-TO-DATE
> Task :buildSrc:jar
> Task :runners:flink:1.15:validatesRunnerBatch
WARNING: An illegal reflective access operation has occurred
WARNING: Illegal reflective access by org.apache.flink.api.java.ClosureCleaner (file:/home/jenkins/.gradle/caches/modules-2/files-2.1/org.apache.flink/flink-core/1.15.0/41836e7311354a678c72284a81fde0d0c48ed905/flink-core-1.15.0.jar) to field java.lang.String.value
WARNING: Please consider reporting this to the maintainers of org.apache.flink.api.java.ClosureCleaner
WARNING: Use --illegal-access=warn to enable warnings of further illegal reflective access operations
WARNING: All illegal access operations will be denied in a future release
WARNING: An illegal reflective access operation has occurred
WARNING: Illegal reflective access by org.apache.flink.api.java.ClosureCleaner (file:/home/jenkins/.gradle/caches/modules-2/files-2.1/org.apache.flink/flink-core/1.15.0/41836e7311354a678c72284a81fde0d0c48ed905/flink-core-1.15.0.jar) to field java.lang.String.value
WARNING: Please consider reporting this to the maintainers of org.apache.flink.api.java.ClosureCleaner
WARNING: Use --illegal-access=warn to enable warnings of further illegal reflective access operations
WARNING: All illegal access operations will be denied in a future release
WARNING: An illegal reflective access operation has occurred
WARNING: Illegal reflective access by org.apache.flink.api.java.ClosureCleaner (file:/home/jenkins/.gradle/caches/modules-2/files-2.1/org.apache.flink/flink-core/1.15.0/41836e7311354a678c72284a81fde0d0c48ed905/flink-core-1.15.0.jar) to field java.lang.String.value
WARNING: Please consider reporting this to the maintainers of org.apache.flink.api.java.ClosureCleaner
WARNING: Use --illegal-access=warn to enable warnings of further illegal reflective access operations
WARNING: All illegal access operations will be denied in a future release
> Task :runners:flink:1.15:validatesRunnerBatchWithDataStream
org.apache.beam.sdk.transforms.ParDoLifecycleTest > testTeardownCalledAfterExceptionInProcessElementStateful FAILED
java.lang.AssertionError at Assert.java:89
org.apache.beam.sdk.transforms.ViewTest > testTriggeredLatestSingleton FAILED
org.apache.beam.sdk.Pipeline$PipelineExecutionException at ViewTest.java:330
Caused by: java.lang.IllegalArgumentException at PCollectionViews.java:412
294 tests completed, 2 failed, 1 skipped
> Task :runners:flink:1.15:validatesRunnerBatchWithDataStream FAILED
WARNING: An illegal reflective access operation has occurred
WARNING: Illegal reflective access by org.apache.flink.api.java.ClosureCleaner (file:/home/jenkins/.gradle/caches/modules-2/files-2.1/org.apache.flink/flink-core/1.15.0/41836e7311354a678c72284a81fde0d0c48ed905/flink-core-1.15.0.jar) to field java.lang.String.value
WARNING: Please consider reporting this to the maintainers of org.apache.flink.api.java.ClosureCleaner
WARNING: Use --illegal-access=warn to enable warnings of further illegal reflective access operations
WARNING: All illegal access operations will be denied in a future release
WARNING: An illegal reflective access operation has occurred
WARNING: Illegal reflective access by org.apache.flink.api.java.ClosureCleaner (file:/home/jenkins/.gradle/caches/modules-2/files-2.1/org.apache.flink/flink-core/1.15.0/41836e7311354a678c72284a81fde0d0c48ed905/flink-core-1.15.0.jar) to field java.lang.String.value
WARNING: Please consider reporting this to the maintainers of org.apache.flink.api.java.ClosureCleaner
WARNING: Use --illegal-access=warn to enable warnings of further illegal reflective access operations
WARNING: All illegal access operations will be denied in a future release
> Task :runners:flink:1.15:validatesRunnerStreaming
org.apache.beam.sdk.transforms.GroupByKeyTest > org.apache.beam.sdk.transforms.GroupByKeyTest$BasicTests.testAfterProcessingTimeContinuationTriggerUsingState FAILED
java.lang.AssertionError at GroupByKeyTest.java:302
Caused by: java.lang.AssertionError at MatcherAssert.java:18
324 tests completed, 1 failed, 2 skipped
> Task :runners:flink:1.15:validatesRunnerStreaming FAILED
WARNING: An illegal reflective access operation has occurred
WARNING: Illegal reflective access by org.apache.flink.api.java.ClosureCleaner (file:/home/jenkins/.gradle/caches/modules-2/files-2.1/org.apache.flink/flink-core/1.15.0/41836e7311354a678c72284a81fde0d0c48ed905/flink-core-1.15.0.jar) to field java.lang.String.value
WARNING: Please consider reporting this to the maintainers of org.apache.flink.api.java.ClosureCleaner
WARNING: Use --illegal-access=warn to enable warnings of further illegal reflective access operations
WARNING: All illegal access operations will be denied in a future release
> Task :runners:flink:1.15:validatesRunnerStreamingCheckpointing
FAILURE: Build completed with 2 failures.
1: Task failed with an exception.
-----------
* What went wrong:
Execution failed for task ':runners:flink:1.15:validatesRunnerBatchWithDataStream'.
> There were failing tests. See the report at: file://<https://ci-beam.apache.org/job/beam_PostCommit_Java_ValidatesRunner_Flink_Java11/ws/src/runners/flink/1.15/build/reports/tests/validatesRunnerBatchWithDataStream/index.html>
==============================================================================
2: Task failed with an exception.
-----------
* What went wrong:
Execution failed for task ':runners:flink:1.15:validatesRunnerStreaming'.
> There were failing tests. See the report at: file://<https://ci-beam.apache.org/job/beam_PostCommit_Java_ValidatesRunner_Flink_Java11/ws/src/runners/flink/1.15/build/reports/tests/validatesRunnerStreaming/index.html>
==============================================================================
Deprecated Gradle features were used in this build, making it incompatible with Gradle 9.0.
You can use '--warning-mode all' to show the individual deprecation warnings and determine if they come from your own scripts or plugins.
For more on this, please refer to https://docs.gradle.org/8.4/userguide/command_line_interface.html#sec:command_line_warnings in the Gradle documentation.
BUILD FAILED in 38m 11s
8 actionable tasks: 5 executed, 1 from cache, 2 up-to-date
Publishing build scan...
https://ge.apache.org/s/wopes4tdemdfq
Build step 'Invoke Gradle script' changed build result to FAILURE
Build step 'Invoke Gradle script' marked build as failure
---------------------------------------------------------------------
To unsubscribe, e-mail: builds-unsubscribe@beam.apache.org
For additional commands, e-mail: builds-help@beam.apache.org